{"text_format":"1","workbook":"xlsx","n_sheets":12,"sheets":["Landing_Gear","IV_Min_Max","NPIAS Arpts","Inflation","Geographic_Adj","ReportTemplate","ACCE ProjectList","CER_Summary","CER_Summary_low","CER_Summary_high","results_summary","ACCE"],"not_rendered":{"charts":0,"images":5,"macros":1,"external_links":3,"defined_names":28,"comments":5,"pivot_tables":0},"unopened":[],"bounds":{"document_bytes":16777216,"sheet_cells":100000,"rows_first":2000,"rows_last":500,"rows_between":2000,"halvings":0,"cell_chars":16384,"cell_head_chars":4096},"cells_cut":0,"cells_raw":0,"read":"whole","date_system":"1900"}

{"sheet":"Landing_Gear","index":0,"n_rows":6,"n_cols":4,"rows_kept":6,"cut":false,"hidden":true,"merged":[]}
[null,"Landing Gear","FAA","Empirical"]
["Code","Configuration","SW Equiv.","SW Equiv."]
["SW","Single wheel (SW)",1,1]
["DW","Dual wheel (DW)",1.3,1.6429]
["DTW","Dual tandem (DTW)",2,3.0267146700000001]
["DDTW","Double dual tandem (DDTW)",2.21,5.7658914463500004]

{"sheet":"IV_Min_Max","index":1,"n_rows":16,"n_cols":14,"rows_kept":16,"cut":false,"hidden":true,"merged":[]}
[]
[]
[]
[]
[]
[null,null,null,null,5,6,null,8,9]
["Project","Variable 1","Min","Max","Min_adj","Max_adj","Variable 2","Min_adj","Max_adj","Min","Max","Variable 3","Min","Max"]
["Construct or Rehabilitate Taxiway","Pavement Area (SF)",30000,648000,{"$f":"C8/1000","v":30},{"$f":"D8/1000","v":648},"Design Aircraft MTOW (lbs)",{"$f":"J8/1000","v":8},875,8000,875000,"Landing Gear Configuration",{"$f":"NA()","v":{"$error":"#N/A"}},{"$f":"NA()","v":{"$error":"#N/A"}}]
["Construct, Expand, or Rehabilitate Apron","Pavement Area (SF)",21250,1158300,{"$f":"C9/1000","v":21.25},{"$f":"D9/1000","v":1158.3},"Design Aircraft MTOW (lbs)",12.5,620,12500,620000,"Landing Gear Configuration",{"$f":"NA()","v":{"$error":"#N/A"}},{"$f":"NA()","v":{"$error":"#N/A"}}]
["Construct, Extend, or Rehabilitate Runway","Pavement Area (SF)",132120,1200300,132.12,{"$f":"D10/1000","v":1200.3},"Design Aircraft MTOW (lbs)",12,130,12000,130000,"Landing Gear Configuration",{"$f":"NA()","v":{"$error":"#N/A"}},{"$f":"NA()","v":{"$error":"#N/A"}}]
["Install Perimeter Fencing","Length (LF)",125,10330,{"$f":"C11/1000","v":0.125},{"$f":"D11/1000","v":10.33}]
["Install Airport Visual Aid (PAPI)","No. of Systems/Rwy Ends",1,2,{"$f":"C12","v":1},{"$f":"D12","v":2}]
["Install Weather Reporting Equipment",{"$f":"NA()","v":{"$error":"#N/A"}}]
["Construct Aircraft Rescue and Fire Fighting Facility","Combined Floor Area (SF)",2554,45000,{"$f":"C14/1000","v":2.5539999999999998},{"$f":"D14/1000","v":45},"No. of Stories",{"$f":"J14","v":1},{"$f":"K14","v":2},1,2]
["Construct Snow Removal Equipment Building","Combined Floor Area (SF)",1140,68000,{"$f":"C15/1000","v":1.1399999999999999},{"$f":"D15/1000","v":68}]
{"$rows_left_out":2}
{"sheet":"NPIAS Arpts","index":2,"n_rows":3357,"n_cols":18,"rows_kept":3357,"cut":false,"hidden":true,"merged":[]}
["APPENDIX A -  ALL NPIAS Airports (2013-2017)"]
["RO","ADO","ST","City","Airport","Locid","ST","Airport","NPIAS Number","Ownership","Hub","Role","Service\nLevel","Year 5\nService\nLevel","Current\nEnplanements","Current\nBased\nAircraft","2013 - 2017\nDevelopment\nCost","Airport added by user"]
["AL","AAL","AK","Adak Island","Adak","ADK","AK","Adak","02-0001","PU",null,"Basic","GA","GA",2097,0,0]
["AL","AAL","AK","Akhiok","Akhiok","AKK","AK","Akhiok","02-0002","PU",null,"Basic","GA","GA",1209,0,9842105]
["AL","AAL","AK","Akiachak","Akiachak","Z13","AK","Akiachak","02-0345","NA",null,"Local","CS","GA",2981,0,0]
["AL","AAL","AK","Akiak","Akiak","AKI","AK","Akiak","02-0004","PU",null,"Basic","GA","GA",1960,1,0]
["AL","AAL","AK","Akutan","Akutan (Proposed GA)","01D","AK","Akutan (Proposed GA)","02-0005",null,null,null,null,"GA",0,0,18539474]
["AL","AAL","AK","Akutan","Akutan","KQA","AK","Akutan","02-0346","PU",null,"Basic","GA","GA",1246,0,0]
["AL","AAL","AK","Alakanuk","Alakanuk (Proposed CM)","01F","AK","Alakanuk (Proposed CM)","02-0440",null,null,null,null,"CS",0,0,0]
["AL","AAL","AK","Alakanuk","Alakanuk","AUK","AK","Alakanuk","02-0332","PU",null,"Local","CS","CS",3213,0,0]
["AL","AAL","AK","Aleknagik","Aleknagik /New","5A8","AK","Aleknagik /New","02-0359","PU",null,"Basic","GA","GA",5,1,4736842]
["AL","AAL","AK","Allakaket","Allakaket","6A8","AK","Allakaket","02-0009","PU",null,"Basic","GA","GA",2482,0,0]
["AL","AAL","AK","Ambler","Ambler","AFM","AK","Ambler","02-0354","PU",null,"Basic","GA","GA",2110,0,11842106]
["AL","AAL","AK","Anaktuvuk Pass","Anaktuvuk Pass","AKP","AK","Anaktuvuk Pass","02-0012","PU",null,"Local","CS","CS",4031,0,2123684]
["AL","AAL","AK","Anchorage","Ted Stevens Anchorage International","ANC","AK","Ted Stevens Anchorage International","02-0016","PU","M",null,"P","P",2342310,150,150269095]
{"$rows_left_out":3343}
{"sheet":"Inflation","index":3,"n_rows":40,"n_cols":35,"rows_kept":40,"cut":false,"hidden":true,"merged":[]}
[null,"FY00","FY99","FY01","FY02","FY03","FY04","FY05","FY06","FY07","FY08","FY09","FY10","FY11","FY12","FY13","FY14","FY15","FY16","FY17","FY18","FY19","FY20","FY21","FY22","FY23","FY24","FY25","FY26","FY27","FY28","FY29","FY30","BEYOND","Total"]
["BY12",0.77760526315789469,0.76112280701754365,0.7951754385964912,0.80805263157894736,0.82543859649122797,0.84885964912280698,0.87719298245614041,0.90576315789473683,0.93170175438596481,0.95160526315789462,0.96295614035087695,0.97192982456140342,0.98421052631578931,1,1.0175438596491229,1.0342105263157895,1.0526315789473684,1.070175438596491,1.0903508771929822,1.1096491228070173,1.1298245614035087,1.1499999999999999,1.1706999999999999,1.1917726,1.2132245068,1.2350625479224,1.2572936737850031,1.2799249599131333,1.3029636091915697,1.3264169541570181,1.3502924593318444,1.3745977235998177,1.3993404826246145,"End"]
["BY13",0.7641982758620689,0.74799999999999978,0.78146551724137925,0.79412068965517235,0.81120689655172395,0.83422413793103445,0.86206896551724144,0.89014655172413781,0.91563793103448265,0.93519827586206883,0.94635344827586176,0.95517241379310336,0.9672413793103446,0.98275862068965514,1,1.0163793103448275,1.0344827586206895,1.0517241379310343,1.0715517241379307,1.0905172413793101,1.1103448275862069,1.1301724137931033,1.150515517241379,1.171224796551724,1.192306842889655,1.2137683660616689,1.2356161966507788,1.257857288190493,1.2804987193779218,1.3035476963267245,1.3270115548606056,1.3508977628480967]
[]
[null,"BY13","BY12"]
[1998,{"$f":"B7-(B8-B7)","v":0.73180172413793065}]
[1999,0.74799999999999978,0.76112280701754365]
[2000,0.7641982758620689,0.77760526315789469]
[2001,0.78146551724137925,0.7951754385964912]
[2002,0.79412068965517235,0.80805263157894736]
[2003,0.81120689655172395,0.82543859649122797]
[2004,0.83422413793103445,0.84885964912280698]
[2005,0.86206896551724144,0.87719298245614041]
[2006,0.89014655172413781,0.90576315789473683]
[2007,0.91563793103448265,0.93170175438596481]
{"$rows_left_out":26}
{"sheet":"Geographic_Adj","index":4,"n_rows":55,"n_cols":11,"rows_kept":55,"cut":false,"hidden":true,"merged":[]}
[null,"Economic Adjustment Factors by State"]
[null,"UFC 3-701-01, DoD Pricing Guide for 2011"]
[null,"Updated as Change 1, June 2011"]
[null,"Inside US",null,"Construction","Construction Rel. to KS"]
[1,"ALASKA","AK",1.78,1.89]
[2,"ALABAMA","AL",0.86,0.91]
[3,"ARKANSAS","AR",0.89,0.95]
[4,"ARIZONA","AZ",0.99,1.05,null,null,null,null,"Validate if state entered by user is correct format"]
[5,"CALIFORNIA","CA",1.21,1.29,null,null,null,null,"NH",{"$f":"IF(ISNA(VLOOKUP(J9,C5:C55,1,FALSE)),1,0)","v":0}]
[6,"COLORADO","CO",0.99,1.05]
[7,"CONNECTICUT","CT",1.1399999999999999,1.21]
[8,"WASHINGTON DC","DC",1,1.06]
[9,"DELAWARE","DE",1.06,1.1299999999999999]
[10,"FLORIDA","FL",0.85,0.9]
[11,"GEORGIA","GA",0.85,0.9]
{"$rows_left_out":41}
{"sheet":"ReportTemplate","index":5,"n_rows":20,"n_cols":7,"rows_kept":20,"cut":false,"hidden":true,"merged":[[20,0,21,1],[0,0,0,6],[5,3,5,6]]}
["Airport Capital Cost Estimation Tool: Report"]
[]
["Report Name"]
["Report Description"]
["Name of Preparer"]
["Organization",null,null,"Output "]
["Phone number",null,null,null,"Cost Estimate","Low Estimate","High Estimate"]
["Email",null,null,"FY2014$",564563456,564563456,564563456]
["Date Created",null,null,"FY2017",564563456,564563456,564563456]
[]
["FAA Airport ID",null,null,"Inflation factor"]
["State"]
["Airport Name"]
[]
["Project Type"]
{"$rows_left_out":6}
{"sheet":"ACCE ProjectList","index":6,"n_rows":14,"n_cols":9,"rows_kept":14,"cut":false,"hidden":true,"merged":[]}
[null,"Row number reference","number of inputs","Caption 1","unit1","Caption 2","unit2","input1","input2"]
["Aircraft Rescue and Fire Fighting (ARFF) Facility ",14,1,"Combined Floor Area","Sq. Ft.","No. of Floors","floors","Floor Area, K Sq. Ft.","number of floors"]
["Apron",9,2,"Pavement Area","Sq. Ft.","Design Aircraft MTOW","lbs.","Pavement Area, K Sq. Ft.","Adj. MTOW, K Lbs."]
["Automated Weather Observing System",13,0]
["Perimeter Fencing",11,1,"Length","Linear Ft.",null,null,"Fencing, K Linear Ft."]
["Precision Approach Path Indicator (PAPI)",12,1,"No. of Systems/Rwy Ends","units",null,null,"No. of systems installed"]
["Runway",10,2,"Pavement Area","Sq. Ft.","Design Aircraft MTOW","lbs.","Pavement Area, K Sq. Ft.","Adj. MTOW, K Lbs."]
["Snow Removal Equipment (SRE) Building ",15,1,"Combined Floor Area","Sq. Ft.",null,null,"Floor Area, K Sq. Ft."]
["Taxiway",8,2,"Pavement Area","Sq. Ft.","Design Aircraft MTOW","lbs.","Pavement Area, K Sq. Ft.","Adj. MTOW, K Lbs."]
[]
[]
[]
["user selected"]
["Taxiway",{"$f":"VLOOKUP(A14,A2:G9,2,FALSE)","v":8},{"$f":"VLOOKUP(A14,A2:G9,3,FALSE)","v":2},{"$f":"VLOOKUP(A14,A2:G9,4,FALSE)","v":"Pavement Area"},{"$f":"VLOOKUP(A14,A2:G9,5,FALSE)","v":"Sq. Ft."},{"$f":"VLOOKUP(A14,A2:G9,6,FALSE)","v":"Design Aircraft MTOW"},{"$f":"VLOOKUP(A14,A2:G9,7,FALSE)","v":"lbs."}]

{"sheet":"CER_Summary","index":7,"n_rows":26,"n_cols":20,"rows_kept":26,"cut":false,"hidden":true,"merged":[]}
["Airport Code",null,{"$f":"VLOOKUP(B1,'NPIAS Arpts'!F:R,13,FALSE)","v":{"$error":"#N/A"}},"user created?"]
["Anticipated Construction Year"]
["Project Description",null,null,null,null,null,null,null,null,null,null,null,{"$f":"B2","v":0},{"$f":"VLOOKUP(M3,Inflation!A6:B38,2,FALSE)","v":{"$error":"#N/A"}},"state adjustment",{"$f":"VLOOKUP(IF(ISNA(B20),C20,B20),Geographic_Adj!C5:E55,3,FALSE)","v":{"$error":"#N/A"}}]
["Project Type",null,null,null,null,null,null,null,null,null,null,null,2014,{"$f":"VLOOKUP(M4,Inflation!A6:B38,2,FALSE)","v":1.0163793103448275}]
["Landing Gear",null,{"$f":"VLOOKUP(B5,Landing_Gear!B1:D7,3,FALSE)","v":{"$error":"#N/A"}},null,null,null,null,null,null,null,null,null,"Adjustment",{"$f":"N3/N4","v":{"$error":"#N/A"}}]
[null,null,null,null,null,null,null,null,null,null,null,null,null,{"$f":"N5-1","v":{"$error":"#N/A"}}]
["Project","Ref.","Class","Coeff. 1","Op.","Coeff. 2","Op.","Independent Var. 1","Op.","Coeff. 3","Op.","Independent Var. 2","2014 Estimate","Current year Estimate","2014 state adj","state adj current year","Low Estimate","LE_1minus","High Estimate","HE_1plus"]
[{"$f":"'ACCE ProjectList'!A9","v":"Taxiway"},"H2","Horizontal",null,{"$f":"\"+\"","v":"+"},11.857166307017939,{"$f":"\"*\"","v":"*"},null,{"$f":"\"+\"","v":"+"},6.057156018041022,{"$f":"\"*\"","v":"*"},null,{"$f":"D8+(F8*H8)+(J8*L8)","v":0},{"$f":"M8*$N$5","v":{"$error":"#N/A"}},{"$f":"M8*$P$3*1000","v":{"$error":"#N/A"}},{"$f":"N8*$P$3*1000","v":{"$error":"#N/A"}},-0.24904942588112405,{"$f":"Q8+1","v":0.750950574118876},0.24904942588112405,{"$f":"S8+1","v":1.249049425881124}]
[{"$f":"'ACCE ProjectList'!A3","v":"Apron"},"H4","Horizontal",null,{"$f":"\"+\"","v":"+"},1.2123222890724352,"*",null,"+",12.192048359329158,{"$f":"\"*\"","v":"*"},null,{"$f":"D9+(F9*H9)+(J9*L9)","v":0},{"$f":"M9*$N$5","v":{"$error":"#N/A"}},{"$f":"ROUNDUP(M9*$P$3*1000,-3)","v":{"$error":"#N/A"}},{"$error":"#N/A"},-0.23224964624881789,{"$f":"Q9+1","v":0.76775035375118206},0.23224964624881789,{"$f":"S9+1","v":1.2322496462488179}]
[{"$f":"'ACCE ProjectList'!A7","v":"Runway"},"H5","Horizontal",null,"+",2.8746130060769901,"*",null,"+",35.417925431390806,"*",null,0,{"$error":"#N/A"},{"$error":"#N/A"},{"$error":"#N/A"},-0.25909458578592703,0.74090541421407297,0.25909458578592703,1.259094585785927]
[{"$f":"'ACCE ProjectList'!A5","v":"Perimeter Fencing"},"H6","Horizontal",null,"+",32.221943586149024,"*",null,"+",0,"*",null,0,{"$error":"#N/A"},{"$error":"#N/A"},{"$error":"#N/A"},-8.3577112779595522E-2,0.91642288722040444,8.3577112779595522E-2,1.0835771127795955]
[{"$f":"'ACCE ProjectList'!A6","v":"Precision Approach Path Indicator (PAPI)"},"H7","Horizontal",null,"+",83.141555457716407,"*",null,"+",0,"*",null,0,{"$error":"#N/A"},{"$error":"#N/A"},{"$error":"#N/A"},-0.18090322613184021,0.81909677386815982,0.18090322613184021,1.1809032261318402]
[{"$f":"'ACCE ProjectList'!A4","v":"Automated Weather Observing System"},"H10","Horizontal",171.72589116844355,"+",null,"*",null,"+",null,"*",null,{"$f":"D13+(F13*H13)+(J13*L13)","v":171.72589116844355},{"$error":"#N/A"},{"$error":"#N/A"},{"$error":"#N/A"},-0.10642734107731443,0.89357265892268556,0.10642734107731443,1.1064273410773144]
[{"$f":"'ACCE ProjectList'!A2","v":"Aircraft Rescue and Fire Fighting (ARFF) Facility "},"V1","Vertical",null,{"$f":"\"+\"","v":"+"},374.56383763541658,{"$f":"\"*\"","v":"*"},null,"+",null,{"$f":"\"*\"","v":"*"},null,0,{"$error":"#N/A"},{"$error":"#N/A"},{"$error":"#N/A"},-5.871474168751515E-2,0.94128525831248488,5.871474168751515E-2,1.0587147416875151]
[{"$f":"'ACCE ProjectList'!A8","v":"Snow Removal Equipment (SRE) Building "},"V3","Vertical",111.50479367295293,{"$f":"\"+\"","v":"+"},116.50649322312259,{"$f":"\"*\"","v":"*"},null,"+",null,{"$f":"\"*\"","v":"*"},null,{"$f":"D15+(F15*H15)+(J15*L15)","v":111.50479367295293},{"$error":"#N/A"},{"$error":"#N/A"},{"$error":"#N/A"},-6.4120207040611665E-2,0.93587979295938828,6.4120207040611665E-2,1.0641202070406117]
{"$rows_left_out":12}
{"sheet":"CER_Summary_low","index":8,"n_rows":21,"n_cols":16,"rows_kept":21,"cut":false,"hidden":true,"merged":[]}
["Airport Code",{"$f":"CER_Summary!B1","v":0}]
["Anticipated Construction Year",{"$f":"CER_Summary!B2","v":0}]
["Project Description",{"$f":"CER_Summary!B3","v":0},null,null,null,null,null,null,null,null,null,null,{"$f":"B2","v":0},{"$f":"VLOOKUP(M3,Inflation!A6:B38,2,FALSE)","v":{"$error":"#N/A"}},"state adjustment",{"$f":"CER_Summary!P3","v":{"$error":"#N/A"}}]
["Project Type",{"$f":"CER_Summary!B4","v":0},null,null,null,null,null,null,null,null,null,null,2014,{"$f":"VLOOKUP(M4,Inflation!A6:B38,2,FALSE)","v":1.0163793103448275}]
["Landing Gear",{"$f":"CER_Summary!B5","v":0},{"$f":"VLOOKUP(B5,Landing_Gear!B1:D7,2,FALSE)","v":{"$error":"#N/A"}},null,null,null,null,null,null,null,null,null,"Adjustment",{"$f":"N3/N4","v":{"$error":"#N/A"}}]
[]
["Project","Ref.","Class","Coeff. 1","Op.","Coeff. 2","Op.","Independent Var. 1","Op.","Coeff. 3","Op.","Independent Var. 2","2014 Estimate","Current year Estimate","2014 state adj","state adj current year"]
[{"$f":"CER_Summary!A8","v":"Taxiway"},"H2","Horizontal",null,{"$f":"\"+\"","v":"+"},{"$f":"CER_Summary!F8*CER_Summary!R8","v":8.904145845678114},{"$f":"\"*\"","v":"*"},{"$f":"CER_Summary!H8","v":0},{"$f":"\"+\"","v":"+"},{"$f":"CER_Summary!J8*CER_Summary!R8","v":4.5486247892755101},{"$f":"\"*\"","v":"*"},{"$f":"CER_Summary!L8","v":0},{"$f":"D8+(F8*H8)+(J8*L8)","v":0},{"$f":"M8*$N$5","v":{"$error":"#N/A"}},{"$f":"M8*$P$3*1000","v":{"$error":"#N/A"}},{"$f":"N8*$P$3*1000","v":{"$error":"#N/A"}}]
[{"$f":"CER_Summary!A9","v":"Apron"},"H4","Horizontal",null,{"$f":"\"+\"","v":"+"},{"$f":"CER_Summary!F9*CER_Summary!R9","v":0.9307608662958049},"*",{"$f":"CER_Summary!H9","v":0},"+",{"$f":"CER_Summary!J9*CER_Summary!R9","v":9.3604494408264802},"*",{"$f":"CER_Summary!L9","v":0},0,{"$f":"M9*$N$5","v":{"$error":"#N/A"}},{"$f":"ROUNDUP(M9*$P$3*1000,-3)","v":{"$error":"#N/A"}},{"$f":"ROUNDUP(N9*$P$3*1000,-3)","v":{"$error":"#N/A"}}]
[{"$f":"CER_Summary!A10","v":"Runway"},"H5","Horizontal",null,"+",{"$f":"CER_Summary!F10*CER_Summary!R10","v":2.129816339972634},"*",{"$f":"CER_Summary!H10","v":0},"+",{"$f":"CER_Summary!J10*CER_Summary!R10","v":26.241332712347756},"*",{"$f":"CER_Summary!L10","v":0},0,{"$error":"#N/A"},{"$error":"#N/A"},{"$error":"#N/A"}]
[{"$f":"CER_Summary!A11","v":"Perimeter Fencing"},"H6","Horizontal",null,"+",{"$f":"CER_Summary!F11*CER_Summary!R11","v":29.528926573071683},"*",{"$f":"CER_Summary!H11","v":0},"+",{"$f":"CER_Summary!J11*0.65865","v":0},"*",{"$f":"CER_Summary!L11","v":0},0,{"$error":"#N/A"},{"$error":"#N/A"},{"$error":"#N/A"}]
[{"$f":"CER_Summary!A12","v":"Precision Approach Path Indicator (PAPI)"},"H7","Horizontal",null,"+",{"$f":"CER_Summary!F12*CER_Summary!R12","v":68.100979849796204},"*",{"$f":"CER_Summary!H12","v":0},"+",{"$f":"CER_Summary!J12*0.65865","v":0},"*",{"$f":"CER_Summary!L12","v":0},0,{"$error":"#N/A"},{"$error":"#N/A"},{"$error":"#N/A"}]
[{"$f":"CER_Summary!A13","v":"Automated Weather Observing System"},"H10","Horizontal",{"$f":"CER_Summary!D13*CER_Summary!R13","v":153.44956117725383},"+",{"$f":"CER_Summary!F13*CER_Summary!R13","v":0},"*",{"$f":"CER_Summary!H13","v":0},"+",{"$f":"CER_Summary!J13*0.65865","v":0},"*",{"$f":"CER_Summary!L13","v":0},153.44956117725383,{"$error":"#N/A"},{"$error":"#N/A"},{"$error":"#N/A"}]
[{"$f":"CER_Summary!A14","v":"Aircraft Rescue and Fire Fighting (ARFF) Facility "},"V1","Vertical",{"$f":"CER_Summary!D14*0.65865","v":0},{"$f":"\"+\"","v":"+"},{"$f":"CER_Summary!F14*CER_Summary!R14","v":352.57141866316874},{"$f":"\"*\"","v":"*"},{"$f":"CER_Summary!H14","v":0},"+",{"$f":"CER_Summary!J14*0.65865","v":0},{"$f":"\"*\"","v":"*"},{"$f":"CER_Summary!L14","v":0},0,{"$error":"#N/A"},{"$error":"#N/A"},{"$error":"#N/A"}]
[{"$f":"CER_Summary!A15","v":"Snow Removal Equipment (SRE) Building "},"V3","Vertical",{"$f":"CER_Summary!D15*CER_Summary!R15","v":104.35508321662249},{"$f":"\"+\"","v":"+"},{"$f":"CER_Summary!F15*CER_Summary!R15","v":109.03607275608034},{"$f":"\"*\"","v":"*"},{"$f":"CER_Summary!H15","v":0},"+",{"$f":"CER_Summary!J15*0.65865","v":0},{"$f":"\"*\"","v":"*"},{"$f":"CER_Summary!L15","v":0},104.35508321662249,{"$error":"#N/A"},{"$error":"#N/A"},{"$error":"#N/A"}]
{"$rows_left_out":7}
{"sheet":"CER_Summary_high","index":9,"n_rows":21,"n_cols":16,"rows_kept":21,"cut":false,"hidden":true,"merged":[]}
["Airport Code",{"$f":"CER_Summary!B1","v":0},{"$f":"CER_Summary!C1","v":{"$error":"#N/A"}}]
["Anticipated Construction Year",{"$f":"CER_Summary!B2","v":0}]
["Project Description",{"$f":"CER_Summary!B3","v":0},null,null,null,null,null,null,null,null,null,null,{"$f":"B2","v":0},{"$f":"CER_Summary!N3","v":{"$error":"#N/A"}},"state adjustment",{"$f":"CER_Summary!P3","v":{"$error":"#N/A"}}]
["Project Type",{"$f":"CER_Summary!B4","v":0},null,null,null,null,null,null,null,null,null,null,2014,{"$f":"CER_Summary!N4","v":1.0163793103448275}]
["Landing Gear",{"$f":"CER_Summary!B5","v":0},{"$f":"CER_Summary!C5","v":{"$error":"#N/A"}},null,null,null,null,null,null,null,null,null,"Adjustment",{"$f":"N3/N4","v":{"$error":"#N/A"}}]
[]
["Project","Ref.","Class","Coeff. 1","Op.","Coeff. 2","Op.","Independent Var. 1","Op.","Coeff. 3","Op.","Independent Var. 2","2014 Estimate","Current year Estimate","2014 state adj","state adj current year"]
[{"$f":"CER_Summary!A8","v":"Taxiway"},"H2","Horizontal",null,"+",{"$f":"CER_Summary!F8*CER_Summary!T8","v":14.810186768357765},"*",{"$f":"CER_Summary!H8","v":0},"+",{"$f":"CER_Summary!J8*CER_Summary!T8","v":7.5656872468065339},"*",{"$f":"CER_Summary!L8","v":0},{"$f":"D8+(F8*H8)+(J8*L8)","v":0},{"$f":"M8*$N$5","v":{"$error":"#N/A"}},{"$f":"M8*$P$3*1000","v":{"$error":"#N/A"}},{"$f":"N8*$P$3*1000","v":{"$error":"#N/A"}}]
[{"$f":"CER_Summary!A9","v":"Apron"},"H4","Horizontal",null,"+",{"$f":"CER_Summary!F9*CER_Summary!T9","v":1.4938837118490655},"*",{"$f":"CER_Summary!H9","v":0},"+",{"$f":"CER_Summary!J9*CER_Summary!T9","v":15.023647277831836},"*",{"$f":"CER_Summary!L9","v":0},{"$f":"D9+(F9*H9)+(J9*L9)","v":0},{"$f":"M9*$N$5","v":{"$error":"#N/A"}},{"$f":"ROUNDUP(M9*$P$3*1000,-3)","v":{"$error":"#N/A"}},{"$f":"ROUNDUP(N9*$P$3*1000,-3)","v":{"$error":"#N/A"}}]
[{"$f":"CER_Summary!A10","v":"Runway"},"H5","Horizontal",null,"+",{"$f":"CER_Summary!F10*CER_Summary!T10","v":3.6194096721813462},"*",{"$f":"CER_Summary!H10","v":0},"+",{"$f":"CER_Summary!J10*CER_Summary!T10","v":44.594518150433856},"*",{"$f":"CER_Summary!L10","v":0},0,{"$error":"#N/A"},{"$error":"#N/A"},{"$error":"#N/A"}]
[{"$f":"CER_Summary!A11","v":"Perimeter Fencing"},"H6","Horizontal",null,"+",{"$f":"CER_Summary!F11*CER_Summary!T11","v":34.914960599226362},"*",{"$f":"CER_Summary!H11","v":0},"+",{"$f":"CER_Summary!J11*1.34135","v":0},"*",{"$f":"CER_Summary!L11","v":0},0,{"$error":"#N/A"},{"$error":"#N/A"},{"$error":"#N/A"}]
[{"$f":"CER_Summary!A12","v":"Precision Approach Path Indicator (PAPI)"},"H7","Horizontal",null,"+",{"$f":"CER_Summary!F12*CER_Summary!T12","v":98.182131065636611},"*",{"$f":"CER_Summary!H12","v":0},"+",{"$f":"CER_Summary!J12*1.34135","v":0},"*",{"$f":"CER_Summary!L12","v":0},0,{"$error":"#N/A"},{"$error":"#N/A"},{"$error":"#N/A"}]
[{"$f":"CER_Summary!A13","v":"Automated Weather Observing System"},"H10","Horizontal",{"$f":"CER_Summary!D13*CER_Summary!T13","v":190.00222115963328},"+",{"$f":"CER_Summary!F13*CER_Summary!T13","v":0},"*",{"$f":"CER_Summary!H13","v":0},"+",{"$f":"CER_Summary!J13*1.34135","v":0},"*",{"$f":"CER_Summary!L13","v":0},190.00222115963328,{"$error":"#N/A"},{"$error":"#N/A"},{"$error":"#N/A"}]
[{"$f":"CER_Summary!A14","v":"Aircraft Rescue and Fire Fighting (ARFF) Facility "},"V1","Vertical",{"$f":"CER_Summary!D14*1.34135","v":0},"+",{"$f":"CER_Summary!F14*CER_Summary!T14","v":396.55625660766441},"*",{"$f":"CER_Summary!H14","v":0},"+",{"$f":"CER_Summary!J14*1.34135","v":0},"*",{"$f":"CER_Summary!L14","v":0},0,{"$error":"#N/A"},{"$error":"#N/A"},{"$error":"#N/A"}]
[{"$f":"CER_Summary!A15","v":"Snow Removal Equipment (SRE) Building "},"V3","Vertical",{"$f":"CER_Summary!D15*CER_Summary!T15","v":118.65450412928337},"+",{"$f":"CER_Summary!F15*CER_Summary!T15","v":123.97691369016484},"*",{"$f":"CER_Summary!H15","v":0},"+",{"$f":"CER_Summary!J15*1.34135","v":0},"*",{"$f":"CER_Summary!L15","v":0},118.65450412928337,{"$error":"#N/A"},{"$error":"#N/A"},{"$error":"#N/A"}]
{"$rows_left_out":7}
{"sheet":"results_summary","index":10,"n_rows":9,"n_cols":9,"rows_kept":9,"cut":false,"hidden":true,"merged":[]}
[]
[null,null,null,null,null,null,"state adj current year"]
[null,null,{"$f":"VLOOKUP('ACCE ProjectList'!A14,CER_Summary!A8:P16,1,FALSE)","v":"Taxiway"},{"$f":"VLOOKUP('ACCE ProjectList'!A14,CER_Summary!$A$8:$P$16,15,FALSE)","v":{"$error":"#N/A"}},{"$f":"IF(D3<100000,MROUND(D3,1000),IF(D3>=1000000,MROUND(D3,100000),MROUND(D3,10000)))","v":{"$error":"#N/A"}},{"$f":"E3","v":{"$error":"#N/A"}},{"$f":"VLOOKUP('ACCE ProjectList'!A14,CER_Summary!$A$8:$P$16,16,FALSE)","v":{"$error":"#N/A"}},{"$f":"IF(G3<100000,MROUND(G3,1000),IF(G3>=1000000,MROUND(G3,100000),MROUND(G3,10000)))","v":{"$error":"#N/A"}},{"$f":"H3","v":{"$error":"#N/A"}}]
[null,null,"low",{"$f":"VLOOKUP('ACCE ProjectList'!A14,CER_Summary_low!$A$8:$P$16,15,FALSE)","v":{"$error":"#N/A"}},{"$f":"IF(D4<100000,MROUND(D4,1000),IF(D4>=1000000,MROUND(D4,100000),MROUND(D4,10000)))","v":{"$error":"#N/A"}},{"$f":"IF(E3=E4,IF(D4<100000,MROUND(D4,1000),IF(D4>=1000000,MROUND(D4,10000),MROUND(D4,1000))),IF(D4<100000,MROUND(D4,1000),IF(D4>=1000000,MROUND(D4,100000),MROUND(D4,10000))))","v":{"$error":"#N/A"}},{"$f":"VLOOKUP('ACCE ProjectList'!A14,CER_Summary_low!$A$8:$P$16,16,FALSE)","v":{"$error":"#N/A"}},{"$f":"IF(G4<100000,MROUND(G4,1000),IF(G4>=1000000,MROUND(G4,100000),MROUND(G4,10000)))","v":{"$error":"#N/A"}},{"$f":"IF(H3=H4,IF(G4<100000,MROUND(G4,1000),IF(G4>=1000000,MROUND(G4,10000),MROUND(G4,1000))),IF(G4<100000,MROUND(G4,1000),IF(G4>=1000000,MROUND(G4,100000),MROUND(G4,10000))))","v":{"$error":"#N/A"}}]
[null,null,"high",{"$f":"VLOOKUP('ACCE ProjectList'!A14,CER_Summary_high!$A$8:$P$16,15,FALSE)","v":{"$error":"#N/A"}},{"$error":"#N/A"},{"$f":"IF(E4=E5,IF(D5<100000,MROUND(D5,1000),IF(D5>=1000000,MROUND(D5,10000),MROUND(D5,1000))),IF(D5<100000,MROUND(D5,1000),IF(D5>=1000000,MROUND(D5,100000),MROUND(D5,10000))))","v":{"$error":"#N/A"}},{"$f":"VLOOKUP('ACCE ProjectList'!A14,CER_Summary_high!$A$8:$P$16,16,FALSE)","v":{"$error":"#N/A"}},{"$error":"#N/A"},{"$f":"IF(H4=H5,IF(G5<100000,MROUND(G5,1000),IF(G5>=1000000,MROUND(G5,10000),MROUND(G5,1000))),IF(G5<100000,MROUND(G5,1000),IF(G5>=1000000,MROUND(G5,100000),MROUND(G5,10000))))","v":{"$error":"#N/A"}}]
[]
[null,null,null,"cost estimate","low","high"]
[null,null,"2014 state adj",{"$f":"F3","v":{"$error":"#N/A"}},{"$f":"F4","v":{"$error":"#N/A"}},{"$f":"F5","v":{"$error":"#N/A"}}]
[null,null,"state adj current year",{"$f":"I3","v":{"$error":"#N/A"}},{"$f":"I4","v":{"$error":"#N/A"}},{"$f":"I5","v":{"$error":"#N/A"}}]

{"sheet":"ACCE","index":11,"n_rows":0,"n_cols":0,"rows_kept":0,"cut":false,"hidden":false,"merged":[]}