{"text_format":"1","workbook":"xlsx","n_sheets":9,"sheets":["ReadMe","UserInput","Input","Results","Profile","Ref","Crash","Capacity","Tables"],"not_rendered":{"charts":1,"images":6,"macros":1,"external_links":0,"defined_names":65,"comments":1,"pivot_tables":0},"unopened":[],"bounds":{"document_bytes":16777216,"sheet_cells":100000,"rows_first":2000,"rows_last":500,"rows_between":2000,"halvings":0,"cell_chars":16384,"cell_head_chars":4096},"cells_cut":0,"cells_raw":0,"read":"whole","date_system":"1900"}

{"sheet":"ReadMe","index":0,"n_rows":20,"n_cols":3,"rows_kept":20,"cut":false,"hidden":false,"merged":[[16,1,16,2],[19,1,19,2],[1,1,5,2],[13,1,13,2]]}
[]
[null,"Reliability Analysis of Horizontal Sightline Obstructions along Horizontal Curves"]
[]
[]
[]
[]
[]
[null,"Worksheet Name","Description"]
[null,"UserInput","Data entry, display of results"]
[null,"Profile","View ASSD at fixed intervals for each lane of travel"]
[null,"Crash","View intermediate calculations"]
[null,"Capacity","View intermediate calculations"]
[]
[null,"This tool calculates available sight distance on roadways where a horizontal sightline obstruction is present. This tool also conducts a reliability analysis to estimate the total number of vehicles per year that may encounter limited sight distance when a stopped vehicle is obstructed from view."]
[]
[null,"Instructions"]
[null,"All data entry is performed in the \"UserInput\" worksheet. When all necessary data is entered, click the \"Calculate\" button located on the \"UserInput\" worksheet. Execution time may range anywhere from a second to a minute depending on the complexity of the site being analyzed. The results are shown in the \"UserInput\" worksheet. A detailed users manual is available in Appendix _ of the NCHRP Project 15-59 Final Report."]
[]
[null,"Acknowledgements"]
[null,"This tool was developed by MRIGlobal and The Larson Institute at Penn State as part of NCHRP Project 15-59, \"Horizontal Sightline Offset Design Criteria, Exceptions, and Mitigation Strategies.\" The final report of NCHRP Project 15-59 documents the development of this tool."]

{"sheet":"UserInput","index":1,"n_rows":92,"n_cols":15,"rows_kept":92,"cut":false,"hidden":false,"merged":[[78,2,78,6],[83,2,83,6],[88,2,88,6],[66,1,66,8],[30,12,32,15],[54,1,55,2],[73,2,73,6],[37,4,37,14],[42,1,42,2],[36,1,36,14],[38,5,38,6],[38,7,38,8],[38,9,38,10],[38,11,38,12],[38,13,38,14],[8,4,8,8],[9,4,9,8],[11,4,11,6],[11,7,11,8],[5,1,5,2],[6,4,6,8],[7,4,7,8],[10,4,10,8],[11,9,11,12],[49,1,51,2],[67,3,67,8],[34,4,34,8],[33,4,33,8],[32,4,32,8],[30,9,31,9],[30,10,31,10],[31,1,31,8],[12,2,13,3],[14,2,14,3],[16,1,16,2],[25,1,25,2]]}
[]
[]
[]
[]
[null,"INPUT DATA"]
[null,"Facility Type",null,null,"RESULTS",null,null,null,null,"Lane 1",{"$f":"IF($C$8>1,\"Lane 2\",\"\")","v":"Lane 2"},{"$f":"IF($C$8>2,\"Lane 3\",\"\")","v":"Lane 3"},{"$f":"IF($C$8>3,\"Lane 4\",\"\")","v":"Lane 4"},"Total"]
[null,"Urban freeway (8 lanes)",{"$f":"IF(B7=\"Rural two-lane highway\",1,IF(B7=\"Rural four-lane undivided highway\",2,IF(B7=\"Rural four-lane divided highway\",3,IF(B7=\"Rural freeway (4 lanes)\",4,IF(B7=\"Rural freeway (6 lanes)\",5,IF(B7=\"Urban freeway (4 lanes)\",6,IF(B7=\"Urban freeway (6 lanes)\",7,IF(B7=\"Urban freeway (8 lanes)\",8,IF(B7=\"Rural one-lane entrance ramp\",9,IF(B7=\"Rural one-lane exit ramp\",10,IF(B7=\"Urban one-lane entrance ramp\",11,IF(B7=\"Urban one-lane exit ramp\",12,IF(B7=\"Urban two-lane entrance ramp\",13,IF(B7=\"Urban two-lane exit ramp\",14,0))))))))))))))","v":8},null,"Minimum available sight distance (ft)",null,null,null,null,379.72675788817207,539.5139177755317,663.81546260066239,770.01419469659345]
[null,"Number of lanes in analysis direction",{"$f":"VLOOKUP(C7,Ref!D102:E115,2)","v":4},null,"Length of sight-restricted roadway (mi)",null,null,null,null,0.34090909090909088,0.28409090909090912,0.20833333333333331,0]
[null,"Average lane width (ft)",12,null,"Total Number of potentially affected vehs per yr ",null,null,null,null,{"$f":"Crash!$C$26+Capacity!$C$33","v":509.00765637077848},{"$f":"IF($C$8>1,Crash!$C$27+Capacity!$C$34,\"\")","v":428.13497214074596},{"$f":"IF($C$8>2,Crash!$C$28+Capacity!$C$35,\"\")","v":317.8395286201976},{"$f":"IF($C$8>3,Crash!$C$29+Capacity!$C$36,\"\")","v":0},{"$f":"SUM(J9:M9)","v":1254.982157131722}]
[null,"AADT (one direction, veh/d)",50000,null,"Total number of vehicles passing site per year",null,null,null,null,{"$f":"$C$10*$C$44*365","v":4562500},{"$f":"IF($C$8>1,$C$10*$C$45*365,\"\")","v":4562500},{"$f":"IF($C$8>2,$C$10*$C$46*365,\"\")","v":4562500},{"$f":"IF($C$8>3,$C$10*$C$47*365,\"\")","v":4562500},{"$f":"SUM(J10:M10)","v":18250000}]
[null,null,null,null,"Percent potentially affected",null,null,null,null,{"$f":"J9/J10","v":1.1156332194428021E-4},{"$f":"IF($C$8>1,K9/K10,\"\")","v":9.3837802113040216E-5},{"$f":"IF($C$8>2,L9/L10,\"\")","v":6.966345832771454E-5},{"$f":"IF($C$8>3,M9/M10,\"\")","v":0},{"$f":"N9/N10","v":6.8766145596258735E-5}]
[null,null,null,null,"Time and date of last analysis",null,null,"2018-10-22T16:32:38",null,"AASHTO design stopping sight distance (ft)",null,null,null,{"$f":"Ref!P105","v":682}]
[null,null,"Direction of Curve"]
[]
[null,null,"To the left"]
[]
[null,"Horizontal Curve and Obstruction Data Input"]
[null,"Curve Radius, R (ft)",1500]
[null,"Curve Length, L (mi)",0.3]
[null,"Design or Operating Speed (mi/h)",65]
[null,"Longitudinal distance from PC to beginning of continuous obstruction, B1 (mi)",-0.1]
[null,"Longitudinal distance from PC to end of continuous obstruction, B2 (mi)",0.4]
[null,"Offset from edge of traveled way to sight obstruction, m (ft)",6]
[null,"Height of obstruction above edge of traveled way (ft)",4]
[]
[null,"Profile Data"]
[null,"Roadway grade (%)",-3]
[null,null,3]
[null,null,-0.1]
[null,null,0.2]
[null,null,null,null,null,null,null,null,null,"AASHTO values","Alternative values",null,"NOTE: B, B1, and B2 should be entered as negative values if they occur prior to the PC"]
[null,"Advanced Options"]
[null,"Analysis increment, x (ft)",50,null,"Eye height (ft)",null,null,null,null,3.5,3.5]
[null,null,null,null,"Object in road height (ft)",null,null,null,null,2,3.5]
[null,null,null,null,"Distance from left edge of lane to driver (ft)",null,null,null,null,{"$f":"C9/2","v":6},6]
[]
[null,"Traffic Data"]
[null,"Percentage of traffic in peak hour (k-max)",0.08,null,"k-factor distributions"]
[null,null,null,null,null,"k-max = 0.08",null,"k-max = 0.09",null,"k-max = 0.10",null,"k-max = 0.11",null,"k-max = 0.12"]
[null,null,null,null,"Hour","Default","Custom","Default","Custom","Default","Custom","Default","Custom","Default","Custom"]
[null,null,null,null,1,{"$f":"VLOOKUP(E41,Ref!$B$117:$P$141,1+UserInput!$C$7)","v":1.0200000000000001E-2},null,{"$f":"VLOOKUP(E41,Ref!$B$144:$P$168,1+UserInput!$C$7)","v":9.7000000000000003E-3},null,{"$f":"VLOOKUP(E41,Ref!$B$172:$P$195,1+UserInput!$C$7)","v":9.2999999999999992E-3},null,{"$f":"VLOOKUP(E41,Ref!$B$199:$P$222,1+UserInput!$C$7)","v":8.8000000000000005E-3},null,{"$f":"VLOOKUP(E41,Ref!$B$226:$P$249,1+UserInput!$C$7)","v":8.3999999999999995E-3}]
[null,null,null,null,2,{"$f":"VLOOKUP(E42,Ref!$B$117:$P$141,1+UserInput!$C$7)","v":7.3000000000000001E-3},null,{"$f":"VLOOKUP(E42,Ref!$B$144:$P$168,1+UserInput!$C$7)","v":6.7999999999999996E-3},null,{"$f":"VLOOKUP(E42,Ref!$B$172:$P$195,1+UserInput!$C$7)","v":6.4000000000000003E-3},null,{"$f":"VLOOKUP(E42,Ref!$B$199:$P$222,1+UserInput!$C$7)","v":5.8999999999999999E-3},null,{"$f":"VLOOKUP(E42,Ref!$B$226:$P$249,1+UserInput!$C$7)","v":5.4999999999999997E-3}]
[null,"Lane Utilization (%)",null,null,3,{"$f":"VLOOKUP(E43,Ref!$B$117:$P$141,1+UserInput!$C$7)","v":6.7000000000000002E-3},null,{"$f":"VLOOKUP(E43,Ref!$B$144:$P$168,1+UserInput!$C$7)","v":6.1999999999999998E-3},null,{"$f":"VLOOKUP(E43,Ref!$B$172:$P$195,1+UserInput!$C$7)","v":5.7999999999999996E-3},null,{"$f":"VLOOKUP(E43,Ref!$B$199:$P$222,1+UserInput!$C$7)","v":5.3E-3},null,{"$f":"VLOOKUP(E43,Ref!$B$226:$P$249,1+UserInput!$C$7)","v":4.8999999999999998E-3}]
[null,"Lane 1 (closest to obstruction)",0.25,null,4,{"$f":"VLOOKUP(E44,Ref!$B$117:$P$141,1+UserInput!$C$7)","v":7.7999999999999996E-3},null,{"$f":"VLOOKUP(E44,Ref!$B$144:$P$168,1+UserInput!$C$7)","v":7.3000000000000001E-3},null,{"$f":"VLOOKUP(E44,Ref!$B$172:$P$195,1+UserInput!$C$7)","v":6.8999999999999999E-3},null,{"$f":"VLOOKUP(E44,Ref!$B$199:$P$222,1+UserInput!$C$7)","v":6.4000000000000003E-3},null,{"$f":"VLOOKUP(E44,Ref!$B$226:$P$249,1+UserInput!$C$7)","v":6.0000000000000001E-3}]
[null,{"$f":"IF($C$8>1,\"Lane 2\",\"\")","v":"Lane 2"},0.25,null,5,{"$f":"VLOOKUP(E45,Ref!$B$117:$P$141,1+UserInput!$C$7)","v":1.21E-2},null,{"$f":"VLOOKUP(E45,Ref!$B$144:$P$168,1+UserInput!$C$7)","v":1.1599999999999999E-2},null,{"$f":"VLOOKUP(E45,Ref!$B$172:$P$195,1+UserInput!$C$7)","v":1.12E-2},null,{"$f":"VLOOKUP(E45,Ref!$B$199:$P$222,1+UserInput!$C$7)","v":1.0699999999999999E-2},null,{"$f":"VLOOKUP(E45,Ref!$B$226:$P$249,1+UserInput!$C$7)","v":1.03E-2}]
[null,{"$f":"IF($C$8>2,\"Lane 3\",\"\")","v":"Lane 3"},0.25,null,6,{"$f":"VLOOKUP(E46,Ref!$B$117:$P$141,1+UserInput!$C$7)","v":2.5700000000000001E-2},null,{"$f":"VLOOKUP(E46,Ref!$B$144:$P$168,1+UserInput!$C$7)","v":2.52E-2},null,{"$f":"VLOOKUP(E46,Ref!$B$172:$P$195,1+UserInput!$C$7)","v":2.4799999999999999E-2},null,{"$f":"VLOOKUP(E46,Ref!$B$199:$P$222,1+UserInput!$C$7)","v":2.4299999999999999E-2},null,{"$f":"VLOOKUP(E46,Ref!$B$226:$P$249,1+UserInput!$C$7)","v":2.3900000000000001E-2}]
[null,{"$f":"IF($C$8>3,\"Lane 4\",\"\")","v":"Lane 4"},0.25,null,7,{"$f":"VLOOKUP(E47,Ref!$B$117:$P$141,1+UserInput!$C$7)","v":5.1299999999999998E-2},null,{"$f":"VLOOKUP(E47,Ref!$B$144:$P$168,1+UserInput!$C$7)","v":5.0799999999999998E-2},null,{"$f":"VLOOKUP(E47,Ref!$B$172:$P$195,1+UserInput!$C$7)","v":5.04E-2},null,{"$f":"VLOOKUP(E47,Ref!$B$199:$P$222,1+UserInput!$C$7)","v":4.99E-2},null,{"$f":"VLOOKUP(E47,Ref!$B$226:$P$249,1+UserInput!$C$7)","v":4.9500000000000002E-2}]
[null,{"$f":"IF($C$8>4,\"Lane 5\",\"\")","v":""},0,null,8,{"$f":"VLOOKUP(E48,Ref!$B$117:$P$141,1+UserInput!$C$7)","v":6.8199999999999997E-2},null,{"$f":"VLOOKUP(E48,Ref!$B$144:$P$168,1+UserInput!$C$7)","v":6.7699999999999996E-2},null,{"$f":"VLOOKUP(E48,Ref!$B$172:$P$195,1+UserInput!$C$7)","v":6.7299999999999999E-2},null,{"$f":"VLOOKUP(E48,Ref!$B$199:$P$222,1+UserInput!$C$7)","v":6.6799999999999998E-2},null,{"$f":"VLOOKUP(E48,Ref!$B$226:$P$249,1+UserInput!$C$7)","v":6.6400000000000001E-2}]
[null,null,null,null,9,{"$f":"VLOOKUP(E49,Ref!$B$117:$P$141,1+UserInput!$C$7)","v":6.13E-2},null,{"$f":"VLOOKUP(E49,Ref!$B$144:$P$168,1+UserInput!$C$7)","v":6.08E-2},null,{"$f":"VLOOKUP(E49,Ref!$B$172:$P$195,1+UserInput!$C$7)","v":6.0400000000000002E-2},null,{"$f":"VLOOKUP(E49,Ref!$B$199:$P$222,1+UserInput!$C$7)","v":5.9900000000000002E-2},null,{"$f":"VLOOKUP(E49,Ref!$B$226:$P$249,1+UserInput!$C$7)","v":5.9499999999999997E-2}]
[null,{"$f":"IF(SUM(C44:C48)=1,\"\",\"Lane utilization values must sum to 100%\")","v":""},null,null,10,{"$f":"VLOOKUP(E50,Ref!$B$117:$P$141,1+UserInput!$C$7)","v":5.2200000000000003E-2},null,{"$f":"VLOOKUP(E50,Ref!$B$144:$P$168,1+UserInput!$C$7)","v":5.1700000000000003E-2},null,{"$f":"VLOOKUP(E50,Ref!$B$172:$P$195,1+UserInput!$C$7)","v":5.1299999999999998E-2},null,{"$f":"VLOOKUP(E50,Ref!$B$199:$P$222,1+UserInput!$C$7)","v":5.0799999999999998E-2},null,{"$f":"VLOOKUP(E50,Ref!$B$226:$P$249,1+UserInput!$C$7)","v":5.04E-2}]
[null,null,null,null,11,{"$f":"VLOOKUP(E51,Ref!$B$117:$P$141,1+UserInput!$C$7)","v":4.99E-2},null,{"$f":"VLOOKUP(E51,Ref!$B$144:$P$168,1+UserInput!$C$7)","v":4.9399999999999999E-2},null,{"$f":"VLOOKUP(E51,Ref!$B$172:$P$195,1+UserInput!$C$7)","v":4.9000000000000002E-2},null,{"$f":"VLOOKUP(E51,Ref!$B$199:$P$222,1+UserInput!$C$7)","v":4.8500000000000001E-2},null,{"$f":"VLOOKUP(E51,Ref!$B$226:$P$249,1+UserInput!$C$7)","v":4.8099999999999997E-2}]
[null,null,null,null,12,{"$f":"VLOOKUP(E52,Ref!$B$117:$P$141,1+UserInput!$C$7)","v":5.1299999999999998E-2},null,{"$f":"VLOOKUP(E52,Ref!$B$144:$P$168,1+UserInput!$C$7)","v":5.0799999999999998E-2},null,{"$f":"VLOOKUP(E52,Ref!$B$172:$P$195,1+UserInput!$C$7)","v":5.04E-2},null,{"$f":"VLOOKUP(E52,Ref!$B$199:$P$222,1+UserInput!$C$7)","v":4.99E-2},null,{"$f":"VLOOKUP(E52,Ref!$B$226:$P$249,1+UserInput!$C$7)","v":4.9500000000000002E-2}]
[null,null,null,null,13,{"$f":"VLOOKUP(E53,Ref!$B$117:$P$141,1+UserInput!$C$7)","v":5.3199999999999997E-2},null,{"$f":"VLOOKUP(E53,Ref!$B$144:$P$168,1+UserInput!$C$7)","v":5.2699999999999997E-2},null,{"$f":"VLOOKUP(E53,Ref!$B$172:$P$195,1+UserInput!$C$7)","v":5.2299999999999999E-2},null,{"$f":"VLOOKUP(E53,Ref!$B$199:$P$222,1+UserInput!$C$7)","v":5.1799999999999999E-2},null,{"$f":"VLOOKUP(E53,Ref!$B$226:$P$249,1+UserInput!$C$7)","v":5.1400000000000001E-2}]
[null,null,null,null,14,{"$f":"VLOOKUP(E54,Ref!$B$117:$P$141,1+UserInput!$C$7)","v":5.4800000000000001E-2},null,{"$f":"VLOOKUP(E54,Ref!$B$144:$P$168,1+UserInput!$C$7)","v":5.4300000000000001E-2},null,{"$f":"VLOOKUP(E54,Ref!$B$172:$P$195,1+UserInput!$C$7)","v":5.3900000000000003E-2},null,{"$f":"VLOOKUP(E54,Ref!$B$199:$P$222,1+UserInput!$C$7)","v":5.3400000000000003E-2},null,{"$f":"VLOOKUP(E54,Ref!$B$226:$P$249,1+UserInput!$C$7)","v":5.2999999999999999E-2}]
[null,{"$f":"IF(Crash!J29=\"Yes\",IF(UserInput!$C$38=0.08,IF(G65<>1,\"k factors must sum to 100%\",\"\"),IF(UserInput!$C$38=0.09,IF(I65<>1,\"k factors must sum to 100%\",\"\"),IF(UserInput!$C$38=0.1,IF(K65<>1,\"k factors must sum to 100%\",\"\"),IF(UserInput!$C$38=0.11,IF(M65<>1,\"k factors must sum to 100%\",\"\"),IF(O65<>1,\"k factors must sum to 100%\",\"\"))))),\"\")","v":""},null,null,15,{"$f":"VLOOKUP(E55,Ref!$B$117:$P$141,1+UserInput!$C$7)","v":6.08E-2},null,{"$f":"VLOOKUP(E55,Ref!$B$144:$P$168,1+UserInput!$C$7)","v":6.0299999999999999E-2},null,{"$f":"VLOOKUP(E55,Ref!$B$172:$P$195,1+UserInput!$C$7)","v":5.9900000000000002E-2},null,{"$f":"VLOOKUP(E55,Ref!$B$199:$P$222,1+UserInput!$C$7)","v":5.9400000000000001E-2},null,{"$f":"VLOOKUP(E55,Ref!$B$226:$P$249,1+UserInput!$C$7)","v":5.8999999999999997E-2}]
[null,null,null,null,16,{"$f":"VLOOKUP(E56,Ref!$B$117:$P$141,1+UserInput!$C$7)","v":7.0599999999999996E-2},null,{"$f":"VLOOKUP(E56,Ref!$B$144:$P$168,1+UserInput!$C$7)","v":7.0099999999999996E-2},null,{"$f":"VLOOKUP(E56,Ref!$B$172:$P$195,1+UserInput!$C$7)","v":6.9699999999999998E-2},null,{"$f":"VLOOKUP(E56,Ref!$B$199:$P$222,1+UserInput!$C$7)","v":6.9199999999999998E-2},null,{"$f":"VLOOKUP(E56,Ref!$B$226:$P$249,1+UserInput!$C$7)","v":6.88E-2}]
[null,null,null,null,17,{"$f":"VLOOKUP(E57,Ref!$B$117:$P$141,1+UserInput!$C$7)","v":0.08},null,{"$f":"VLOOKUP(E57,Ref!$B$144:$P$168,1+UserInput!$C$7)","v":0.09},null,{"$f":"VLOOKUP(E57,Ref!$B$172:$P$195,1+UserInput!$C$7)","v":0.1},null,{"$f":"VLOOKUP(E57,Ref!$B$199:$P$222,1+UserInput!$C$7)","v":0.11},null,{"$f":"VLOOKUP(E57,Ref!$B$226:$P$249,1+UserInput!$C$7)","v":0.12}]
[null,null,null,null,18,{"$f":"VLOOKUP(E58,Ref!$B$117:$P$141,1+UserInput!$C$7)","v":7.2999999999999995E-2},null,{"$f":"VLOOKUP(E58,Ref!$B$144:$P$168,1+UserInput!$C$7)","v":7.3999999999999996E-2},null,{"$f":"VLOOKUP(E58,Ref!$B$172:$P$195,1+UserInput!$C$7)","v":7.2800000000000004E-2},null,{"$f":"VLOOKUP(E58,Ref!$B$199:$P$222,1+UserInput!$C$7)","v":7.3800000000000004E-2},null,{"$f":"VLOOKUP(E58,Ref!$B$226:$P$249,1+UserInput!$C$7)","v":7.2599999999999998E-2}]
[null,null,null,null,19,{"$f":"VLOOKUP(E59,Ref!$B$117:$P$141,1+UserInput!$C$7)","v":5.6800000000000003E-2},null,{"$f":"VLOOKUP(E59,Ref!$B$144:$P$168,1+UserInput!$C$7)","v":5.6300000000000003E-2},null,{"$f":"VLOOKUP(E59,Ref!$B$172:$P$195,1+UserInput!$C$7)","v":5.5899999999999998E-2},null,{"$f":"VLOOKUP(E59,Ref!$B$199:$P$222,1+UserInput!$C$7)","v":5.5399999999999998E-2},null,{"$f":"VLOOKUP(E59,Ref!$B$226:$P$249,1+UserInput!$C$7)","v":5.5E-2}]
[null,null,null,null,20,{"$f":"VLOOKUP(E60,Ref!$B$117:$P$141,1+UserInput!$C$7)","v":4.2900000000000001E-2},null,{"$f":"VLOOKUP(E60,Ref!$B$144:$P$168,1+UserInput!$C$7)","v":4.24E-2},null,{"$f":"VLOOKUP(E60,Ref!$B$172:$P$195,1+UserInput!$C$7)","v":4.2000000000000003E-2},null,{"$f":"VLOOKUP(E60,Ref!$B$199:$P$222,1+UserInput!$C$7)","v":4.1500000000000002E-2},null,{"$f":"VLOOKUP(E60,Ref!$B$226:$P$249,1+UserInput!$C$7)","v":4.1099999999999998E-2}]
[null,null,null,null,21,{"$f":"VLOOKUP(E61,Ref!$B$117:$P$141,1+UserInput!$C$7)","v":3.5099999999999999E-2},null,{"$f":"VLOOKUP(E61,Ref!$B$144:$P$168,1+UserInput!$C$7)","v":3.4599999999999999E-2},null,{"$f":"VLOOKUP(E61,Ref!$B$172:$P$195,1+UserInput!$C$7)","v":3.4200000000000001E-2},null,{"$f":"VLOOKUP(E61,Ref!$B$199:$P$222,1+UserInput!$C$7)","v":3.3700000000000001E-2},null,{"$f":"VLOOKUP(E61,Ref!$B$226:$P$249,1+UserInput!$C$7)","v":3.3300000000000003E-2}]
[null,null,null,null,22,{"$f":"VLOOKUP(E62,Ref!$B$117:$P$141,1+UserInput!$C$7)","v":2.9700000000000001E-2},null,{"$f":"VLOOKUP(E62,Ref!$B$144:$P$168,1+UserInput!$C$7)","v":2.92E-2},null,{"$f":"VLOOKUP(E62,Ref!$B$172:$P$195,1+UserInput!$C$7)","v":2.8799999999999999E-2},null,{"$f":"VLOOKUP(E62,Ref!$B$199:$P$222,1+UserInput!$C$7)","v":2.8299999999999999E-2},null,{"$f":"VLOOKUP(E62,Ref!$B$226:$P$249,1+UserInput!$C$7)","v":2.7900000000000001E-2}]
[null,null,null,null,23,{"$f":"VLOOKUP(E63,Ref!$B$117:$P$141,1+UserInput!$C$7)","v":2.2800000000000001E-2},null,{"$f":"VLOOKUP(E63,Ref!$B$144:$P$168,1+UserInput!$C$7)","v":2.23E-2},null,{"$f":"VLOOKUP(E63,Ref!$B$172:$P$195,1+UserInput!$C$7)","v":2.1899999999999999E-2},null,{"$f":"VLOOKUP(E63,Ref!$B$199:$P$222,1+UserInput!$C$7)","v":2.1399999999999999E-2},null,{"$f":"VLOOKUP(E63,Ref!$B$226:$P$249,1+UserInput!$C$7)","v":2.1000000000000001E-2}]
[null,null,null,null,24,{"$f":"VLOOKUP(E64,Ref!$B$117:$P$141,1+UserInput!$C$7)","v":1.6299999999999999E-2},null,{"$f":"VLOOKUP(E64,Ref!$B$144:$P$168,1+UserInput!$C$7)","v":1.5800000000000002E-2},null,{"$f":"VLOOKUP(E64,Ref!$B$172:$P$195,1+UserInput!$C$7)","v":1.54E-2},null,{"$f":"VLOOKUP(E64,Ref!$B$199:$P$222,1+UserInput!$C$7)","v":1.49E-2},null,{"$f":"VLOOKUP(E64,Ref!$B$226:$P$249,1+UserInput!$C$7)","v":1.4500000000000001E-2}]
[null,null,null,null,"Total",{"$f":"SUM(F41:F64)","v":0.99999999999999989},{"$f":"SUM(G41:G64)","v":0},0.99999999999999989,0,1,0,0.99999999999999989,0,1,0]
[]
[null,"SPFs Used as Crash Prediction Models"]
[null,null,null,"Functional Form of SPFs"]
[]
[]
[]
[null,"Calibration factor",1]
[]
[null,"Facility Type",{"$f":"IF(OR(C7=1,C7=2,C7=3),\"Coefficients for Total Crash SPF\",\"Coefficients for MV-FI SPF\")","v":"Coefficients for MV-FI SPF"}]
[null,{"$f":"$B$7","v":"Urban freeway (8 lanes)"},"X1","a1","b1","c1","d1"]
[null,"Default",{"$f":"VLOOKUP($C$7,Crash!$A$34:$V$47,3)","v":1},{"$f":"VLOOKUP($C$7,Crash!$A$34:$V$47,4)","v":-5.6349999999999998},{"$f":"VLOOKUP($C$7,Crash!$A$34:$V$47,5)","v":1.492},{"$f":"VLOOKUP($C$7,Crash!$A$34:$V$47,6)","v":1E-3},{"$f":"VLOOKUP($C$7,Crash!$A$34:$V$47,7)","v":0}]
[null,"Custom"]
[]
[null,"Facility Type","Coefficients for MV-PDO SPF"]
[null,{"$f":"$B$7","v":"Urban freeway (8 lanes)"},"X2","a2","b2","c2","d2"]
[null,"Default",{"$f":"VLOOKUP($C$7,Crash!$A$34:$V$47,8)","v":1},{"$f":"VLOOKUP($C$7,Crash!$A$34:$V$47,9)","v":-6.9969999999999999},{"$f":"VLOOKUP($C$7,Crash!$A$34:$V$47,10)","v":1.9359999999999999},{"$f":"VLOOKUP($C$7,Crash!$A$34:$V$47,11)","v":1E-3},{"$f":"VLOOKUP($C$7,Crash!$A$34:$V$47,12)","v":0}]
[null,"Custom"]
[]
[null,"Facility Type","Coefficients for SV-FI SPF"]
[null,{"$f":"$B$7","v":"Urban freeway (8 lanes)"},"X3","a3","b3","c3","d3"]
[null,"Default",{"$f":"VLOOKUP($C$7,Crash!$A$34:$V$47,13)","v":1},{"$f":"VLOOKUP($C$7,Crash!$A$34:$V$47,14)","v":-1.9850000000000001},{"$f":"VLOOKUP($C$7,Crash!$A$34:$V$47,15)","v":0.64600000000000002},{"$f":"VLOOKUP($C$7,Crash!$A$34:$V$47,16)","v":1E-3},{"$f":"VLOOKUP($C$7,Crash!$A$34:$V$47,17)","v":0}]
[null,"Custom"]
[]
[null,"Facility Type","Coefficients for SV-PDO SPF"]
[null,{"$f":"$B$7","v":"Urban freeway (8 lanes)"},"X4","a4","b4","c4","d4"]
[null,"Default",{"$f":"VLOOKUP($C$7,Crash!$A$34:$V$47,18)","v":1},{"$f":"VLOOKUP($C$7,Crash!$A$34:$V$47,19)","v":-2.3119999999999998},{"$f":"VLOOKUP($C$7,Crash!$A$34:$V$47,20)","v":0.876},{"$f":"VLOOKUP($C$7,Crash!$A$34:$V$47,21)","v":1E-3},{"$f":"VLOOKUP($C$7,Crash!$A$34:$V$47,22)","v":0}]
[null,"Custom"]

{"sheet":"Input","index":2,"n_rows":57,"n_cols":9,"rows_kept":57,"cut":false,"hidden":true,"merged":[[41,1,41,2],[48,1,48,2],[53,1,53,2],[17,1,17,2],[19,4,20,4],[26,1,26,2],[32,1,32,2],[37,1,37,2]]}
[]
[]
[]
[]
[]
[]
[]
[null,null,null,null,null,"(calculated values for display only)"]
[null,"Curve Radius (ft)",1536,null,null,"SSD",682,"ft"]
[null,"Curve Length (mi)",{"$f":"UserInput!C19","v":0.3},null,null,"Deflection",{"$f":"C10*5280/C9*180/3.141593","v":59.086266107672131},"degrees"]
[null,"Speed (mi/h)",{"$f":"UserInput!C20","v":65},null,null,"Deflection",{"$f":"C10*5280/C9","v":1.03125},"radians"]
[null,"B1 (mi)",-0.1]
[null,"B2 (mi)",0.4]
[null,"m (ft)",48]
[]
[null,null,null,null,null,"S'min",770.01419469659345]
[null,null,null,null,null,"E @ S'min",0.13257575757575757]
[null,"Advanced Options",null,null,null,"PC to S'min",3.4071969696969628E-3]
[null,"t (s)",2.5]
[null,"a (ft/s^2)",11.2,null,"E when:","S' < SSD"]
[null,"x (ft)",{"$f":"UserInput!C33","v":50},null,null,"S' > SSD"]
[]
[null,null,null,null,null,"Hazard L",{"$f":"G21-G20","v":0},"mi"]
[]
[]
[]
[null,"Vertical Curve Data",null,null,null,null,null,null,"k"]
[null,null,{"$f":"UserInput!C29","v":-0.1},null,null,"PC-S to PVC",154,null,0.08]
[null,null,{"$f":"UserInput!C30","v":0.2},null,null,"PC-S to PVT",1210,null,0.09]
[null,"G (%)",{"$f":"UserInput!C27","v":-3},null,null,"ePVC",0,null,0.1]
[null,null,{"$f":"UserInput!C28","v":3},null,null,"ePVT",3.5527136788005009E-15,null,0.11]
[null,null,null,null,null,null,null,null,0.12]
[null,"Advanced Options"]
[null,"Eye Height (ft)",3.5,0]
[null,"Obstruction Height (ft)",{"$f":"UserInput!C24","v":4}]
[null,"Object in Road Height (ft)",2,0]
[]
[null,"Facility Type"]
[null,{"$f":"UserInput!B7","v":"Urban freeway (8 lanes)"},{"$f":"UserInput!C7","v":8}]
[null,"Number of Lanes in analysis direction",{"$f":"UserInput!C8","v":4}]
[]
[null,"Lane Utilization (%)"]
[null,"Lane 1 (closest to obstruction)",{"$f":"UserInput!C44","v":0.25}]
[null,"Lane 2",{"$f":"UserInput!C45","v":0.25}]
[null,"Lane 3",{"$f":"UserInput!C46","v":0.25}]
[null,"Lane 4",{"$f":"UserInput!C47","v":0.25}]
[null,"Lane 5",{"$f":"UserInput!C48","v":0}]
[]
[null,"Queueing Input"]
[null,"Capacity (pcphpl)",{"$f":"UserInput!C51","v":0}]
[null,"Capacity reduction (%)",{"$f":"UserInput!C52","v":0}]
[null,"No. incidents per mile per year",{"$f":"UserInput!C53","v":0}]
[]
[null,"Other Geometric Features"]
[null,"Avg Lane Width (ft)",{"$f":"UserInput!C9","v":12}]
[null,"Distance from Obstruction to Edge of Travelled Way (ft)",{"$f":"UserInput!C23","v":6}]
[null,"Position of Driver in Lane (ft)",6,0]

{"sheet":"Results","index":3,"n_rows":38,"n_cols":41,"rows_kept":38,"cut":false,"hidden":true,"merged":[]}
["E (mi)","S' (ft)","R","L","S","Tx","Ty","Cx","Cy","alpha1","U","beta","gamma","Delta","O","PTx","PTy ","Ix","Iy","N","alpha2","lambda","theta","beta1","beta2","Q","Iycircle","delta","P","T2x","T2y","Condition","Zc","Zt","Zi","Zsl","SLCondition","E (ft)","Available SD (ft)","Design SSD (ft)","CrestControl"]
[0,1167.7556834654642,1536,0.3,682.01,682.01,48,null,null,null,null,3.7577442592358636,null,59.086266107672131,1167.7556834654642,null,null,null,null,null,4.0258495397345762,null,18.11925423856913,0,59.086266107672131,380.98818879330105,null,66.057961524488576,1680.6051410429518,null,null,2,3.5,-19.482457583515025,-33.032670503963928,-21.056645348155584,0]
[9.46969696969697E-3,1124.6070975110642,1536,0.3,682.01,null,null,null,null,null,null,4.0133152652410047,null,59.086266107672131,1174.6070975110642,null,null,null,null,null,null,null,18.374825244574275,0,59.086266107672131,380.98818879330105,null,67.634549162890195,1660.9432982796252,null,null,2,2,-19.688000004883015,-33.238212925331929,-21.24005577240402,0]
[1.893939393939394E-2,1082.3762423019648,1536,0.3,682.01,null,null,null,null,null,null,4.3031194044734491,null,59.086266107672131,1182.3762423019648,null,null,null,null,null,null,null,18.664629383806719,0,59.086266107672131,380.98818879330105,null,69.247654967734306,1642.5686104695901,null,null,2,0.5,-19.921074348610034,-33.471287269058941,-21.449589299482842,0]
[2.8409090909090908E-2,1041.2408536196433,1536,0.3,682.01,null,null,null,null,null,null,4.6337865656208237,null,59.086266107672131,1191.2408536196433,null,null,null,null,null,null,null,18.995296544954087,0,59.086266107672131,380.98818879330105,null,70.895918342815705,1625.5247276187465,null,null,2,-1,-20.187012688140392,-33.737225608589299,-21.690550835403407,0]
[3.787878787878788E-2,1001.4210142798682,1536,0.3,682.01,null,null,null,null,null,null,5.0135262637198679,null,59.086266107672131,1201.4210142798684,null,null,null,null,null,null,null,19.375036243053145,0,59.086266107672131,380.98818879330105,null,72.577686475154806,1609.8539188696593,null,null,2,-2.5,-20.492417507947131,-34.042630428396052,-21.969561956748038,0]
[4.7348484848484848E-2,963.18959067389198,1536,0.3,682.01,null,null,null,null,null,null,5.4525169433447331,null,59.086266107672131,1213.1895906738919,null,null,null,null,null,null,null,19.814026922677993,0,59.086266107672131,380.98818879330105,null,74.291008303919327,1595.5966407898959,null,null,2,-4,-20.84547479976786,-34.395687720216756,-22.294900453601681,0]
[5.6818181818181816E-2,926.88422079249744,1536,0.3,682.01,null,null,null,null,null,null,5.9633531551086492,null,59.086266107672131,1226.8842207924974,null,null,null,null,null,null,null,20.324863134441919,0,59.086266107672131,380.98818879330105,null,76.033633756484065,1582.7910917426848,null,null,2,-5.5,-21.256313703326015,-34.806526623774921,-22.676896995634213,0]
[6.6287878787878785E-2,892.91980021720451,1536,0.3,682.01,null,null,null,null,null,null,6.5615113073049542,null,59.086266107672131,1242.9198002172045,null,null,null,null,null,null,null,20.923021286638232,0,59.086266107672131,380.98818879330105,null,77.803018918050796,1571.4727614884071,null,null,2,-7,-21.737381086067224,-35.287594006516137,-23.128359230494752,0]
[7.575757575757576E-2,861.79888940896967,1536,0.3,682.01,null,null,null,null,null,null,7.265737877920543,null,59.086266107672131,1261.7988894089697,null,null,null,null,null,null,null,21.627247857253831,0,59.086266107672131,380.98818879330105,null,79.596337639084865,1561.6739864965414,null,null,2,-8.5,-22.303753761820168,-35.853966682269089,-23.664945698761258,0]
[8.5227272727272721E-2,834.11497155854784,1536,0.3,682.01,null,null,null,null,null,null,8.0981709387606031,null,59.086266107672131,1284.1149715585479,null,null,null,null,null,null,null,22.459680918093884,0,59.086266107672131,380.98818879330105,null,81.410499869188442,1553.4235224496892,null,null,2,-10,-22.973236226307517,-36.523449146756434,-24.305331718789404,0]
[9.4696969696969696E-2,810.54022313676853,1536,0.3,682.01,null,null,null,null,null,null,9.0838839733016101,null,59.086266107672131,1310.5402231367684,null,null,null,null,null,null,null,23.445393952634877,0,59.086266107672131,380.98818879330105,null,83.242176744428264,1546.7461459787123,null,null,2,-11.5,-23.765993773654149,-37.316206694103052,-25.070901507013438,0]
[0.10416666666666667,791.78693278461753,1536,0.3,682.01,null,null,null,null,null,null,10.249446726610941,null,59.086266107672131,1341.7869327846174,null,null,null,null,null,null,null,24.610956705944204,0,59.086266107672131,380.98818879330105,null,85.087832160671368,1541.6622976838994,null,null,2,-13,-24.703395063089623,-38.253607983538522,-25.984611818156438,0]
[0.11363636363636363,778.53366557627999,1536,0.3,682.01,null,null,null,null,null,null,11.620170989436502,null,59.086266107672131,1378.5336655762799,null,null,null,null,null,null,null,25.981680968769766,0,59.086266107672131,380.98818879330105,null,86.943760256350714,1538.1877779061956,null,null,2,-14.5,-25.805797046839498,-39.356009967288394,-27.068722308598716,0]
[0.12310606060606061,771.31867984008863,1536,0.3,682.01,null,null,null,null,null,null,13.216134839317775,null,59.086266107672131,1421.3186798400886,null,null,null,null,null,null,null,27.577644818651049,0,59.086266107672131,380.98818879330105,null,88.806127926223041,1536.3335054928666,null,null,2,-16,-27.089347474753751,-40.639560395202658,-28.341440983245178,0]
[0.13257575757575757,770.01419469659345,1536,0.3,682.01,null,null,null,null,null,null,15.03257180210916,null,59.086266107672131,1470.0141946965934,null,null,null,null,null,null,null,29.394081781442424,0,59.086266107672131,380.98818879330105,null,-89.328958935428417,1536.1053479823577,null,null,6,-17.5,-28.550212920448899,-42.100425840897799,-29.800212920448899,0]
[0.14204545454545456,770.01419469659345,1536,0.3,682.01,null,null,null,null,null,null,16.897668585810933,null,59.086266107672131,1520.0141946965934,null,null,null,null,null,null,null,31.259178565144197,0,59.086266107672131,null,null,null,null,null,null,6,-19,-30.050212920448899,-43.600425840897799,-31.300212920448899,0]
[0.15151515151515152,770.01419469659345,1536,0.3,682.01,null,null,null,null,null,null,18.762765369512707,null,59.086266107672131,1570.0141946965934,null,null,null,null,null,null,null,33.12427534884597,0,59.086266107672131,null,null,null,null,null,null,6,-20.5,-31.550212920448899,-45.100425840897806,-32.800212920448907,0]
[0.16098484848484848,770.01419469659345,1536,0.3,682.01,null,null,null,null,null,null,20.627862153214476,null,59.086266107672131,1620.0141946965934,null,null,null,null,null,null,null,34.989372132547743,0,59.086266107672131,null,null,null,null,null,null,6,-22,-33.050212920448899,-46.600425840897806,-34.300212920448907,0]
[0.17045454545454544,770.01419469659345,1536,0.3,682.01,null,null,null,null,null,null,22.492958936916246,null,59.086266107672131,1670.0141946965934,null,null,null,null,null,null,null,36.854468916249509,0,59.086266107672131,null,null,null,null,null,null,6,-23.5,-34.550212920448899,-48.100425840897792,-35.800212920448899,0]
[0.17992424242424243,770.01419469659345,1536,0.3,682.01,null,null,null,null,null,null,24.358055720618019,null,59.086266107672131,1720.0141946965934,null,null,null,null,null,null,null,38.719565699951282,0,59.086266107672131,null,null,null,null,null,null,6,-25,-36.050212920448899,-49.600425840897799,-37.300212920448899,0]
[0.18939393939393939,770.01419469659345,1536,0.3,682.01,null,null,null,null,null,null,26.223152504319792,null,59.086266107672131,1770.0141946965934,null,null,null,null,null,null,null,40.584662483653055,0,59.086266107672131,null,null,null,null,null,null,6,-26.5,-37.550212920448907,-51.100425840897799,-38.800212920448899,0]
[0.19886363636363635,770.01419469659345,1536,0.3,682.01,null,null,null,null,null,null,28.088249288021565,null,59.086266107672131,1820.0141946965934,null,null,null,null,null,null,null,42.449759267354828,0,59.086266107672131,null,null,null,null,null,null,6,-28,-39.050212920448907,-52.600425840897799,-40.300212920448907,0]
[0.20833333333333334,770.01419469659345,1536,0.3,682.01,null,null,null,null,null,null,29.953346071723338,null,59.086266107672131,1870.0141946965934,null,null,null,null,null,null,null,44.314856051056601,0,59.086266107672131,null,null,null,null,null,null,6,-29.5,-40.550212920448907,-54.100425840897799,-41.800212920448899,0]
[0.2178030303030303,770.01419469659345,1536,0.3,682.01,null,null,null,null,null,null,31.818442855425108,null,59.086266107672131,1920.0141946965934,null,null,null,null,null,null,null,46.179952834758367,0,59.086266107672131,null,null,null,null,null,null,6,-31,-42.050212920448907,-55.600425840897806,-43.300212920448899,0]
[0.22727272727272727,770.01419469659345,1536,0.3,682.01,null,null,null,null,null,null,33.683539639126877,null,59.086266107672131,1970.0141946965934,null,null,null,null,null,null,null,48.045049618460141,0,59.086266107672131,null,null,null,null,null,null,6,-32.5,-43.550212920448899,-57.100425840897792,-44.800212920448892,0]
[0.23674242424242425,770.01419469659345,1536,0.3,682.01,null,null,null,null,null,null,35.54863642282865,null,59.086266107672131,2020.0141946965934,null,null,null,null,null,null,null,49.910146402161914,0,59.086266107672131,null,null,null,null,null,null,6,-34,-45.050212920448899,-58.600425840897806,-46.300212920448899,0]
[0.24621212121212122,770.01419469659345,1536,0.3,682.01,null,null,null,null,null,null,37.413733206530424,null,59.086266107672131,2070.0141946965932,null,null,null,null,null,null,null,51.775243185863687,0,59.086266107672131,null,null,null,null,null,null,6,-35.5,-46.550212920448907,-60.100425840897792,-47.800212920448899,0]
[0.25568181818181818,770.01419469659345,1536,0.3,682.01,null,null,null,null,null,null,39.278829990232197,null,59.086266107672131,2120.0141946965932,null,null,null,null,null,null,null,53.64033996956546,0,59.086266107672131,null,null,null,null,null,null,6,-37,-48.050212920448907,-61.600425840897806,-49.300212920448899,0]
[0.26515151515151514,770.01419469659345,1536,0.3,682.01,null,null,null,null,null,null,41.14392677393397,null,59.086266107672131,2170.0141946965932,null,null,null,null,null,null,null,55.505436753267233,0,59.086266107672131,null,null,null,null,null,null,6,-38.5,-49.550212920448907,-63.100425840897813,-50.800212920448914,0]
[0.2746212121212121,770.01419469659345,1536,0.3,682.01,null,null,null,null,null,null,43.009023557635743,null,59.086266107672131,2220.0141946965932,null,null,null,null,null,null,null,57.370533536969006,0,59.086266107672131,null,null,null,null,null,null,6,-40,-51.050212920448907,-64.600425840897813,-52.300212920448907,0]
[0.28409090909090912,770.03479810201884,1536,0.3,682.01,null,null,1461.880268259564,212.70926675777127,null,626.64930727665273,44.874120341337516,null,59.086266107672131,2270.0347981020186,1999.8086705599746,746.88488553927471,null,null,null,null,null,59.235630320670779,0,59.086266107672131,380.98818879330105,null,null,null,null,null,8,-41.5,-52.550212920448907,-66.10104394306056,-53.800178805341133,0]
[0.29356060606060608,774.33969478525898,1536,0.3,682.01,null,null,1504.5353777615373,238.79222830795516,null,650.55242117158718,46.739217125039289,null,59.086266107672131,2324.3396947852589,1999.8086705599746,746.88488553927471,null,null,null,null,null,null,0,59.086266107672131,380.98818879330105,null,null,null,null,null,8,-43,-54.050212920448907,-67.730190843557779,-55.29347314640917,0]
[0.30303030303030304,788.95917133329817,1536,0.3,682.01,null,null,1546.3189849713831,266.24963930001695,null,683.16808391559084,48.604313908741062,null,59.086266107672131,2388.9591713332984,1999.8086705599746,746.88488553927471,null,null,null,null,null,null,0,59.086266107672131,380.98818879330105,null,null,null,null,null,8,-44.5,-55.550212920448907,-69.668775139998942,-56.77277043335453,0]
[0.3125,820.66149822201658,1536,0.3,682.01,null,null,1587.1868182952508,295.05240738341945,null,731.29847545146299,50.469410692442835,null,59.086266107672131,2470.6614982220167,1999.8086705599746,746.88488553927471,null,null,null,null,null,null,0,59.086266107672131,380.98818879330105,null,null,null,null,null,8,-46,-57.050212920448907,-72.119844946660493,-58.233322994084673,0]
[0.32196969696969696,883.6784122997567,1536,0.3,682.01,null,null,1627.0955764425303,325.17001474183417,null,809.21090358912613,52.334507476144609,null,59.086266107672131,2583.6784122997569,1999.8086705599746,746.88488553927471,null,null,null,null,null,null,0,59.086266107672131,380.98818879330105,null,null,null,null,null,8,-47.5,-58.550212920448907,-75.510352368992713,-59.667791827090404,0]
[0.33143939393939392,1013.9483907365844,1536,0.3,682.01,null,null,1666.002974305502,356.57055042812658,null,952.88104026586882,54.199604259846382,null,59.086266107672131,2763.9483907365843,1999.8086705599746,746.88488553927471,null,null,null,null,null,null,0,59.086266107672131,380.98818879330105,null,null,null,null,null,8,-49,-60.050212920448914,-80.918451722097529,-61.064510095667593,0]
[0.34090909090909088,1336.1107919040683,1536,0.3,682.01,null,null,1703.8677877622899,389.22074417542831,null,1286.9870230166116,56.064701043548148,null,59.086266107672131,3136.1107919040683,1999.8086705599746,746.88488553927471,null,null,null,null,null,null,0,59.086266107672131,380.98818879330105,null,null,null,null,null,8,-50.5,-61.550212920448914,-92.083323757122045,-62.404285470802257,0]

{"sheet":"Profile","index":4,"n_rows":44,"n_cols":6,"rows_kept":44,"cut":false,"hidden":false,"merged":[]}
["Distance from PC, ft","ASSD(lane1, ft)","ASSD(lane2, ft)","ASSD(lane3, ft)","ASSD(lane4, ft)","DSSD (ft)"]
[-682.01,897.77512821285609,1003.0556182980499,1090.1357867063809,1167.7556834654642,682]
[-632.01,849.74090237621908,956.79987816417179,1045.5008220625011,1124.6070975110642,682]
[-582.01,802.02162265813695,911.10669683742424,1001.6254018742439,1082.3762423019648,682]
[-532.01,754.69713933621188,866.10552280807246,958.6693608446692,1041.2408536196433,682]
[-482.01,707.87570064247848,821.9657469548963,916.83571939732519,1001.4210142798682,682]
[-432.01,661.70713840726569,778.91172930929349,876.38387262631238,963.18959067389198,682]
[-382.01,616.40360127085467,737.24398670495486,837.6463926919148,926.88422079249744,682]
[-332.01,572.27281523619126,697.36864123685962,801.04940076060711,892.91980021720451,682]
[-282.01,529.77217291512102,659.83681284726811,767.13489291708379,861.79888940896967,682]
[-232.01000000000005,489.59649115592595,625.39281400567893,736.57993351122013,834.11497155854784,682]
[-182.01,452.81468618330945,595.02115848417156,710.20132988572175,810.54022313676853,682]
[-132.01,421.05416511049714,569.96217490523566,688.92586696909791,791.78693278461753,682]
[-82.009999999999991,396.64369180455441,551.6346178555043,673.7011951668851,778.53366557627999,682]
[-32.009999999999991,382.39578107789981,541.39037765474791,665.33507864766625,771.31867984008863,682]
[17.990000000000009,379.72675788817207,539.5139177755317,663.81546260066239,770.01419469659345,682]
[67.990000000000123,379.72675788817207,539.5139177755317,663.81546260066239,770.01419469659345,682]
[117.99000000000001,379.72675788817207,539.5139177755317,663.81546260066239,770.01419469659345,682]
[167.99,379.72675788817207,539.5139177755317,663.81546260066239,770.01419469659345,682]
[217.9899999999999,379.72675788817207,539.5139177755317,663.81546260066239,770.01419469659345,682]
[267.99,379.72675788817207,539.5139177755317,663.81546260066239,770.01419469659345,682]
[317.99,379.72675788817207,539.5139177755317,663.81546260066239,770.01419469659345,682]
[367.99,379.72675788817207,539.5139177755317,663.81546260066239,770.01419469659345,682]
[417.99,379.72675788817207,539.5139177755317,663.81546260066239,770.01419469659345,682]
[467.99,379.72675788817207,539.5139177755317,663.81546260066239,770.01419469659345,682]
[517.99,379.72675788817207,539.5139177755317,663.81546260066239,770.01419469659345,682]
[567.99,379.72675788817207,539.5139177755317,663.81546260066239,770.01419469659345,682]
[617.99,379.72675788817207,539.5139177755317,663.81546260066239,770.01419469659345,682]
[667.99,379.72675788817207,539.5139177755317,663.81546260066239,770.01419469659345,682]
[717.99,379.72675788817207,539.5139177755317,663.81546260066239,770.01419469659345,682]
[767.98999999999978,379.72675788817207,539.5139177755317,663.81546260066239,770.01419469659345,682]
[817.99000000000024,379.72675788817207,539.5139177755317,663.81546260066239,770.03479810201884,682]
[867.99,379.72675788817207,539.5139177755317,663.81546260066239,774.33969478525898,682]
[917.99,379.72675788817207,539.5139177755317,663.81546260066239,788.95917133329817,682]
[967.99,379.72675788817207,539.5139177755317,667.78267384657966,820.66149822201658,682]
[1017.99,379.72675788817207,539.5139177755317,684.01147700460922,883.6784122997567,682]
[1067.99,379.72675788817207,540.62469345768636,722.58108484084664,1013.9483907365844,682]
[1117.9899999999998,379.72675788817207,553.16983469233594,808.56460236523367,1336.1107919040683,682]
[1167.9900000000002,379.72675788817207,591.3316627783089,1026.6280522497721,null,682]
[1217.99,380.25817635330526,695.12824809754068,1957.9003436313883,null,682]
[1267.99,395.75892312218161,1077.5578697477122,null,null,682]
[1317.99,464.41613389760198,null,null,null,682]
[1367.99,891.39669607291103,null,null,null,682]
[1417.99,9999,null,null,null,682]

{"sheet":"Ref","index":5,"n_rows":250,"n_cols":24,"rows_kept":250,"cut":false,"hidden":true,"merged":[[67,9,75,9],[78,9,86,9],[89,9,97,9],[12,9,20,9],[23,9,31,9],[34,9,42,9],[45,9,53,9],[56,9,64,9],[32,12,32,14],[32,15,32,17],[32,18,32,20],[37,22,39,22],[34,22,36,22],[10,12,10,14],[10,15,10,17],[10,18,10,20],[12,22,14,22],[15,22,17,22],[21,12,21,14],[21,15,21,17],[21,18,21,20],[23,22,25,22],[26,22,28,22],[43,12,43,14],[43,15,43,17],[43,18,43,20],[45,22,47,22],[48,22,50,22],[54,12,54,14],[54,15,54,17],[54,18,54,20],[56,22,58,22],[59,22,61,22],[65,12,65,14],[65,15,65,17],[65,18,65,20],[67,22,69,22],[70,22,72,22],[76,12,76,14],[76,15,76,17],[76,18,76,20],[78,22,80,22],[81,22,83,22],[87,12,87,14],[87,15,87,17],[87,18,87,20],[89,22,91,22],[92,22,94,22]]}
[]
[null,"Combination","1st Condition","2nd Condition","3rd Condition","4th Condition"]
[null,1,1,2,4,8]
[null,2,1,2,6,8]
[null,3,1,5,6,8]
[null,4,1,5,7,8]
[null,5,1,3,4,8]
[null,6,1,3,7,8]
[null,null,null,null,null,null,0]
[null,"Combination="]
[null,null,null,null,null,null,0,null,null,null,null,null,"zT1",null,null,"zT2",null,null,"zT3"]
[null,null,null,null,null,null,null,null,null,null,null,null,"zI1","zI2","zI3","zI1","zI2","zI3","zI1","zI2","zI3"]
[null,"3D Sightline Condition 1",null,null,"HT",{"$f":"Input!$C$35","v":4},null,null,null,1,"zC1",{"$f":"-(Input!$G$28-Ref!C19)*Ref!F15/100+Ref!F14","v":-9.8800000000000008},{"$f":"(L19-L13)/(Input!$G$9+Input!$C$9*SIN(Ref!$C$15)-Ref!C19)-(Ref!L16-Ref!L13)/(Input!$C$14/Ref!$C$20)","v":-0.56070617639197395},{"$f":"(L20-L13)/(Input!$G$9+Input!$C$9*SIN(Ref!$C$15)-Ref!C19)-(Ref!L16-Ref!L13)/(Input!$C$14/Ref!$C$20)","v":1.9848850096247879},{"$f":"(L21-L13)/(Input!$G$9+Input!$C$9*SIN(Ref!$C$15)-Ref!C19)-(Ref!L16-Ref!L13)/(Input!$C$14/Ref!$C$20)","v":-9.1440530022240424E-2},null,{"$f":"(L20-L13)/(Input!$G$9+Input!$C$9*SIN(Ref!$C$15)-Ref!C19)-(Ref!L17-Ref!L13)/(Input!$C$14/Ref!$C$20)","v":1.1540840788524611},{"$f":"(L21-L13)/(Input!$G$9+Input!$C$9*SIN(Ref!$C$15)-Ref!C19)-(Ref!L17-Ref!L13)/(Input!$C$14/Ref!$C$20)","v":-0.92224146079456715},null,null,{"$f":"(L21-L13)/(Input!$G$9+Input!$C$9*SIN(Ref!$C$15)-Ref!C19)-(Ref!L18-Ref!L13)/(Input!$C$14/Ref!$C$20)","v":0.91137355648138785},2,"=0"]
[null,null,null,null,"HC",{"$f":"Input!$C$34","v":3.5},null,null,null,null,"zC2",{"$f":"Input!$G$30+Ref!F15/100*(Ref!C19-Input!$G$28)+(Ref!F16-Ref!F15)*(Ref!C19-Input!$G$28)^2/(200*Input!$C$29*5280)+Ref!F14","v":-4.2289772727272714},null,null,null,null,{"$f":"(L20-L14)/(Input!$G$9+Input!$C$9*SIN(Ref!$C$15)-Ref!C19)-(Ref!L17-Ref!L14)/(Input!$C$14/Ref!$C$20)","v":2.3556467136920225},{"$f":"(L21-L14)/(Input!$G$9+Input!$C$9*SIN(Ref!$C$15)-Ref!C19)-(Ref!L17-Ref!L14)/(Input!$C$14/Ref!$C$20)","v":0.27932117404499412},null,null,{"$f":"(L21-L14)/(Input!$G$9+Input!$C$9*SIN(Ref!$C$15)-Ref!C19)-(Ref!L18-Ref!L14)/(Input!$C$14/Ref!$C$20)","v":2.1129361913209488}]
[null,"theta(rad)=",3.0025769793232451,null,"G1",{"$f":"Input!$C$30","v":-3},null,null,null,null,"zC3",{"$f":"Input!$G$31+(Ref!C19-Input!$G$29)*Ref!F16/100+Ref!F14","v":-14.799999999999997},null,null,null,null,null,null,null,null,{"$f":"(L21-L15)/(Input!$G$9+Input!$C$9*SIN(Ref!$C$15)-Ref!C19)-(Ref!L18-Ref!L15)/(Input!$C$14/Ref!$C$20)","v":-0.13475356930062243}]
[null,"0=",null,null,"G2",{"$f":"Input!$C$31","v":3},null,null,null,null,"zT1",{"$f":"-(Input!$G$28-(Ref!C19+Input!$C$14/Ref!C20))*Ref!F15/100+Ref!F13","v":-9.5188765936341362},999,999,999,null,999,999,null,null,999,"zC1","Theta","=999 if no alpha found"]
[null,null,null,null,"Hmin",{"$f":"Input!$C$36","v":2},null,null,null,null,"zT2",{"$f":"Input!$G$30+Ref!F15/100*((Ref!C19+Input!$C$14/Ref!C20)-Input!$G$28)+(Ref!F16-Ref!F15)*((Ref!C19+Input!$C$14/Ref!C20)-Input!$G$28)^2/(200*Input!$C$10*5280)+Ref!F13","v":-5.6729164851764562},null,null,null,null,999,999,null,null,999,"zC2"]
[null,"D=",null,null,"Use solver to find a theta that makes C26=0",null,null,null,null,null,"zT3",{"$f":"Input!$G$31+((Ref!C19+Input!$C$14/Ref!C20)-Input!$G$29)*Ref!F16/100+Ref!F13","v":-14.16112340636586},null,null,null,null,null,null,null,null,999,"zC3"]
[null,"E=",600,null,null,null,null,null,null,null,"zI1",{"$f":"-(Input!$G$28-Input!$G$9-Input!$C$9*Ref!C15)*Ref!F15/100+Ref!F17","v":-152.19874720721515},{"$f":"IF($V$13=1,IF(M16=999,999,IF($C$19+Input!$C$14/((Input!$C$9-Input!$C$9*COS(M16))/(Input!$G$9+Input!$C$9*SIN(M16)-Ref!$C$19))<=Input!$G$28,1,IF($C$19+Input!$C$14/((Input!$C$9-Input!$C$9*COS(M16))/(Input!$G$9+Input!$C$9*SIN(M16)-Ref!$C$19))>Input!$G$29,3,2))),999)","v":999},{"$f":"IF($V$13=1,IF(N16=999,999,IF($C$19+Input!$C$14/((Input!$C$9-Input!$C$9*COS(N16))/(Input!$G$9+Input!$C$9*SIN(N16)-Ref!$C$19))<=Input!$G$28,1,IF($C$19+Input!$C$14/((Input!$C$9-Input!$C$9*COS(N16))/(Input!$G$9+Input!$C$9*SIN(N16)-Ref!$C$19))>Input!$G$29,3,2))),999)","v":999},{"$f":"IF($V$13=1,IF(O16=999,999,IF($C$19+Input!$C$14/((Input!$C$9-Input!$C$9*COS(O16))/(Input!$G$9+Input!$C$9*SIN(O16)-Ref!$C$19))<=Input!$G$28,1,IF($C$19+Input!$C$14/((Input!$C$9-Input!$C$9*COS(O16))/(Input!$G$9+Input!$C$9*SIN(O16)-Ref!$C$19))>Input!$G$29,3,2))),999)","v":999},null,{"$f":"IF($V$13=1,IF(Q16=999,999,IF($C$19+Input!$C$14/((Input!$C$9-Input!$C$9*COS(Q16))/(Input!$G$9+Input!$C$9*SIN(Q16)-Ref!$C$19))<=Input!$G$28,1,IF($C$19+Input!$C$14/((Input!$C$9-Input!$C$9*COS(Q16))/(Input!$G$9+Input!$C$9*SIN(Q16)-Ref!$C$19))>Input!$G$29,3,2))),IF($V$13=2,IF(Q17=999,999,IF($C$19+Input!$C$14/((Input!$C$9-Input!$C$9*COS(Q17))/(Input!$G$9+Input!$C$9*SIN(Q17)-Ref!$C$19))<=Input!$G$28,1,IF($C$19+Input!$C$14/((Input!$C$9-Input!$C$9*COS(Q17))/(Input!$G$9+Input!$C$9*SIN(Q17)-Ref!$C$19))>Input!$G$29,3,2))),999))","v":999},{"$f":"IF($V$13=1,IF(R16=999,999,IF($C$19+Input!$C$14/((Input!$C$9-Input!$C$9*COS(R16))/(Input!$G$9+Input!$C$9*SIN(R16)-Ref!$C$19))<=Input!$G$28,1,IF($C$19+Input!$C$14/((Input!$C$9-Input!$C$9*COS(R16))/(Input!$G$9+Input!$C$9*SIN(R16)-Ref!$C$19))>Input!$G$29,3,2))),IF($V$13=2,IF(R17=999,999,IF($C$19+Input!$C$14/((Input!$C$9-Input!$C$9*COS(R17))/(Input!$G$9+Input!$C$9*SIN(R17)-Ref!$C$19))<=Input!$G$28,1,IF($C$19+Input!$C$14/((Input!$C$9-Input!$C$9*COS(R17))/(Input!$G$9+Input!$C$9*SIN(R17)-Ref!$C$19))>Input!$G$29,3,2))),999))","v":999},null,null,{"$f":"IF($V$13=1,IF(U16=999,999,IF($C$19+Input!$C$14/((Input!$C$9-Input!$C$9*COS(U16))/(Input!$G$9+Input!$C$9*SIN(U16)-Ref!$C$19))<=Input!$G$28,1,IF($C$19+Input!$C$14/((Input!$C$9-Input!$C$9*COS(U16))/(Input!$G$9+Input!$C$9*SIN(U16)-Ref!$C$19))>Input!$G$29,3,2))),IF($V$13=2,IF(U17=999,999,IF($C$19+Input!$C$14/((Input!$C$9-Input!$C$9*COS(U17))/(Input!$G$9+Input!$C$9*SIN(U17)-Ref!$C$19))<=Input!$G$28,1,IF($C$19+Input!$C$14/((Input!$C$9-Input!$C$9*COS(U17))/(Input!$G$9+Input!$C$9*SIN(U17)-Ref!$C$19))>Input!$G$29,3,2))),IF(U18=999,999,IF($C$19+Input!$C$14/((Input!$C$9-Input!$C$9*COS(U18))/(Input!$G$9+Input!$C$9*SIN(U18)-Ref!$C$19))<=Input!$G$28,1,IF($C$19+Input!$C$14/((Input!$C$9-Input!$C$9*COS(U18))/(Input!$G$9+Input!$C$9*SIN(U18)-Ref!$C$19))>Input!$G$29,3,2)))))","v":999},"T Vertical Position (1,2,3)"]
[null,"tan alpha=",{"$f":"(Input!C9-Input!C9*COS(Ref!C15))/(Input!G9+Input!C9*SIN(Ref!C15)-Ref!C19)","v":10.368917917108577},null,null,null,null,null,null,null,"zI2",{"$f":"Input!$G$30+Ref!F15/100*(Input!$G$9+Input!$C$9*Ref!C15-Input!$G$28)+(Ref!F16-Ref!F15)*(Input!$G$9+Input!$C$9*Ref!C15-Input!$G$28)^2/(200*Input!$C$29*5280)+Ref!F17","v":598.34587527620147},{"$f":"IF($V$13=1,IF(M16=999,999,IF(Input!$G$9+Input!$C$9*Ref!M16<=Input!$G$28,1,IF(Input!$G$9+Input!$C$9*Ref!M16>Input!$G$29,3,2))),999)","v":999},{"$f":"IF($V$13=1,IF(N16=999,999,IF(Input!$G$9+Input!$C$9*Ref!N16<=Input!$G$28,1,IF(Input!$G$9+Input!$C$9*Ref!N16>Input!$G$29,3,2))),999)","v":999},{"$f":"IF($V$13=1,IF(O16=999,999,IF(Input!$G$9+Input!$C$9*Ref!O16<=Input!$G$28,1,IF(Input!$G$9+Input!$C$9*Ref!O16>Input!$G$29,3,2))),999)","v":999},null,{"$f":"IF($V$13=1,IF(Q16=999,999,IF(Input!$G$9+Input!$C$9*Ref!Q16<=Input!$G$28,1,IF(Input!$G$9+Input!$C$9*Ref!Q16>Input!$G$29,3,2))),IF($V$13=2,IF(Q17=999,999,IF(Input!$G$9+Input!$C$9*Ref!Q17<=Input!$G$28,1,IF(Input!$G$9+Input!$C$9*Ref!Q17>Input!$G$29,3,2))),999))","v":999},{"$f":"IF($V$13=1,IF(R16=999,999,IF(Input!$G$9+Input!$C$9*Ref!R16<=Input!$G$28,1,IF(Input!$G$9+Input!$C$9*Ref!R16>Input!$G$29,3,2))),IF($V$13=2,IF(R17=999,999,IF(Input!$G$9+Input!$C$9*Ref!R17<=Input!$G$28,1,IF(Input!$G$9+Input!$C$9*Ref!R17>Input!$G$29,3,2))),999))","v":999},null,null,{"$f":"IF($V$13=1,IF(U16=999,999,IF(Input!$G$9+Input!$C$9*Ref!U16<=Input!$G$28,1,IF(Input!$G$9+Input!$C$9*Ref!U16>Input!$G$29,3,2))),IF($V$13=2,IF(U17=999,999,IF(Input!$G$9+Input!$C$9*Ref!U17<=Input!$G$28,1,IF(Input!$G$9+Input!$C$9*Ref!U17>Input!$G$29,3,2))),IF(U18=999,999,IF(Input!$G$9+Input!$C$9*Ref!U18<=Input!$G$28,1,IF(Input!$G$9+Input!$C$9*Ref!U18>Input!$G$29,3,2)))))","v":999},"I Vertical Position (1,2,3)"]
[null,"alpha (rad)=",{"$f":"ATAN(C20)","v":1.4746515952376058},null,"S'=",{"$f":"#REF!*C15*PI()/180+#REF!-C19","v":{"$error":"#REF!"}},null,null,null,null,"zI3",{"$f":"Input!$G$31+(Input!$G$9+Input!$C$9*Ref!C18-Input!$G$29)*Ref!F16/100+Ref!F17","v":-13.839999999999996},{"$f":"IF(AND(M19=1,M20=1),1,999)","v":999},{"$f":"IF(AND(N19=1,N20=2),1,999)","v":999},{"$f":"IF(AND(O19=1,O20=3),1,999)","v":999},null,{"$f":"IF(AND(Q19=2,Q20=2),1,999)","v":999},{"$f":"IF(AND(R19=2,R20=3),1,999)","v":999},null,null,{"$f":"IF(AND(U19=3,U20=3),1,999)","v":999}]
[null,null,null,null,null,null,null,null,null,null,null,null,"zT1",null,null,"zT2",null,null,"zT3"]
[null,null,null,null,null,null,null,null,null,null,null,null,"zI1","zI2","zI3","zI1","zI2","zI3","zI1","zI2","zI3"]
[null,"3D Sightline Condition 2",null,null,"HT",{"$f":"Input!$C$35","v":4},null,null,null,2,"zC1",{"$f":"-(Input!$G$28-Ref!C30)*Ref!F26/100+Ref!F25","v":-8.3800000000000008},{"$f":"(L30-L24)/($C$32*COS($C$25)+Input!$G$9+Input!$C$9*TAN(Ref!$C$25/2)-Ref!$C$30)-(Ref!L27-Ref!L24)/(Input!$C$14/Ref!$C$31)","v":-3.1421102305189677},{"$f":"(L31-L24)/($C$32*COS($C$25)+Input!$G$9+Input!$C$9*TAN(Ref!$C$25/2)-Ref!$C$30)-(Ref!L27-Ref!L24)/(Input!$C$14/Ref!$C$31)","v":-4.125100239072812},{"$f":"(L32-L24)/($C$32*COS($C$25)+Input!$G$9+Input!$C$9*TAN(Ref!$C$25/2)-Ref!$C$30)-(Ref!L27-Ref!L24)/(Input!$C$14/Ref!$C$31)","v":1.6569942137474061},null,{"$f":"(L31-L24)/($C$32*COS($C$25)+Input!$G$9+Input!$C$9*TAN(Ref!$C$25/2)-Ref!$C$30)-(Ref!L28-Ref!L24)/(Input!$C$14/Ref!$C$31)","v":-10.773496088880481},{"$f":"(L32-L24)/($C$32*COS($C$25)+Input!$G$9+Input!$C$9*TAN(Ref!$C$25/2)-Ref!$C$30)-(Ref!L28-Ref!L24)/(Input!$C$14/Ref!$C$31)","v":-4.9914016360602638},null,null,{"$f":"(L32-L24)/($C$32*COS($C$25)+Input!$G$9+Input!$C$9*TAN(Ref!$C$25/2)-Ref!$C$30)-(Ref!L29-Ref!L24)/(Input!$C$14/Ref!$C$31)","v":19.286027200353395},2,"=0"]
[null,"Delta(rad)=",{"$f":"Input!G11","v":1.03125},null,"HC",{"$f":"Input!$C$34","v":3.5},null,null,null,null,"zC2",{"$f":"Input!$G$30+Ref!F26/100*(Ref!C30-Input!$G$28)+(Ref!F27-Ref!F26)*(Ref!C30-Input!$G$28)^2/(200*Input!$C$29*5280)+Ref!F25","v":-3.9249999999999989},null,null,null,null,{"$f":"(L31-L25)/($C$32*COS($C$25)+Input!$G$9+Input!$C$9*TAN(Ref!$C$25/2)-Ref!$C$30)-(Ref!L28-Ref!L25)/(Input!$C$14/Ref!$C$31)","v":-0.54259184707865549},{"$f":"(L32-L25)/($C$32*COS($C$25)+Input!$G$9+Input!$C$9*TAN(Ref!$C$25/2)-Ref!$C$30)-(Ref!L28-Ref!L25)/(Input!$C$14/Ref!$C$31)","v":5.2395026057415635},null,null,{"$f":"(L32-L25)/($C$32*COS($C$25)+Input!$G$9+Input!$C$9*TAN(Ref!$C$25/2)-Ref!$C$30)-(Ref!L29-Ref!L25)/(Input!$C$14/Ref!$C$31)","v":29.516931442155219}]
[null,"alpha(rad)=",1.5614687838518186,null,"G1",{"$f":"Input!$C$30","v":-3},null,null,null,null,"zC3",{"$f":"Input!$G$31+(Ref!C30-Input!$G$29)*Ref!F27/100+Ref!F25","v":-16.299999999999997},null,null,null,null,null,null,null,null,{"$f":"(L32-L26)/($C$32*COS($C$25)+Input!$G$9+Input!$C$9*TAN(Ref!$C$25/2)-Ref!$C$30)-(Ref!L29-Ref!L26)/(Input!$C$14/Ref!$C$31)","v":1.0977529927057161}]
[null,"0=",null,null,"G2",{"$f":"Input!$C$31","v":3},null,null,null,null,"zT1",{"$f":"-(Input!$G$28-(Ref!C30+Input!$C$14/Ref!C31))*Ref!F26/100+Ref!F24","v":-7.8934320513834706},999,999,999,null,999,999,null,null,999,"zC1","Alpha","=999 if no alpha found"]
[null,null,null,null,"Hmin",{"$f":"Input!$C$36","v":2},null,null,null,null,"zT2",{"$f":"Input!$G$30+Ref!F26/100*((Ref!C30+Input!$C$14/Ref!C31)-Input!$G$28)+(Ref!F27-Ref!F26)*((Ref!C30+Input!$C$14/Ref!C31)-Input!$G$28)^2/(200*Input!$C$10*5280)+Ref!F24","v":-4.91671222897447},null,null,null,null,999,999,null,null,999,"zC2"]
[null,"D=",null,null,"Use solver to find a U that makes C44=0",null,null,null,null,null,"zT3",{"$f":"Input!$G$31+((Ref!C30+Input!$C$14/Ref!C31)-Input!$G$29)*Ref!F27/100+Ref!F24","v":-15.786567948616526},null,null,null,null,null,null,null,null,999,"zC3"]
[null,"E=",550,null,null,null,null,null,null,null,"zI1",{"$f":"-(Input!$G$28-Input!$G$9-Input!$C$9*Ref!C25-C32+Input!$C$9*TAN(Ref!C25/2))*Ref!F26/100+Ref!F28","v":24.226675583480773},{"$f":"IF($V$24=1,IF(M27=999,999,IF($C$30+Input!$C$14/TAN(M27)<=Input!$G$28,1,IF($C$30+Input!$C$14/TAN(M27)>Input!$G$29,3,2))),999)","v":999},{"$f":"IF($V$24=1,IF(N27=999,999,IF($C$30+Input!$C$14/TAN(N27)<=Input!$G$28,1,IF($C$30+Input!$C$14/TAN(N27)>Input!$G$29,3,2))),999)","v":999},{"$f":"IF($V$24=1,IF(O27=999,999,IF($C$30+Input!$C$14/TAN(O27)<=Input!$G$28,1,IF($C$30+Input!$C$14/TAN(O27)>Input!$G$29,3,2))),999)","v":999},null,{"$f":"IF($V$24=1,IF(Q27=999,999,IF($C$30+Input!$C$14/TAN(Q27)<=Input!$G$28,1,IF($C$30+Input!$C$14/TAN(Q27)>Input!$G$29,3,2))),IF($V$24=2,IF(Q28=999,999,IF($C$30+Input!$C$14/TAN(Q27)<=Input!$G$28,1,IF($C$30+Input!$C$14/TAN(Q27)>Input!$G$29,3,2))),999))","v":999},{"$f":"IF($V$24=1,IF(R27=999,999,IF($C$30+Input!$C$14/TAN(R27)<=Input!$G$28,1,IF($C$30+Input!$C$14/TAN(R27)>Input!$G$29,3,2))),IF($V$24=2,IF(R28=999,999,IF($C$30+Input!$C$14/TAN(R28)<=Input!$G$28,1,IF($C$30+Input!$C$14/TAN(R28)>Input!$G$29,3,2))),999))","v":999},null,null,{"$f":"IF($V$24=1,IF(U27=999,999,IF($C$30+Input!$C$14/TAN(U27)<=Input!$G$28,1,IF($C$30+Input!$C$14/TAN(U27)>Input!$G$29,3,2))),IF($V$24=2,IF(U28=999,999,IF($C$30+Input!$C$14/TAN(U28)<=Input!$G$28,1,IF($C$30+Input!$C$14/TAN(U28)>Input!$G$29,3,2))),IF(U29=999,999,IF($C$30+Input!$C$14/TAN(U29)<=Input!$G$28,1,IF($C$30+Input!$C$14/TAN(U29)>Input!$G$29,3,2)))))","v":999},"T Vertical Position (1,2,3)"]
[null,"tan alpha=",{"$f":"TAN(C26)","v":107.20626052488481},null,null,null,null,null,null,null,"zI2",{"$f":"Input!$G$30+Ref!F26/100*(Input!$G$9+Input!$C$9*Ref!C25+C32-Input!$C$9*TAN(Ref!C25/2)-Input!$G$28)+(Ref!F27-Ref!F26)*(Input!$G$9+Input!$C$9*Ref!C25+C32-Input!$C$9*TAN(Ref!C25/2)-Input!$G$28)^2/(200*Input!$C$29*5280)+Ref!F28","v":39.820902461425852},{"$f":"IF($V$24=1,IF(M27=999,999,IF(Input!$G$9+Input!$C$9*$C$25+SIN(M27)*(Input!$G$9-Ref!$C$30+Input!$C$9*TAN(Ref!$C$25/2))/SIN(Ref!$C$25-Ref!M27)<=Input!$G$28,1,IF(Input!$G$9+Input!$C$9*$C$25+SIN(M27)*(Input!$G$9-Ref!$C$30+Input!$C$9*TAN(Ref!$C$25/2))/SIN(Ref!$C$25-Ref!M27)>Input!$G$29,3,2))),999)","v":999},{"$f":"IF($V$24=1,IF(N27=999,999,IF(Input!$G$9+Input!$C$9*$C$25+SIN(N27)*(Input!$G$9-Ref!$C$30+Input!$C$9*TAN(Ref!$C$25/2))/SIN(Ref!$C$25-Ref!N27)<=Input!$G$28,1,IF(Input!$G$9+Input!$C$9*$C$25+SIN(N27)*(Input!$G$9-Ref!$C$30+Input!$C$9*TAN(Ref!$C$25/2))/SIN(Ref!$C$25-Ref!N27)>Input!$G$29,3,2))),999)","v":999},{"$f":"IF($V$24=1,IF(O27=999,999,IF(Input!$G$9+Input!$C$9*$C$25+SIN(O27)*(Input!$G$9-Ref!$C$30+Input!$C$9*TAN(Ref!$C$25/2))/SIN(Ref!$C$25-Ref!O27)<=Input!$G$28,1,IF(Input!$G$9+Input!$C$9*$C$25+SIN(O27)*(Input!$G$9-Ref!$C$30+Input!$C$9*TAN(Ref!$C$25/2))/SIN(Ref!$C$25-Ref!O27)>Input!$G$29,3,2))),999)","v":999},null,{"$f":"IF($V$24=1,IF(Q27=999,999,IF(Input!$G$9+Input!$C$9*$C$25+SIN(Q27)*(Input!$G$9-Ref!$C$30+Input!$C$9*TAN(Ref!$C$25/2))/SIN(Ref!$C$25-Ref!Q27)<=Input!$G$28,1,IF(Input!$G$9+Input!$C$9*$C$25+SIN(Q27)*(Input!$G$9-Ref!$C$30+Input!$C$9*TAN(Ref!$C$25/2))/SIN(Ref!$C$25-Ref!Q27)>Input!$G$29,3,2))),IF($V$24=2,IF(Q28=999,999,IF(Input!$G$9+Input!$C$9*$C$25+SIN(Q28)*(Input!$G$9-Ref!$C$30+Input!$C$9*TAN(Ref!$C$25/2))/SIN(Ref!$C$25-Ref!Q28)<=Input!$G$28,1,IF(Input!$G$9+Input!$C$9*$C$25+SIN(Q28)*(Input!$G$9-Ref!$C$30+Input!$C$9*TAN(Ref!$C$25/2))/SIN(Ref!$C$25-Ref!Q28)>Input!$G$29,3,2))),999))","v":999},{"$f":"IF($V$24=1,IF(R27=999,999,IF(Input!$G$9+Input!$C$9*$C$25+SIN(R27)*(Input!$G$9-Ref!$C$30+Input!$C$9*TAN(Ref!$C$25/2))/SIN(Ref!$C$25-Ref!R27)<=Input!$G$28,1,IF(Input!$G$9+Input!$C$9*$C$25+SIN(R27)*(Input!$G$9-Ref!$C$30+Input!$C$9*TAN(Ref!$C$25/2))/SIN(Ref!$C$25-Ref!R27)>Input!$G$29,3,2))),IF($V$24=2,IF(R28=999,999,IF(Input!$G$9+Input!$C$9*$C$25+SIN(R28)*(Input!$G$9-Ref!$C$30+Input!$C$9*TAN(Ref!$C$25/2))/SIN(Ref!$C$25-Ref!R28)<=Input!$G$28,1,IF(Input!$G$9+Input!$C$9*$C$25+SIN(R28)*(Input!$G$9-Ref!$C$30+Input!$C$9*TAN(Ref!$C$25/2))/SIN(Ref!$C$25-Ref!R28)>Input!$G$29,3,2))),999))","v":999},null,null,{"$f":"IF($V$24=1,IF(U27=999,999,IF(Input!$G$9+Input!$C$9*$C$25+SIN(U27)*(Input!$G$9-Ref!$C$30+Input!$C$9*TAN(Ref!$C$25/2))/SIN(Ref!$C$25-Ref!U27)<=Input!$G$28,1,IF(Input!$G$9+Input!$C$9*$C$25+SIN(U27)*(Input!$G$9-Ref!$C$30+Input!$C$9*TAN(Ref!$C$25/2))/SIN(Ref!$C$25-Ref!U27)>Input!$G$29,3,2))),IF($V$24=2,IF(U28=999,999,IF(Input!$G$9+Input!$C$9*$C$25+SIN(U28)*(Input!$G$9-Ref!$C$30+Input!$C$9*TAN(Ref!$C$25/2))/SIN(Ref!$C$25-Ref!U28)<=Input!$G$28,1,IF(Input!$G$9+Input!$C$9*$C$25+SIN(U28)*(Input!$G$9-Ref!$C$30+Input!$C$9*TAN(Ref!$C$25/2))/SIN(Ref!$C$25-Ref!U28)>Input!$G$29,3,2))),IF(U29=999,999,IF(Input!$G$9+Input!$C$9*$C$25+SIN(U29)*(Input!$G$9-Ref!$C$30+Input!$C$9*TAN(Ref!$C$25/2))/SIN(Ref!$C$25-Ref!U29)<=Input!$G$28,1,IF(Input!$G$9+Input!$C$9*$C$25+SIN(U29)*(Input!$G$9-Ref!$C$30+Input!$C$9*TAN(Ref!$C$25/2))/SIN(Ref!$C$25-Ref!U29)>Input!$G$29,3,2)))))","v":999},"I Vertical Position (1,2,3)"]
[null,"U=",{"$f":"SIN(C26)*(Input!$G$9-C30+Input!C9*TAN(C25/2))/SIN(C25-C26)","v":-1982.3349733842449},null,"S'=",null,null,null,null,null,"zI3",{"$f":"Input!$G$31+(Input!$G$9+Input!$C$9*Ref!C25+C32-Input!$C$9*TAN(Ref!C25/2)-Input!$G$29)*Ref!F27/100+Ref!F28","v":-51.906675583480776},{"$f":"IF(AND(M30=1,M31=1),1,999)","v":999},{"$f":"IF(AND(N30=1,N31=2),1,999)","v":999},{"$f":"IF(AND(O30=1,O31=3),1,999)","v":999},null,{"$f":"IF(AND(Q30=2,Q31=2),1,999)","v":999},{"$f":"IF(AND(R30=2,R31=3),1,999)","v":999},null,null,{"$f":"IF(AND(U30=3,U31=3),1,999)","v":999}]
[null,null,null,null,null,null,null,null,null,null,null,null,"zT1",null,null,"zT2",null,null,"zT3"]
[null,null,null,null,null,null,null,null,null,null,null,null,"zI1","zI2","zI3","zI1","zI2","zI3","zI1","zI2","zI3"]
[null,"3D Sightline Condition 3",null,null,"HT",{"$f":"Input!$C$35","v":4},null,null,null,3,"zC1",{"$f":"-(Input!$G$28-Ref!C41)*Ref!F37/100+Ref!F36","v":-9.8800000000000008},{"$f":"(L41-L35)/(Input!$G$9+Input!$C$9*SIN(Ref!$C$40)-Ref!C41)-(Ref!L38-Ref!L35)/(Input!$G$9+(Input!$C$9-Input!$C$14)*SIN(Ref!C36)-Ref!C41)","v":{"$error":"#NUM!"}},{"$f":"(L42-L35)/(Input!$G$9+Input!$C$9*SIN(Ref!$C$40)-Ref!C41)-(Ref!L38-Ref!L35)/(Input!$G$9+(Input!$C$9-Input!$C$14)*SIN(Ref!C36)-Ref!C41)","v":{"$error":"#NUM!"}},{"$f":"(L43-L35)/(Input!$G$9+Input!$C$9*SIN(Ref!$C$40)-Ref!C41)-(Ref!L38-Ref!L35)/(Input!$G$9+(Input!$C$9-Input!$C$14)*SIN(Ref!C36)-Ref!C41)","v":{"$error":"#NUM!"}},"x",{"$f":"(L42-L35)/(Input!$G$9+Input!$C$9*SIN(Ref!$C$40)-Ref!C41)-(Ref!L39-Ref!L35)/(Input!$G$9+(Input!$C$9-Input!$C$14)*SIN(Ref!C36)-Ref!C41)","v":{"$error":"#NUM!"}},{"$f":"(L43-L35)/(Input!$G$9+Input!$C$9*SIN(Ref!$C$40)-Ref!C41)-(Ref!L39-Ref!L35)/(Input!$G$9+(Input!$C$9-Input!$C$14)*SIN(Ref!C36)-Ref!C41)","v":{"$error":"#NUM!"}},"x","x",{"$f":"(L43-L35)/(Input!$G$9+Input!$C$9*SIN(Ref!$C$40)-Ref!C41)-(Ref!L40-Ref!L35)/(Input!$G$9+(Input!$C$9-Input!$C$14)*SIN(Ref!C36)-Ref!C41)","v":{"$error":"#NUM!"}},2,"=0"]
[null,"beta(rad)=",{"$f":"PI()/2+C37-ASIN((Input!C9-TAN(Ref!C37)*(Input!G9-Ref!C41))*SIN(PI()/2-Ref!C37)/(Input!C9-Input!C14))","v":{"$error":"#NUM!"}},null,"HC",{"$f":"Input!$C$34","v":3.5},null,null,null,null,"zC2",{"$f":"Input!$G$30+Ref!F37/100*(Ref!C41-Input!$G$28)+(Ref!F38-Ref!F37)*(Ref!C41-Input!$G$28)^2/(200*Input!$C$29*5280)+Ref!F36","v":-4.2289772727272714},"x","x","x","x",{"$f":"(L42-L36)/(Input!$G$9+Input!$C$9*SIN(Ref!$C$40)-Ref!C41)-(Ref!L39-Ref!L36)/(Input!$G$9+(Input!$C$9-Input!$C$14)*SIN(Ref!C36)-Ref!C41)","v":{"$error":"#NUM!"}},{"$f":"(L43-L36)/(Input!$G$9+Input!$C$9*SIN(Ref!$C$40)-Ref!C41)-(Ref!L39-Ref!L36)/(Input!$G$9+(Input!$C$9-Input!$C$14)*SIN(Ref!C36)-Ref!C41)","v":{"$error":"#NUM!"}},"x","x",{"$f":"(L43-L36)/(Input!$G$9+Input!$C$9*SIN(Ref!$C$40)-Ref!C41)-(Ref!L40-Ref!L36)/(Input!$G$9+(Input!$C$9-Input!$C$14)*SIN(Ref!C36)-Ref!C41)","v":{"$error":"#NUM!"}}]
[null,"alpha(rad)=",0,null,"G1",{"$f":"Input!$C$30","v":-3},null,null,null,null,"zC3",{"$f":"Input!$G$31+(Ref!C41-Input!$G$29)*Ref!F38/100+Ref!F36","v":-14.799999999999997},"x","x","x","x","x","x","x","x",{"$f":"(L43-L37)/(Input!$G$9+Input!$C$9*SIN(Ref!$C$40)-Ref!C41)-(Ref!L40-Ref!L37)/(Input!$G$9+(Input!$C$9-Input!$C$14)*SIN(Ref!C36)-Ref!C41)","v":{"$error":"#NUM!"}}]
[null,"0=",null,null,"G2",{"$f":"Input!$C$31","v":3},null,null,null,null,"zT1",{"$f":"-(Input!$G$28-Input!$G$9-Input!$C$9*Ref!C36)*Ref!F37/100+Ref!F35","v":{"$error":"#NUM!"}},999,999,999,"x",999,999,"x","x",999,"zC1","Alpha","=999 if no alpha found"]
[null,null,null,null,"Hmin",3,null,null,null,null,"zT2",{"$f":"Input!$G$30+Ref!F37/100*(Input!$G$9+Input!$C$9*Ref!C36-Input!$G$28)+(Ref!F38-Ref!F37)*(Input!$G$9+Input!$C$9*Ref!C36-Input!$G$28)^2/(200*Input!$C$29*5280)+Ref!F35","v":{"$error":"#NUM!"}},"x","x","x","x",999,999,"x","x",999,"zC2"]
[null,"theta(rad)=",{"$f":"PI()/2+C37-ASIN((Input!C9-TAN(Ref!C37)*(Input!G9-Ref!C41))*SIN(PI()/2-Ref!C37)/(Input!C9))","v":0},null,"Use solver to find a theta that makes C44=0",null,null,null,null,null,"zT3",{"$f":"Input!$G$31+(Input!$G$9+Input!$C$9*Ref!C36-Input!$G$29)*Ref!F38/100+Ref!F35","v":{"$error":"#NUM!"}},"x","x","x","x","x","x","x","x",null,"zC3"]
[null,"E=",600,null,null,null,null,null,null,null,"zI1",{"$f":"-(Input!$G$28-Input!$G$9-Input!$C$9*Ref!C40)*Ref!F37/100+Ref!F39","v":-12.84},{"$f":"IF($V$35=1,IF(M38=999,999,IF(Input!$G$9+Input!$C$9*(PI()/2+M38-ASIN((Input!$C$9-TAN(M38)*(Input!$G$9-Ref!$C$41))*SIN(PI()/2-M38)/(Input!$C$9-Input!$C$14)))<=Input!$G$28,1,IF(Input!$G$9+Input!$C$9*(PI()/2+M38-ASIN((Input!$C$9-TAN(M38)*(Input!$G$9-Ref!$C$41))*SIN(PI()/2-M38)/(Input!$C$9-Input!$C$14)))>Input!$G$29,3,2))),999)","v":999},{"$f":"IF($V$35=1,IF(N38=999,999,IF(Input!$G$9+Input!$C$9*(PI()/2+N38-ASIN((Input!$C$9-TAN(N38)*(Input!$G$9-Ref!$C$41))*SIN(PI()/2-N38)/(Input!$C$9-Input!$C$14)))<=Input!$G$28,1,IF(Input!$G$9+Input!$C$9*(PI()/2+N38-ASIN((Input!$C$9-TAN(N38)*(Input!$G$9-Ref!$C$41))*SIN(PI()/2-N38)/(Input!$C$9-Input!$C$14)))>Input!$G$29,3,2))),999)","v":999},{"$f":"IF($V$35=1,IF(O38=999,999,IF(Input!$G$9+Input!$C$9*(PI()/2+O38-ASIN((Input!$C$9-TAN(O38)*(Input!$G$9-Ref!$C$41))*SIN(PI()/2-O38)/(Input!$C$9-Input!$C$14)))<=Input!$G$28,1,IF(Input!$G$9+Input!$C$9*(PI()/2+O38-ASIN((Input!$C$9-TAN(O38)*(Input!$G$9-Ref!$C$41))*SIN(PI()/2-O38)/(Input!$C$9-Input!$C$14)))>Input!$G$29,3,2))),999)","v":999},null,{"$f":"IF($V$35=1,IF(Q38=999,999,IF(Input!$G$9+Input!$C$9*(PI()/2+Q38-ASIN((Input!$C$9-TAN(Q38)*(Input!$G$9-Ref!$C$41))*SIN(PI()/2-Q38)/(Input!$C$9-Input!$C$14)))<=Input!$G$28,1,IF(Input!$G$9+Input!$C$9*(PI()/2+Q38-ASIN((Input!$C$9-TAN(Q38)*(Input!$G$9-Ref!$C$41))*SIN(PI()/2-Q38)/(Input!$C$9-Input!$C$14)))>Input!$G$29,3,2))),IF($V$35=2,IF(Q39=999,999,IF(Input!$G$9+Input!$C$9*(PI()/2+Q39-ASIN((Input!$C$9-TAN(Q39)*(Input!$G$9-Ref!$C$41))*SIN(PI()/2-Q39)/(Input!$C$9-Input!$C$14)))<=Input!$G$28,1,IF(Input!$G$9+Input!$C$9*(PI()/2+Q39-ASIN((Input!$C$9-TAN(Q39)*(Input!$G$9-Ref!$C$41))*SIN(PI()/2-Q39)/(Input!$C$9-Input!$C$14)))>Input!$G$29,3,2))),999))","v":999},{"$f":"IF($V$35=1,IF(R38=999,999,IF(Input!$G$9+Input!$C$9*(PI()/2+R38-ASIN((Input!$C$9-TAN(R38)*(Input!$G$9-Ref!$C$41))*SIN(PI()/2-R38)/(Input!$C$9-Input!$C$14)))<=Input!$G$28,1,IF(Input!$G$9+Input!$C$9*(PI()/2+R38-ASIN((Input!$C$9-TAN(R38)*(Input!$G$9-Ref!$C$41))*SIN(PI()/2-R38)/(Input!$C$9-Input!$C$14)))>Input!$G$29,3,2))),IF($V$35=2,IF(R39=999,999,IF(Input!$G$9+Input!$C$9*(PI()/2+R39-ASIN((Input!$C$9-TAN(R39)*(Input!$G$9-Ref!$C$41))*SIN(PI()/2-R39)/(Input!$C$9-Input!$C$14)))<=Input!$G$28,1,IF(Input!$G$9+Input!$C$9*(PI()/2+R39-ASIN((Input!$C$9-TAN(R39)*(Input!$G$9-Ref!$C$41))*SIN(PI()/2-R39)/(Input!$C$9-Input!$C$14)))>Input!$G$29,3,2))),999))","v":999},null,null,{"$f":"IF($V$35=1,IF(U38=999,999,IF(Input!$G$9+Input!$C$9*(PI()/2+U38-ASIN((Input!$C$9-TAN(U38)*(Input!$G$9-Ref!$C$41))*SIN(PI()/2-U38)/(Input!$C$9-Input!$C$14)))<=Input!$G$28,1,IF(Input!$G$9+Input!$C$9*(PI()/2+U38-ASIN((Input!$C$9-TAN(U38)*(Input!$G$9-Ref!$C$41))*SIN(PI()/2-U38)/(Input!$C$9-Input!$C$14)))>Input!$G$29,3,2))),IF($V$35=2,IF(U39=999,999,IF(Input!$G$9+Input!$C$9*(PI()/2+U39-ASIN((Input!$C$9-TAN(U39)*(Input!$G$9-Ref!$C$41))*SIN(PI()/2-U39)/(Input!$C$9-Input!$C$14)))<=Input!$G$28,1,IF(Input!$G$9+Input!$C$9*(PI()/2+U39-ASIN((Input!$C$9-TAN(U39)*(Input!$G$9-Ref!$C$41))*SIN(PI()/2-U39)/(Input!$C$9-Input!$C$14)))>Input!$G$29,3,2))),IF(U40=999,999,IF(Input!$G$9+Input!$C$9*(PI()/2+U40-ASIN((Input!$C$9-TAN(U40)*(Input!$G$9-Ref!$C$41))*SIN(PI()/2-U40)/(Input!$C$9-Input!$C$14)))<=Input!$G$28,1,IF(Input!$G$9+Input!$C$9*(PI()/2+U40-ASIN((Input!$C$9-TAN(U39)*(Input!$G$9-Ref!$C$41))*SIN(PI()/2-U40)/(Input!$C$9-Input!$C$14)))>Input!$G$29,3,2)))))","v":999},"T Vertical Position (1,2,3)"]
[null,null,null,null,null,null,null,null,null,null,"zI2",{"$f":"Input!$G$30+Ref!F37/100*(Input!$G$9+Input!$C$9*Ref!C40-Input!$G$28)+(Ref!F38-Ref!F37)*(Input!$G$9+Input!$C$9*Ref!C40-Input!$G$28)^2/(200*Input!$C$29*5280)+Ref!F39","v":-4.92},{"$f":"IF($V$35=1,IF(M38=999,999,IF(Input!$G$9+Input!$C$9*(PI()/2+M38-ASIN((Input!$C$9-TAN(M38)*(Input!$G$9-Ref!$C$41))*SIN(PI()/2-M38)/(Input!$C$9)))<=Input!$G$28,1,IF(Input!$G$9+Input!$C$9*(PI()/2+M38-ASIN((Input!$C$9-TAN(M38)*(Input!$G$9-Ref!$C$41))*SIN(PI()/2-M38)/(Input!$C$9)))>Input!$G$29,3,2))),999)","v":999},{"$f":"IF($V$35=1,IF(N38=999,999,IF(Input!$G$9+Input!$C$9*(PI()/2+N38-ASIN((Input!$C$9-TAN(N38)*(Input!$G$9-Ref!$C$41))*SIN(PI()/2-N38)/(Input!$C$9)))<=Input!$G$28,1,IF(Input!$G$9+Input!$C$9*(PI()/2+N38-ASIN((Input!$C$9-TAN(N38)*(Input!$G$9-Ref!$C$41))*SIN(PI()/2-N38)/(Input!$C$9)))>Input!$G$29,3,2))),999)","v":999},{"$f":"IF($V$35=1,IF(O38=999,999,IF(Input!$G$9+Input!$C$9*(PI()/2+O38-ASIN((Input!$C$9-TAN(O38)*(Input!$G$9-Ref!$C$41))*SIN(PI()/2-O38)/(Input!$C$9)))<=Input!$G$28,1,IF(Input!$G$9+Input!$C$9*(PI()/2+O38-ASIN((Input!$C$9-TAN(O38)*(Input!$G$9-Ref!$C$41))*SIN(PI()/2-O38)/(Input!$C$9)))>Input!$G$29,3,2))),999)","v":999},null,{"$f":"IF($V$35=1,IF(Q38=999,999,IF(Input!$G$9+Input!$C$9*(PI()/2+Q38-ASIN((Input!$C$9-TAN(Q38)*(Input!$G$9-Ref!$C$41))*SIN(PI()/2-Q38)/(Input!$C$9)))<=Input!$G$28,1,IF(Input!$G$9+Input!$C$9*(PI()/2+Q38-ASIN((Input!$C$9-TAN(Q38)*(Input!$G$9-Ref!$C$41))*SIN(PI()/2-Q38)/(Input!$C$9)))>Input!$G$29,3,2))),IF($V$35=2,IF(Q39=999,999,IF(Input!$G$9+Input!$C$9*(PI()/2+Q39-ASIN((Input!$C$9-TAN(Q39)*(Input!$G$9-Ref!$C$41))*SIN(PI()/2-Q39)/(Input!$C$9)))<=Input!$G$28,1,IF(Input!$G$9+Input!$C$9*(PI()/2+Q39-ASIN((Input!$C$9-TAN(Q39)*(Input!$G$9-Ref!$C$41))*SIN(PI()/2-Q39)/(Input!$C$9)))>Input!$G$29,3,2))),999))","v":999},{"$f":"IF($V$35=1,IF(R38=999,999,IF(Input!$G$9+Input!$C$9*(PI()/2+R38-ASIN((Input!$C$9-TAN(R38)*(Input!$G$9-Ref!$C$41))*SIN(PI()/2-R38)/(Input!$C$9)))<=Input!$G$28,1,IF(Input!$G$9+Input!$C$9*(PI()/2+R38-ASIN((Input!$C$9-TAN(R38)*(Input!$G$9-Ref!$C$41))*SIN(PI()/2-R38)/(Input!$C$9)))>Input!$G$29,3,2))),IF($V$35=2,IF(R39=999,999,IF(Input!$G$9+Input!$C$9*(PI()/2+R39-ASIN((Input!$C$9-TAN(R39)*(Input!$G$9-Ref!$C$41))*SIN(PI()/2-R39)/(Input!$C$9)))<=Input!$G$28,1,IF(Input!$G$9+Input!$C$9*(PI()/2+R39-ASIN((Input!$C$9-TAN(R39)*(Input!$G$9-Ref!$C$41))*SIN(PI()/2-R39)/(Input!$C$9)))>Input!$G$29,3,2))),999))","v":999},null,null,{"$f":"IF($V$35=1,IF(U38=999,999,IF(Input!$G$9+Input!$C$9*(PI()/2+U38-ASIN((Input!$C$9-TAN(U38)*(Input!$G$9-Ref!$C$41))*SIN(PI()/2-U38)/(Input!$C$9)))<=Input!$G$28,1,IF(Input!$G$9+Input!$C$9*(PI()/2+U38-ASIN((Input!$C$9-TAN(U38)*(Input!$G$9-Ref!$C$41))*SIN(PI()/2-U38)/(Input!$C$9)))>Input!$G$29,3,2))),IF($V$35=2,IF(U39=999,999,IF(Input!$G$9+Input!$C$9*(PI()/2+U39-ASIN((Input!$C$9-TAN(U39)*(Input!$G$9-Ref!$C$41))*SIN(PI()/2-U39)/(Input!$C$9)))<=Input!$G$28,1,IF(Input!$G$9+Input!$C$9*(PI()/2+U39-ASIN((Input!$C$9-TAN(U39)*(Input!$G$9-Ref!$C$41))*SIN(PI()/2-U39)/(Input!$C$9)))>Input!$G$29,3,2))),IF(U40=999,999,IF(Input!$G$9+Input!$C$9*(PI()/2+U40-ASIN((Input!$C$9-TAN(U40)*(Input!$G$9-Ref!$C$41))*SIN(PI()/2-U40)/(Input!$C$9)))<=Input!$G$28,1,IF(Input!$G$9+Input!$C$9*(PI()/2+U40-ASIN((Input!$C$9-TAN(U39)*(Input!$G$9-Ref!$C$41))*SIN(PI()/2-U40)/(Input!$C$9)))>Input!$G$29,3,2)))))","v":999},"I Vertical Position (1,2,3)"]
[null,"alpha=",null,null,"S'=",null,null,null,null,null,"zI3",{"$f":"Input!$G$31+(Input!$G$9+Input!$C$9*Ref!C40-Input!$G$29)*Ref!F38/100+Ref!F39","v":-12.839999999999996},{"$f":"IF(AND(M41=1,M42=1),1,999)","v":999},{"$f":"IF(AND(N41=1,N42=2),1,999)","v":999},{"$f":"IF(AND(O41=1,O42=3),1,999)","v":999},null,{"$f":"IF(AND(Q41=2,Q42=2),1,999)","v":999},{"$f":"IF(AND(R41=2,R42=3),1,999)","v":999},null,null,{"$f":"IF(AND(U41=3,U42=3),1,999)","v":999}]
[null,null,null,null,null,null,null,null,null,null,null,null,"zT1",null,null,"zT2",null,null,"zT3"]
[null,null,null,null,null,null,null,null,null,null,null,null,"zI1","zI2","zI3","zI1","zI2","zI3","zI1","zI2","zI3"]
[null,"3D Sightline Condition 4",null,null,"HT",{"$f":"Input!$C$35","v":4},null,null,null,4,"zC1",{"$f":"-(Input!$G$28-Ref!C52)*Ref!F48/100+Ref!F47","v":-9.8800000000000008},{"$f":"(L52-L46)/($C$54*COS($C$50)+Input!$G$9+Input!$C$9*TAN(Ref!$C$50/2)-Ref!$C$52)-(Ref!L49-Ref!L46)/(Input!$G$9+(Input!$C$9-Input!$C$14)*SIN(Ref!C48)-Ref!$C$52)","v":2.2922869251081057E-4},{"$f":"(L53-L46)/($C$54*COS($C$50)+Input!$G$9+Input!$C$9*TAN(Ref!$C$50/2)-Ref!$C$52)-(Ref!L49-Ref!L46)/(Input!$G$9+(Input!$C$9-Input!$C$14)*SIN(Ref!C48)-Ref!$C$52)","v":6.3577553710308904E-2},{"$f":"(L54-L46)/($C$54*COS($C$50)+Input!$G$9+Input!$C$9*TAN(Ref!$C$50/2)-Ref!$C$52)-(Ref!L49-Ref!L46)/(Input!$G$9+(Input!$C$9-Input!$C$14)*SIN(Ref!C48)-Ref!$C$52)","v":5.6473650174796275E-2},null,{"$f":"(L53-L46)/($C$54*COS($C$50)+Input!$G$9+Input!$C$9*TAN(Ref!$C$50/2)-Ref!$C$52)-(Ref!L50-Ref!L46)/(Input!$G$9+(Input!$C$9-Input!$C$14)*SIN(Ref!C48)-Ref!$C$52)","v":6.2245331410360621E-4},{"$f":"(L54-L46)/($C$54*COS($C$50)+Input!$G$9+Input!$C$9*TAN(Ref!$C$50/2)-Ref!$C$52)-(Ref!L50-Ref!L46)/(Input!$G$9+(Input!$C$9-Input!$C$14)*SIN(Ref!C48)-Ref!$C$52)","v":-6.4814502214090262E-3},null,null,{"$f":"(L54-L46)/($C$54*COS($C$50)+Input!$G$9+Input!$C$9*TAN(Ref!$C$50/2)-Ref!$C$52)-(Ref!L51-Ref!L46)/(Input!$G$9+(Input!$C$9-Input!$C$14)*SIN(Ref!C48)-Ref!$C$52)","v":-2.769380635531643E-3},2,"=0"]
[null,"alpha(rad)=",{"$f":"ATAN((Input!$C$9-Input!$C$14-(Input!$C$9-Input!$C$14)*COS(C48))/(Input!$G$9-$C$52+(Input!$C$9-Input!$C$14)*SIN(C48)))","v":0.25695840733763314},null,"HC",{"$f":"Input!$C$34","v":3.5},null,null,null,null,"zC2",{"$f":"Input!$G$30+Ref!F48/100*(Ref!C52-Input!$G$28)+(Ref!F49-Ref!F48)*(Ref!C52-Input!$G$28)^2/(200*Input!$C$29*5280)+Ref!F47","v":-4.2289772727272714},null,null,null,null,{"$f":"(L53-L47)/($C$54*COS($C$50)+Input!$G$9+Input!$C$9*TAN(Ref!$C$50/2)-Ref!$C$52)-(Ref!L50-Ref!L47)/(Input!$G$9+(Input!$C$9-Input!$C$14)*SIN(Ref!C48)-Ref!$C$52)","v":2.061648493441981E-3},{"$f":"(L54-L47)/($C$54*COS($C$50)+Input!$G$9+Input!$C$9*TAN(Ref!$C$50/2)-Ref!$C$52)-(Ref!L50-Ref!L47)/(Input!$G$9+(Input!$C$9-Input!$C$14)*SIN(Ref!C48)-Ref!$C$52)","v":-5.042255042070648E-3},null,null,{"$f":"(L54-L47)/($C$54*COS($C$50)+Input!$G$9+Input!$C$9*TAN(Ref!$C$50/2)-Ref!$C$52)-(Ref!L51-Ref!L47)/(Input!$G$9+(Input!$C$9-Input!$C$14)*SIN(Ref!C48)-Ref!$C$52)","v":-1.3301854561932648E-3}]
[null,"beta(rad)=",0.56422978291473092,null,"G1",{"$f":"Input!$C$30","v":-3},null,null,null,null,"zC3",{"$f":"Input!$G$31+(Ref!C52-Input!$G$29)*Ref!F49/100+Ref!F47","v":-14.799999999999997},null,null,null,null,null,null,null,null,{"$f":"(L54-L48)/($C$54*COS($C$50)+Input!$G$9+Input!$C$9*TAN(Ref!$C$50/2)-Ref!$C$52)-(Ref!L51-Ref!L48)/(Input!$G$9+(Input!$C$9-Input!$C$14)*SIN(Ref!C48)-Ref!$C$52)","v":-4.0223998895812761E-3}]
[null,"0=",null,null,"G2",{"$f":"Input!$C$31","v":3},null,null,null,null,"zT1",{"$f":"-(Input!$G$28-Input!$G$9-Input!$C$9*Ref!C48)*Ref!F48/100+Ref!F46","v":-37.839708396710805},999,999,999,null,999,999,null,null,999,"zC1","Beta","=999 if no alpha found"]
[null,"Delta(rad)=",{"$f":"Input!G11","v":1.03125},null,"Hmin",{"$f":"Input!$C$36","v":2},null,null,null,null,"zT2",{"$f":"Input!$G$30+Ref!F48/100*(Input!$G$9+Input!$C$9*Ref!C48-Input!$G$28)+(Ref!F49-Ref!F48)*(Input!$G$9+Input!$C$9*Ref!C48-Input!$G$28)^2/(200*Input!$C$29*5280)+Ref!F46","v":17.417905199305373},null,null,null,null,999,999,null,null,999,"zC2"]
[null,"U=",{"$f":"(SIN(C47)*(Input!$G$9-C52+Input!$C$9*TAN(Input!$G$11/2)))/SIN(Input!$G$11-C47)","v":346.22245074642512},null,"Use solver to find a theta that makes C44=0",null,null,null,null,null,"zT3",{"$f":"Input!$G$31+(Input!$G$9+Input!$C$9*Ref!C48-Input!$G$29)*Ref!F49/100+Ref!F46","v":14.159708396710805},null,null,null,null,null,null,null,null,999,"zC3"]
[null,"E=",600,null,null,null,null,null,null,null,"zI1",{"$f":"-(Input!$G$28-Input!$G$9-Input!$C$9*Ref!C50-C54+Input!$C$9*TAN(Ref!C50/2))*Ref!F48/100+Ref!F50","v":-45.630047140439331},{"$f":"IF($V$46=1,IF(M49=999,999,IF(Input!$G$9+Input!$C$9*M49<=Input!$G$28,1,IF(Input!$G$9+Input!$C$9*M49>Input!$G$29,3,2))),999)","v":999},{"$f":"IF($V$46=1,IF(N49=999,999,IF(Input!$G$9+Input!$C$9*N49<=Input!$G$28,1,IF(Input!$G$9+Input!$C$9*N49>Input!$G$29,3,2))),999)","v":999},{"$f":"IF($V$46=1,IF(O49=999,999,IF(Input!$G$9+Input!$C$9*O49<=Input!$G$28,1,IF(Input!$G$9+Input!$C$9*O49>Input!$G$29,3,2))),999)","v":999},null,{"$f":"IF($V$46=1,IF(Q49=999,999,IF(Input!$G$9+Input!$C$9*Q49<=Input!$G$28,1,IF(Input!$G$9+Input!$C$9*Q49>Input!$G$29,3,2))),IF($V$46=2,IF(Q50=999,999,IF(Input!$G$9+Input!$C$9*Q50<=Input!$G$28,1,IF(Input!$G$9+Input!$C$9*Q50>Input!$G$29,3,2))),999))","v":999},{"$f":"IF($V$46=1,IF(R49=999,999,IF(Input!$G$9+Input!$C$9*R49<=Input!$G$28,1,IF(Input!$G$9+Input!$C$9*R49>Input!$G$29,3,2))),IF($V$46=2,IF(R50=999,999,IF(Input!$G$9+Input!$C$9*R50<=Input!$G$28,1,IF(Input!$G$9+Input!$C$9*R50>Input!$G$29,3,2))),999))","v":999},null,null,{"$f":"IF($V$46=1,IF(U49=999,999,IF(Input!$G$9+Input!$C$9*U49<=Input!$G$28,1,IF(Input!$G$9+Input!$C$9*U49>Input!$G$29,3,2))),IF($V$46=2,IF(U50=999,999,IF(Input!$G$9+Input!$C$9*U50<=Input!$G$28,1,IF(Input!$G$9+Input!$C$9*U50>Input!$G$29,3,2))),IF(U51=999,999,IF(Input!$G$9+Input!$C$9*U51<=Input!$G$28,1,IF(Input!$G$9+Input!$C$9*U51>Input!$G$29,3,2)))))","v":999},"T Vertical Position (1,2,3)"]
[null,null,null,null,null,null,null,null,null,null,"zI2",{"$f":"Input!$G$30+Ref!F48/100*(Input!$G$9+Input!$C$9*Ref!C50+C54-Input!$C$9*TAN(Ref!C50/2)-Input!$G$28)+(Ref!F49-Ref!F48)*(Input!$G$9+Input!$C$9*Ref!C50+C54-Input!$C$9*TAN(Ref!C50/2)-Input!$G$28)^2/(200*Input!$C$29*5280)+Ref!F50","v":25.980476552757423},{"$f":"IF($V$46=1,IF(M49=999,999,IF(Input!$G$9+Input!$C$9*$C$50+SIN(ATAN((Input!$C$9-Input!$C$14-(Input!$C$9-Input!$C$14)*COS(M49))/(Input!$G$9-$C$52+(Input!$C$9-Input!$C$14)*SIN(M49))))*(Input!$G$9-Ref!$C$52+Input!$C$9*TAN(Ref!$C$50/2))/SIN(Ref!$C$50-ATAN((Input!$C$9-Input!$C$14-(Input!$C$9-Input!$C$14)*COS(M49))/(Input!$G$9-$C$52+(Input!$C$9-Input!$C$14)*SIN(M49))))<=Input!$G$28,1,IF(Input!$G$9+Input!$C$9*$C$50+SIN(ATAN((Input!$C$9-Input!$C$14-(Input!$C$9-Input!$C$14)*COS(M49))/(Input!$G$9-$C$52+(Input!$C$9-Input!$C$14)*SIN(M49))))*(Input!$G$9-Ref!$C$52+Input!$C$9*TAN(Ref!$C$50/2))/SIN(Ref!$C$50-ATAN((Input!$C$9-Input!$C$14-(Input!$C$9-Input!$C$14)*COS(M49))/(Input!$G$9-$C$52+(Input!$C$9-Input!$C$14)*SIN(M49))))>Input!$G$29,3,2))),999)","v":999},{"$f":"IF($V$46=1,IF(N49=999,999,IF(Input!$G$9+Input!$C$9*$C$50+SIN(ATAN((Input!$C$9-Input!$C$14-(Input!$C$9-Input!$C$14)*COS(N49))/(Input!$G$9-$C$52+(Input!$C$9-Input!$C$14)*SIN(N49))))*(Input!$G$9-Ref!$C$52+Input!$C$9*TAN(Ref!$C$50/2))/SIN(Ref!$C$50-ATAN((Input!$C$9-Input!$C$14-(Input!$C$9-Input!$C$14)*COS(N49))/(Input!$G$9-$C$52+(Input!$C$9-Input!$C$14)*SIN(N49))))<=Input!$G$28,1,IF(Input!$G$9+Input!$C$9*$C$50+SIN(ATAN((Input!$C$9-Input!$C$14-(Input!$C$9-Input!$C$14)*COS(N49))/(Input!$G$9-$C$52+(Input!$C$9-Input!$C$14)*SIN(N49))))*(Input!$G$9-Ref!$C$52+Input!$C$9*TAN(Ref!$C$50/2))/SIN(Ref!$C$50-ATAN((Input!$C$9-Input!$C$14-(Input!$C$9-Input!$C$14)*COS(N49))/(Input!$G$9-$C$52+(Input!$C$9-Input!$C$14)*SIN(N49))))>Input!$G$29,3,2))),999)","v":999},{"$f":"IF($V$46=1,IF(O49=999,999,IF(Input!$G$9+Input!$C$9*$C$50+SIN(ATAN((Input!$C$9-Input!$C$14-(Input!$C$9-Input!$C$14)*COS(O49))/(Input!$G$9-$C$52+(Input!$C$9-Input!$C$14)*SIN(O49))))*(Input!$G$9-Ref!$C$52+Input!$C$9*TAN(Ref!$C$50/2))/SIN(Ref!$C$50-ATAN((Input!$C$9-Input!$C$14-(Input!$C$9-Input!$C$14)*COS(O49))/(Input!$G$9-$C$52+(Input!$C$9-Input!$C$14)*SIN(O49))))<=Input!$G$28,1,IF(Input!$G$9+Input!$C$9*$C$50+SIN(ATAN((Input!$C$9-Input!$C$14-(Input!$C$9-Input!$C$14)*COS(O49))/(Input!$G$9-$C$52+(Input!$C$9-Input!$C$14)*SIN(O49))))*(Input!$G$9-Ref!$C$52+Input!$C$9*TAN(Ref!$C$50/2))/SIN(Ref!$C$50-ATAN((Input!$C$9-Input!$C$14-(Input!$C$9-Input!$C$14)*COS(O49))/(Input!$G$9-$C$52+(Input!$C$9-Input!$C$14)*SIN(O49))))>Input!$G$29,3,2))),999)","v":999},null,{"$f":"IF($V$46=1,IF(Q49=999,999,IF(Input!$G$9+Input!$C$9*$C$50+SIN(ATAN((Input!$C$9-Input!$C$14-(Input!$C$9-Input!$C$14)*COS(Q49))/(Input!$G$9-$C$52+(Input!$C$9-Input!$C$14)*SIN(Q49))))*(Input!$G$9-Ref!$C$52+Input!$C$9*TAN(Ref!$C$50/2))/SIN(Ref!$C$50-ATAN((Input!$C$9-Input!$C$14-(Input!$C$9-Input!$C$14)*COS(Q49))/(Input!$G$9-$C$52+(Input!$C$9-Input!$C$14)*SIN(Q49))))<=Input!$G$28,1,IF(Input!$G$9+Input!$C$9*$C$50+SIN(ATAN((Input!$C$9-Input!$C$14-(Input!$C$9-Input!$C$14)*COS(Q49))/(Input!$G$9-$C$52+(Input!$C$9-Input!$C$14)*SIN(Q49))))*(Input!$G$9-Ref!$C$52+Input!$C$9*TAN(Ref!$C$50/2))/SIN(Ref!$C$50-ATAN((Input!$C$9-Input!$C$14-(Input!$C$9-Input!$C$14)*COS(Q49))/(Input!$G$9-$C$52+(Input!$C$9-Input!$C$14)*SIN(Q49))))>Input!$G$29,3,2))),IF($V$46=2,IF(Q50=999,999,IF(Input!$G$9+Input!$C$9*$C$50+SIN(ATAN((Input!$C$9-Input!$C$14-(Input!$C$9-Input!$C$14)*COS(Q50))/(Input!$G$9-$C$52+(Input!$C$9-Input!$C$14)*SIN(Q50))))*(Input!$G$9-Ref!$C$52+Input!$C$9*TAN(Ref!$C$50/2))/SIN(Ref!$C$50-ATAN((Input!$C$9-Input!$C$14-(Input!$C$9-Input!$C$14)*COS(Q50))/(Input!$G$9-$C$52+(Input!$C$9-Input!$C$14)*SIN(Q50))))<=Input!$G$28,1,IF(Input!$G$9+Input!$C$9*$C$50+SIN(ATAN((Input!$C$9-Input!$C$14-(Input!$C$9-Input!$C$14)*COS(Q50))/(Input!$G$9-$C$52+(Input!$C$9-Input!$C$14)*SIN(Q50))))*(Input!$G$9-Ref!$C$52+Input!$C$9*TAN(Ref!$C$50/2))/SIN(Ref!$C$50-ATAN((Input!$C$9-Input!$C$14-(Input!$C$9-Input!$C$14)*COS(Q50))/(Input!$G$9-$C$52+(Input!$C$9-Input!$C$14)*SIN(Q50))))>Input!$G$29,3,2))),999))","v":999},{"$f":"IF($V$46=1,IF(R49=999,999,IF(Input!$G$9+Input!$C$9*$C$50+SIN(ATAN((Input!$C$9-Input!$C$14-(Input!$C$9-Input!$C$14)*COS(R49))/(Input!$G$9-$C$52+(Input!$C$9-Input!$C$14)*SIN(R49))))*(Input!$G$9-Ref!$C$52+Input!$C$9*TAN(Ref!$C$50/2))/SIN(Ref!$C$50-ATAN((Input!$C$9-Input!$C$14-(Input!$C$9-Input!$C$14)*COS(R49))/(Input!$G$9-$C$52+(Input!$C$9-Input!$C$14)*SIN(R49))))<=Input!$G$28,1,IF(Input!$G$9+Input!$C$9*$C$50+SIN(ATAN((Input!$C$9-Input!$C$14-(Input!$C$9-Input!$C$14)*COS(R49))/(Input!$G$9-$C$52+(Input!$C$9-Input!$C$14)*SIN(R49))))*(Input!$G$9-Ref!$C$52+Input!$C$9*TAN(Ref!$C$50/2))/SIN(Ref!$C$50-ATAN((Input!$C$9-Input!$C$14-(Input!$C$9-Input!$C$14)*COS(R49))/(Input!$G$9-$C$52+(Input!$C$9-Input!$C$14)*SIN(R49))))>Input!$G$29,3,2))),IF($V$46=2,IF(R50=999,999,IF(Input!$G$9+Input!$C$9*$C$50+SIN(ATAN((Input!$C$9-Input!$C$14-(Input!$C$9-Input!$C$14)*COS(R50))/(Input!$G$9-$C$52+(Input!$C$9-Input!$C$14)*SIN(R50))))*(Input!$G$9-Ref!$C$52+Input!$C$9*TAN(Ref!$C$50/2))/SIN(Ref!$C$50-ATAN((Input!$C$9-Input!$C$14-(Input!$C$9-Input!$C$14)*COS(R50))/(Input!$G$9-$C$52+(Input!$C$9-Input!$C$14)*SIN(R50))))<=Input!$G$28,1,IF(Input!$G$9+Input!$C$9*$C$50+SIN(ATAN((Input!$C$9-Input!$C$14-(Input!$C$9-Input!$C$14)*COS(R50))/(Input!$G$9-$C$52+(Input!$C$9-Input!$C$14)*SIN(R50))))*(Input!$G$9-Ref!$C$52+Input!$C$9*TAN(Ref!$C$50/2))/SIN(Ref!$C$50-ATAN((Input!$C$9-Input!$C$14-(Input!$C$9-Input!$C$14)*COS(R50))/(Input!$G$9-$C$52+(Input!$C$9-Input!$C$14)*SIN(R50))))>Input!$G$29,3,2))),999))","v":999},null,null,{"$f":"IF($V$46=1,IF(U49=999,999,IF(Input!$G$9+Input!$C$9*$C$50+SIN(ATAN((Input!$C$9-Input!$C$14-(Input!$C$9-Input!$C$14)*COS(U49))/(Input!$G$9-$C$52+(Input!$C$9-Input!$C$14)*SIN(U49))))*(Input!$G$9-Ref!$C$52+Input!$C$9*TAN(Ref!$C$50/2))/SIN(Ref!$C$50-ATAN((Input!$C$9-Input!$C$14-(Input!$C$9-Input!$C$14)*COS(U49))/(Input!$G$9-$C$52+(Input!$C$9-Input!$C$14)*SIN(U49))))<=Input!$G$28,1,IF(Input!$G$9+Input!$C$9*$C$50+SIN(ATAN((Input!$C$9-Input!$C$14-(Input!$C$9-Input!$C$14)*COS(U49))/(Input!$G$9-$C$52+(Input!$C$9-Input!$C$14)*SIN(U49))))*(Input!$G$9-Ref!$C$52+Input!$C$9*TAN(Ref!$C$50/2))/SIN(Ref!$C$50-ATAN((Input!$C$9-Input!$C$14-(Input!$C$9-Input!$C$14)*COS(U49))/(Input!$G$9-$C$52+(Input!$C$9-Input!$C$14)*SIN(U49))))>Input!$G$29,3,2))),IF($V$46=2,IF(U50=999,999,IF(Input!$G$9+Input!$C$9*$C$50+SIN(ATAN((Input!$C$9-Input!$C$14-(Input!$C$9-Input!$C$14)*COS(U50))/(Input!$G$9-$C$52+(Input!$C$9-Input!$C$14)*SIN(U50))))*(Input!$G$9-Ref!$C$52+Input!$C$9*TAN(Ref!$C$50/2))/SIN(Ref!$C$50-ATAN((Input!$C$9-Input!$C$14-(Input!$C$9-Input!$C$14)*COS(U50))/(Input!$G$9-$C$52+(Input!$C$9-Input!$C$14)*SIN(U50))))<=Input!$G$28,1,IF(Input!$G$9+Input!$C$9*$C$50+SIN(ATAN((Input!$C$9-Input!$C$14-(Input!$C$9-Input!$C$14)*COS(U50))/(Input!$G$9-$C$52+(Input!$C$9-Input!$C$14)*SIN(U50))))*(Input!$G$9-Ref!$C$52+Input!$C$9*TAN(Ref!$C$50/2))/SIN(Ref!$C$50-ATAN((Input!$C$9-Input!$C$14-(Input!$C$9-Input!$C$14)*COS(U50))/(Input!$G$9-$C$52+(Input!$C$9-Input!$C$14)*SIN(U50))))>Input!$G$29,3,2))),IF(U51=999,999,IF(Input!$G$9+Input!$C$9*$C$50+SIN(ATAN((Input!$C$9-Input!$C$14-(Input!$C$9-Input!$C$14)*COS(U51))/(Input!$G$9-$C$52+(Input!$C$9-Input!$C$14)*SIN(U51))))*(Input!$G$9-Ref!$C$52+Input!$C$9*TAN(Ref!$C$50/2))/SIN(Ref!$C$50-ATAN((Input!$C$9-Input!$C$14-(Input!$C$9-Input!$C$14)*COS(U51))/(Input!$G$9-$C$52+(Input!$C$9-Input!$C$14)*SIN(U51))))<=Input!$G$28,1,IF(Input!$G$9+Input!$C$9*$C$50+SIN(ATAN((Input!$C$9-Input!$C$14-(Input!$C$9-Input!$C$14)*COS(U51))/(Input!$G$9-$C$52+(Input!$C$9-Input!$C$14)*SIN(U51))))*(Input!$G$9-Ref!$C$52+Input!$C$9*TAN(Ref!$C$50/2))/SIN(Ref!$C$50-ATAN((Input!$C$9-Input!$C$14-(Input!$C$9-Input!$C$14)*COS(U51))/(Input!$G$9-$C$52+(Input!$C$9-Input!$C$14)*SIN(U51))))>Input!$G$29,3,2)))))","v":999},"I Vertical Position (1,2,3)"]
[null,"U=",{"$f":"(SIN(C47)*(Input!$G$9-C52+Input!$C$9*TAN(Input!$G$11/2)))/SIN(Input!$G$11-C47)","v":346.22245074642512},null,"S'=",null,null,null,null,null,"zI3",{"$f":"Input!$G$31+(Input!$G$9+Input!$C$9*Ref!C50+C54-Input!$C$9*TAN(Ref!C50/2)-Input!$G$29)*Ref!F49/100+Ref!F50","v":17.950047140439338},{"$f":"IF(AND(M52=1,M53=1),1,999)","v":999},{"$f":"IF(AND(N52=1,N53=2),1,999)","v":999},{"$f":"IF(AND(O52=1,O53=3),1,999)","v":999},null,{"$f":"IF(AND(Q52=2,Q53=2),1,999)","v":999},{"$f":"IF(AND(R52=2,R53=3),1,999)","v":999},null,null,{"$f":"IF(AND(U52=3,U53=3),1,999)","v":999}]
[null,null,null,null,null,null,null,null,null,null,null,null,"zT1",null,null,"zT2",null,null,"zT3"]
[null,null,null,null,null,null,null,null,null,null,null,null,"zI1","zI2","zI3","zI1","zI2","zI3","zI1","zI2","zI3"]
[null,"3D Sightline Condition 5",null,null,"HT",{"$f":"Input!$C$35","v":4},null,null,null,5,"zC1",{"$f":"-(Input!$G$28-Ref!C63)*Ref!F59/100+Ref!F58","v":-9.8800000000000008},{"$f":"(L57-L63)/($C$62*COS(Input!$G$11)+Input!$G$9+Input!$C$9*TAN(Input!$G$11/2)-Ref!$C$58)-(Ref!L60-Ref!L63)/(Input!$C$14/TAN(Ref!$C$59))","v":{"$error":"#DIV/0!"}},{"$f":"(L57-L64)/($C$62*COS(Input!$G$11)+Input!$G$9+Input!$C$9*TAN(Input!$G$11/2)-Ref!$C$58)-(Ref!L60-Ref!L64)/(Input!$C$14/TAN(Ref!$C$59))","v":{"$error":"#DIV/0!"}},{"$f":"(L57-L65)/($C$62*COS(Input!$G$11)+Input!$G$9+Input!$C$9*TAN(Input!$G$11/2)-Ref!$C$58)-(Ref!L60-Ref!L65)/(Input!$C$14/TAN(Ref!$C$59))","v":{"$error":"#DIV/0!"}},null,{"$f":"(L57-L64)/($C$62*COS(Input!$G$11)+Input!$G$9+Input!$C$9*TAN(Input!$G$11/2)-Ref!$C$58)-(Ref!L61-Ref!L64)/(Input!$C$14/TAN(Ref!$C$59))","v":{"$error":"#DIV/0!"}},{"$f":"(L57-L65)/($C$62*COS(Input!$G$11)+Input!$G$9+Input!$C$9*TAN(Input!$G$11/2)-Ref!$C$58)-(Ref!L61-Ref!L65)/(Input!$C$14/TAN(Ref!$C$59))","v":{"$error":"#DIV/0!"}},null,null,{"$f":"(L57-L65)/($C$62*COS(Input!$G$11)+Input!$G$9+Input!$C$9*TAN(Input!$G$11/2)-Ref!$C$58)-(Ref!L62-Ref!L65)/(Input!$C$14/TAN(Ref!$C$59))","v":{"$error":"#DIV/0!"}},2,"=0"]
[null,"N=",{"$f":"Input!$G$9+Input!$C$9*TAN(Input!$G$11/2)-SIN(Input!$G$11-C59)/SIN(C59)*(Input!$G$9-C63+Input!$C$9*TAN(Input!$G$11/2))","v":{"$error":"#DIV/0!"}},null,"HC",{"$f":"Input!$C$34","v":3.5},null,null,null,null,"zC2",{"$f":"Input!$G$30+Ref!F59/100*(Ref!C63-Input!$G$28)+(Ref!F60-Ref!F59)*(Ref!C63-Input!$G$28)^2/(200*Input!$C$29*5280)+Ref!F58","v":-4.2289772727272714},null,null,null,null,{"$f":"(L58-L64)/($C$62*COS(Input!$G$11)+Input!$G$9+Input!$C$9*TAN(Input!$G$11/2)-Ref!$C$58)-(Ref!L61-Ref!L64)/(Input!$C$14/TAN(Ref!$C$59))","v":{"$error":"#DIV/0!"}},{"$f":"(L58-L65)/($C$62*COS(Input!$G$11)+Input!$G$9+Input!$C$9*TAN(Input!$G$11/2)-Ref!$C$58)-(Ref!L61-Ref!L65)/(Input!$C$14/TAN(Ref!$C$59))","v":{"$error":"#DIV/0!"}},null,null,{"$f":"(L58-L65)/($C$62*COS(Input!$G$11)+Input!$G$9+Input!$C$9*TAN(Input!$G$11/2)-Ref!$C$58)-(Ref!L62-Ref!L65)/(Input!$C$14/TAN(Ref!$C$59))","v":{"$error":"#DIV/0!"}}]
[null,"alpha(rad)=",0,null,"G1",{"$f":"Input!$C$30","v":-3},null,null,null,null,"zC3",{"$f":"Input!$G$31+(Ref!C63-Input!$G$29)*Ref!F60/100+Ref!F58","v":-14.799999999999997},null,null,null,null,null,null,null,null,{"$f":"(L59-L65)/($C$62*COS(Input!$G$11)+Input!$G$9+Input!$C$9*TAN(Input!$G$11/2)-Ref!$C$58)-(Ref!L62-Ref!L65)/(Input!$C$14/TAN(Ref!$C$59))","v":{"$error":"#DIV/0!"}}]
[null,"0=",null,null,"G2",{"$f":"Input!$C$31","v":3},null,null,null,null,"zT1",{"$f":"-(Input!$G$28-Input!$G$9-Input!$C$9*Input!$G$11-(Input!$G$9-Ref!C58-Input!$C$14/TAN(Ref!C59)))*Ref!F59/100+Ref!F57","v":{"$error":"#DIV/0!"}},999,999,999,null,999,999,null,null,999,"zC1","Alpha","=999 if no alpha found"]
[null,"B2=",{"$f":"Input!$C$10*5280+Input!$G$9-Ref!$C$58-Input!$C$14/TAN(Ref!$C$59)","v":{"$error":"#DIV/0!"}},null,"Hmin",{"$f":"Input!$C$36","v":2},null,null,null,null,"zT2",{"$f":"Input!$G$30+Ref!F59/100*(Input!$G$9+Input!$C$9*Input!$G$11+(Input!$G$9-Ref!C58-Input!$C$14/TAN(Ref!C59))-Input!$G$28)+(Ref!F60-Ref!F59)*(Input!$G$9+Input!$C$9*Input!$G$11+(Input!$G$9-Ref!C58-Input!$C$14/TAN(Ref!C59))-Input!$G$28)^2/(200*Input!$C$10*5280)+Ref!F57","v":{"$error":"#DIV/0!"}},null,null,null,null,999,999,null,null,999,"zC2"]
[null,"U=",{"$f":"Input!$G$9-C63+Input!$C$9*TAN(Input!$G$11/2)","v":952.55421273178081},null,"Use solver to find a theta that makes C44=0",null,null,null,null,null,"zT3",{"$f":"Input!$G$31+(Input!$G$9+Input!$C$9*Input!$G$11+(Input!$G$9-Ref!C58-Input!$C$14/TAN(Ref!C59))-Input!$G$29)*Ref!F60/100+Ref!F57","v":{"$error":"#DIV/0!"}},null,null,null,null,null,null,null,null,999,"zC3"]
[null,"E=",600,null,null,null,null,null,null,null,"zI1",{"$f":"-(Input!$G$28-Input!$G$9-Input!$C$9*Input!$G$11-(Input!$G$9-Ref!C58))*Ref!F59/100+Ref!F57","v":{"$error":"#DIV/0!"}},{"$f":"IF($V$57=1,IF(M60=999,999,IF(Input!$G$9+Input!$C$9*Input!$G$11+(Input!$G$9-(Input!$G$9+Input!$C$9*TAN(Input!$G$11/2)-SIN(Input!$G$11-M60)/SIN(M60)*(Input!$G$9-$C$63+Input!$C$9*TAN(Input!$G$11/2)))-Input!$C$14/TAN(M60))<=Input!$G$28,1,IF(Input!$G$9+Input!$C$9*Input!$G$11+(Input!$G$9-(Input!$G$9+Input!$C$9*TAN(Input!$G$11/2)-SIN(Input!$G$11-M60)/SIN(M60)*(Input!$G$9-$C$63+Input!$C$9*TAN(Input!$G$11/2)))-Input!$C$14/TAN(M60))>Input!$G$29,3,2))),999)","v":999},{"$f":"IF($V$57=1,IF(N60=999,999,IF(Input!$G$9+Input!$C$9*Input!$G$11+(Input!$G$9-(Input!$G$9+Input!$C$9*TAN(Input!$G$11/2)-SIN(Input!$G$11-N60)/SIN(N60)*(Input!$G$9-$C$63+Input!$C$9*TAN(Input!$G$11/2)))-Input!$C$14/TAN(N60))<=Input!$G$28,1,IF(Input!$G$9+Input!$C$9*Input!$G$11+(Input!$G$9-(Input!$G$9+Input!$C$9*TAN(Input!$G$11/2)-SIN(Input!$G$11-N60)/SIN(N60)*(Input!$G$9-$C$63+Input!$C$9*TAN(Input!$G$11/2)))-Input!$C$14/TAN(N60))>Input!$G$29,3,2))),999)","v":999},{"$f":"IF($V$57=1,IF(O60=999,999,IF(Input!$G$9+Input!$C$9*Input!$G$11+(Input!$G$9-(Input!$G$9+Input!$C$9*TAN(Input!$G$11/2)-SIN(Input!$G$11-O60)/SIN(O60)*(Input!$G$9-$C$63+Input!$C$9*TAN(Input!$G$11/2)))-Input!$C$14/TAN(O60))<=Input!$G$28,1,IF(Input!$G$9+Input!$C$9*Input!$G$11+(Input!$G$9-(Input!$G$9+Input!$C$9*TAN(Input!$G$11/2)-SIN(Input!$G$11-O60)/SIN(O60)*(Input!$G$9-$C$63+Input!$C$9*TAN(Input!$G$11/2)))-Input!$C$14/TAN(O60))>Input!$G$29,3,2))),999)","v":999},null,{"$f":"IF($V$57=1,IF(Q60=999,999,IF(Input!$G$9+Input!$C$9*Input!$G$11+(Input!$G$9-(Input!$G$9+Input!$C$9*TAN(Input!$G$11/2)-SIN(Input!$G$11-Q60)/SIN(Q60)*(Input!$G$9-$C$63+Input!$C$9*TAN(Input!$G$11/2)))-Input!$C$14/TAN(Q60))<=Input!$G$28,1,IF(Input!$G$9+Input!$C$9*Input!$G$11+(Input!$G$9-(Input!$G$9+Input!$C$9*TAN(Input!$G$11/2)-SIN(Input!$G$11-Q60)/SIN(Q60)*(Input!$G$9-$C$63+Input!$C$9*TAN(Input!$G$11/2)))-Input!$C$14/TAN(Q60))>Input!$G$29,3,2))),IF($V$57=2,IF(Q61=999,999,IF(Input!$G$9+Input!$C$9*Input!$G$11+(Input!$G$9-(Input!$G$9+Input!$C$9*TAN(Input!$G$11/2)-SIN(Input!$G$11-Q61)/SIN(Q61)*(Input!$G$9-$C$63+Input!$C$9*TAN(Input!$G$11/2)))-Input!$C$14/TAN(Q61))<=Input!$G$28,1,IF(Input!$G$9+Input!$C$9*Input!$G$11+(Input!$G$9-(Input!$G$9+Input!$C$9*TAN(Input!$G$11/2)-SIN(Input!$G$11-Q61)/SIN(Q61)*(Input!$G$9-$C$63+Input!$C$9*TAN(Input!$G$11/2)))-Input!$C$14/TAN(Q61))>Input!$G$29,3,2))),999))","v":999},{"$f":"IF($V$57=1,IF(R60=999,999,IF(Input!$G$9+Input!$C$9*Input!$G$11+(Input!$G$9-(Input!$G$9+Input!$C$9*TAN(Input!$G$11/2)-SIN(Input!$G$11-R60)/SIN(R60)*(Input!$G$9-$C$63+Input!$C$9*TAN(Input!$G$11/2)))-Input!$C$14/TAN(R60))<=Input!$G$28,1,IF(Input!$G$9+Input!$C$9*Input!$G$11+(Input!$G$9-(Input!$G$9+Input!$C$9*TAN(Input!$G$11/2)-SIN(Input!$G$11-R60)/SIN(R60)*(Input!$G$9-$C$63+Input!$C$9*TAN(Input!$G$11/2)))-Input!$C$14/TAN(R60))>Input!$G$29,3,2))),IF($V$57=2,IF(R61=999,999,IF(Input!$G$9+Input!$C$9*Input!$G$11+(Input!$G$9-(Input!$G$9+Input!$C$9*TAN(Input!$G$11/2)-SIN(Input!$G$11-R61)/SIN(R61)*(Input!$G$9-$C$63+Input!$C$9*TAN(Input!$G$11/2)))-Input!$C$14/TAN(R61))<=Input!$G$28,1,IF(Input!$G$9+Input!$C$9*Input!$G$11+(Input!$G$9-(Input!$G$9+Input!$C$9*TAN(Input!$G$11/2)-SIN(Input!$G$11-R61)/SIN(R61)*(Input!$G$9-$C$63+Input!$C$9*TAN(Input!$G$11/2)))-Input!$C$14/TAN(R61))>Input!$G$29,3,2))),999))","v":999},null,null,{"$f":"IF($V$57=1,IF(U60=999,999,IF(Input!$G$9+Input!$C$9*Input!$G$11+(Input!$G$9-(Input!$G$9+Input!$C$9*TAN(Input!$G$11/2)-SIN(Input!$G$11-U60)/SIN(U60)*(Input!$G$9-$C$63+Input!$C$9*TAN(Input!$G$11/2)))-Input!$C$14/TAN(U60))<=Input!$G$28,1,IF(Input!$G$9+Input!$C$9*Input!$G$11+(Input!$G$9-(Input!$G$9+Input!$C$9*TAN(Input!$G$11/2)-SIN(Input!$G$11-U60)/SIN(U60)*(Input!$G$9-$C$63+Input!$C$9*TAN(Input!$G$11/2)))-Input!$C$14/TAN(U60))>Input!$G$29,3,2))),IF($V$57=2,IF(U61=999,999,IF(Input!$G$9+Input!$C$9*Input!$G$11+(Input!$G$9-(Input!$G$9+Input!$C$9*TAN(Input!$G$11/2)-SIN(Input!$G$11-U61)/SIN(U61)*(Input!$G$9-$C$63+Input!$C$9*TAN(Input!$G$11/2)))-Input!$C$14/TAN(U61))<=Input!$G$28,1,IF(Input!$G$9+Input!$C$9*Input!$G$11+(Input!$G$9-(Input!$G$9+Input!$C$9*TAN(Input!$G$11/2)-SIN(Input!$G$11-U61)/SIN(U61)*(Input!$G$9-$C$63+Input!$C$9*TAN(Input!$G$11/2)))-Input!$C$14/TAN(U61))>Input!$G$29,3,2))),IF(U62=999,999,IF(Input!$G$9+Input!$C$9*Input!$G$11+(Input!$G$9-(Input!$G$9+Input!$C$9*TAN(Input!$G$11/2)-SIN(Input!$G$11-U62)/SIN(U61)*(Input!$G$9-$C$63+Input!$C$9*TAN(Input!$G$11/2)))-Input!$C$14/TAN(U62))<=Input!$G$28,1,IF(Input!$G$9+Input!$C$9*Input!$G$11+(Input!$G$9-(Input!$G$9+Input!$C$9*TAN(Input!$G$11/2)-SIN(Input!$G$11-U62)/SIN(U62)*(Input!$G$9-$C$63+Input!$C$9*TAN(Input!$G$11/2)))-Input!$C$14/TAN(U62))>Input!$G$29,3,2)))))","v":999},"T Vertical Position (1,2,3)"]
[null,null,null,null,null,null,null,null,null,null,"zI2",{"$f":"Input!$G$30+Ref!F59/100*(Input!$G$9+Input!$C$9*Input!$G$11+(Input!$G$9-Ref!C58)-Input!$G$28)+(Ref!F60-Ref!F59)*(Input!$G$9+Input!$C$9*Input!$G$11+(Input!$G$9-Ref!C58)-Input!$G$28)^2/(200*Input!$C$10*5280)+Ref!F57","v":{"$error":"#DIV/0!"}},{"$f":"IF($V$57=1,IF(M60=999,999,IF(Input!$G$9+Input!$C$9*Input!$G$11+(Input!$G$9-(Input!$G$9+Input!$C$9*TAN(Input!$G$11/2)-SIN(Input!$G$11-M60)/SIN(M60)*(Input!$G$9-$C$63+Input!$C$9*TAN(Input!$G$11/2))))<=Input!$G$28,1,IF(Input!$G$9+Input!$C$9*Input!$G$11+(Input!$G$9-(Input!$G$9+Input!$C$9*TAN(Input!$G$11/2)-SIN(Input!$G$11-M60)/SIN(M60)*(Input!$G$9-$C$63+Input!$C$9*TAN(Input!$G$11/2))))>Input!$G$29,3,2))),999)","v":999},{"$f":"IF($V$57=1,IF(N60=999,999,IF(Input!$G$9+Input!$C$9*Input!$G$11+(Input!$G$9-(Input!$G$9+Input!$C$9*TAN(Input!$G$11/2)-SIN(Input!$G$11-N60)/SIN(N60)*(Input!$G$9-$C$63+Input!$C$9*TAN(Input!$G$11/2))))<=Input!$G$28,1,IF(Input!$G$9+Input!$C$9*Input!$G$11+(Input!$G$9-(Input!$G$9+Input!$C$9*TAN(Input!$G$11/2)-SIN(Input!$G$11-N60)/SIN(N60)*(Input!$G$9-$C$63+Input!$C$9*TAN(Input!$G$11/2))))>Input!$G$29,3,2))),999)","v":999},{"$f":"IF($V$57=1,IF(O60=999,999,IF(Input!$G$9+Input!$C$9*Input!$G$11+(Input!$G$9-(Input!$G$9+Input!$C$9*TAN(Input!$G$11/2)-SIN(Input!$G$11-O60)/SIN(O60)*(Input!$G$9-$C$63+Input!$C$9*TAN(Input!$G$11/2))))<=Input!$G$28,1,IF(Input!$G$9+Input!$C$9*Input!$G$11+(Input!$G$9-(Input!$G$9+Input!$C$9*TAN(Input!$G$11/2)-SIN(Input!$G$11-O60)/SIN(O60)*(Input!$G$9-$C$63+Input!$C$9*TAN(Input!$G$11/2))))>Input!$G$29,3,2))),999)","v":999},null,{"$f":"IF($V$57=1,IF(Q60=999,999,IF(Input!$G$9+Input!$C$9*Input!$G$11+(Input!$G$9-(Input!$G$9+Input!$C$9*TAN(Input!$G$11/2)-SIN(Input!$G$11-Q60)/SIN(Q60)*(Input!$G$9-$C$63+Input!$C$9*TAN(Input!$G$11/2))))<=Input!$G$28,1,IF(Input!$G$9+Input!$C$9*Input!$G$11+(Input!$G$9-(Input!$G$9+Input!$C$9*TAN(Input!$G$11/2)-SIN(Input!$G$11-Q60)/SIN(Q60)*(Input!$G$9-$C$63+Input!$C$9*TAN(Input!$G$11/2))))>Input!$G$29,3,2))),IF($V$57=2,IF(Q61=999,999,IF(Input!$G$9+Input!$C$9*Input!$G$11+(Input!$G$9-(Input!$G$9+Input!$C$9*TAN(Input!$G$11/2)-SIN(Input!$G$11-Q61)/SIN(Q61)*(Input!$G$9-$C$63+Input!$C$9*TAN(Input!$G$11/2))))<=Input!$G$28,1,IF(Input!$G$9+Input!$C$9*Input!$G$11+(Input!$G$9-(Input!$G$9+Input!$C$9*TAN(Input!$G$11/2)-SIN(Input!$G$11-Q61)/SIN(Q61)*(Input!$G$9-$C$63+Input!$C$9*TAN(Input!$G$11/2))))>Input!$G$29,3,2))),999))","v":999},{"$f":"IF($V$57=1,IF(R60=999,999,IF(Input!$G$9+Input!$C$9*Input!$G$11+(Input!$G$9-(Input!$G$9+Input!$C$9*TAN(Input!$G$11/2)-SIN(Input!$G$11-R60)/SIN(R60)*(Input!$G$9-$C$63+Input!$C$9*TAN(Input!$G$11/2))))<=Input!$G$28,1,IF(Input!$G$9+Input!$C$9*Input!$G$11+(Input!$G$9-(Input!$G$9+Input!$C$9*TAN(Input!$G$11/2)-SIN(Input!$G$11-R60)/SIN(R60)*(Input!$G$9-$C$63+Input!$C$9*TAN(Input!$G$11/2))))>Input!$G$29,3,2))),IF($V$57=2,IF(R61=999,999,IF(Input!$G$9+Input!$C$9*Input!$G$11+(Input!$G$9-(Input!$G$9+Input!$C$9*TAN(Input!$G$11/2)-SIN(Input!$G$11-R61)/SIN(R61)*(Input!$G$9-$C$63+Input!$C$9*TAN(Input!$G$11/2))))<=Input!$G$28,1,IF(Input!$G$9+Input!$C$9*Input!$G$11+(Input!$G$9-(Input!$G$9+Input!$C$9*TAN(Input!$G$11/2)-SIN(Input!$G$11-R61)/SIN(R61)*(Input!$G$9-$C$63+Input!$C$9*TAN(Input!$G$11/2))))>Input!$G$29,3,2))),999))","v":999},null,null,{"$f":"IF($V$57=1,IF(U60=999,999,IF(Input!$G$9+Input!$C$9*Input!$G$11+(Input!$G$9-(Input!$G$9+Input!$C$9*TAN(Input!$G$11/2)-SIN(Input!$G$11-U60)/SIN(U60)*(Input!$G$9-$C$63+Input!$C$9*TAN(Input!$G$11/2))))<=Input!$G$28,1,IF(Input!$G$9+Input!$C$9*Input!$G$11+(Input!$G$9-(Input!$G$9+Input!$C$9*TAN(Input!$G$11/2)-SIN(Input!$G$11-U60)/SIN(U60)*(Input!$G$9-$C$63+Input!$C$9*TAN(Input!$G$11/2))))>Input!$G$29,3,2))),IF($V$57=2,IF(U61=999,999,IF(Input!$G$9+Input!$C$9*Input!$G$11+(Input!$G$9-(Input!$G$9+Input!$C$9*TAN(Input!$G$11/2)-SIN(Input!$G$11-U61)/SIN(U61)*(Input!$G$9-$C$63+Input!$C$9*TAN(Input!$G$11/2))))<=Input!$G$28,1,IF(Input!$G$9+Input!$C$9*Input!$G$11+(Input!$G$9-(Input!$G$9+Input!$C$9*TAN(Input!$G$11/2)-SIN(Input!$G$11-U61)/SIN(U61)*(Input!$G$9-$C$63+Input!$C$9*TAN(Input!$G$11/2))))>Input!$G$29,3,2))),IF(U62=999,999,IF(Input!$G$9+Input!$C$9*Input!$G$11+(Input!$G$9-(Input!$G$9+Input!$C$9*TAN(Input!$G$11/2)-SIN(Input!$G$11-U62)/SIN(U61)*(Input!$G$9-$C$63+Input!$C$9*TAN(Input!$G$11/2))))<=Input!$G$28,1,IF(Input!$G$9+Input!$C$9*Input!$G$11+(Input!$G$9-(Input!$G$9+Input!$C$9*TAN(Input!$G$11/2)-SIN(Input!$G$11-U62)/SIN(U62)*(Input!$G$9-$C$63+Input!$C$9*TAN(Input!$G$11/2))))>Input!$G$29,3,2)))))","v":999},"I Vertical Position (1,2,3)"]
[null,"alpha=",null,null,"S'=",null,null,null,null,null,"zI3",{"$f":"Input!$G$31+(Input!$G$9+Input!$C$9*Input!$G$11+(Input!$G$9-Ref!C58)-Input!$G$29)*Ref!F60/100+Ref!F57","v":{"$error":"#DIV/0!"}},{"$f":"IF(AND(M63=1,M64=1),1,999)","v":999},{"$f":"IF(AND(N63=1,N64=2),1,999)","v":999},{"$f":"IF(AND(O63=1,O64=3),1,999)","v":999},null,{"$f":"IF(AND(Q63=2,Q64=2),1,999)","v":999},{"$f":"IF(AND(R63=2,R64=3),1,999)","v":999},null,null,{"$f":"IF(AND(U63=3,U64=3),1,999)","v":999}]
[null,null,null,null,null,null,null,null,null,null,null,null,"zT1",null,null,"zT2",null,null,"zT3"]
[null,null,null,null,null,null,null,null,null,null,null,null,"zI1","zI2","zI3","zI1","zI2","zI3","zI1","zI2","zI3"]
[null,"3D Sightline Condition 6",null,null,"HT",{"$f":"Input!$C$35","v":4},null,null,null,6,"zC1",{"$f":"-(Input!$G$28-Ref!C74)*Ref!F70/100+Ref!F69","v":-20.38},{"$f":"(L74-L68)/(Input!$C$9*SIN(Ref!$C$70)-Input!$C$9*SIN(Ref!$C$69))-(Ref!L71-Ref!L68)/((Input!$C$9-Input!$C$14)*SIN(Ref!$C$73)-Input!$C$9*SIN(Ref!$C$69))","v":{"$error":"#NUM!"}},{"$f":"(L75-L68)/(Input!$C$9*SIN(Ref!$C$70)-Input!$C$9*SIN(Ref!$C$69))-(Ref!L71-Ref!L68)/((Input!$C$9-Input!$C$14)*SIN(Ref!$C$73)-Input!$C$9*SIN(Ref!$C$69))","v":{"$error":"#NUM!"}},{"$f":"(L76-L68)/(Input!$C$9*SIN(Ref!$C$70)-Input!$C$9*SIN(Ref!$C$69))-(Ref!L71-Ref!L68)/((Input!$C$9-Input!$C$14)*SIN(Ref!$C$73)-Input!$C$9*SIN(Ref!$C$69))","v":{"$error":"#NUM!"}},null,{"$f":"(L75-L68)/(Input!$C$9*SIN(Ref!$C$70)-Input!$C$9*SIN(Ref!$C$69))-(Ref!L72-Ref!L68)/((Input!$C$9-Input!$C$14)*SIN(Ref!$C$73)-Input!$C$9*SIN(Ref!$C$69))","v":{"$error":"#NUM!"}},{"$f":"(L76-L68)/(Input!$C$9*SIN(Ref!$C$70)-Input!$C$9*SIN(Ref!$C$69))-(Ref!L72-Ref!L68)/((Input!$C$9-Input!$C$14)*SIN(Ref!$C$73)-Input!$C$9*SIN(Ref!$C$69))","v":{"$error":"#NUM!"}},null,null,{"$f":"(L76-L68)/(Input!$C$9*SIN(Ref!$C$70)-Input!$C$9*SIN(Ref!$C$69))-(Ref!L73-Ref!L68)/((Input!$C$9-Input!$C$14)*SIN(Ref!$C$73)-Input!$C$9*SIN(Ref!$C$69))","v":{"$error":"#NUM!"}},2,"=0"]
[null,"lambda(rad)=",{"$f":"(C74-Input!$G$9)/Input!$C$9","v":0.17447916666666666},null,"HC",{"$f":"Input!$C$34","v":3.5},null,null,null,null,"zC2",{"$f":"Input!$G$30+Ref!F70/100*(Ref!C74-Input!$G$28)+(Ref!F71-Ref!F70)*(Ref!C74-Input!$G$28)^2/(200*Input!$C$29*5280)+Ref!F69","v":-2.379545454545454},null,null,null,null,{"$f":"(L75-L69)/(Input!$C$9*SIN(Ref!$C$70)-Input!$C$9*SIN(Ref!$C$69))-(Ref!L72-Ref!L69)/((Input!$C$9-Input!$C$14)*SIN(Ref!$C$73)-Input!$C$9*SIN(Ref!$C$69))","v":{"$error":"#NUM!"}},{"$f":"(L76-L69)/(Input!$C$9*SIN(Ref!$C$70)-Input!$C$9*SIN(Ref!$C$69))-(Ref!L72-Ref!L69)/((Input!$C$9-Input!$C$14)*SIN(Ref!$C$73)-Input!$C$9*SIN(Ref!$C$69))","v":{"$error":"#NUM!"}},null,null,{"$f":"(L76-L69)/(Input!$C$9*SIN(Ref!$C$70)-Input!$C$9*SIN(Ref!$C$69))-(Ref!L73-Ref!L69)/((Input!$C$9-Input!$C$14)*SIN(Ref!$C$73)-Input!$C$9*SIN(Ref!$C$69))","v":{"$error":"#NUM!"}}]
[null,"theta(rad)=",678.70914588573828,null,"G1",{"$f":"Input!$C$30","v":-3},null,null,null,null,"zC3",{"$f":"Input!$G$31+(Ref!C74-Input!$G$29)*Ref!F71/100+Ref!F69","v":-4.2999999999999963},null,null,null,null,null,null,null,null,{"$f":"(L76-L70)/(Input!$C$9*SIN(Ref!$C$70)-Input!$C$9*SIN(Ref!$C$69))-(Ref!L73-Ref!L70)/((Input!$C$9-Input!$C$14)*SIN(Ref!$C$73)-Input!$C$9*SIN(Ref!$C$69))","v":{"$error":"#NUM!"}}]
[null,"0=",null,null,"G2",{"$f":"Input!$C$31","v":3},null,null,null,null,"zT1",{"$f":"-(Input!$G$28-Input!$G$9-Input!$C$9*Ref!C73)*Ref!F70/100+Ref!F68","v":{"$error":"#NUM!"}},999,999,999,null,999,999,null,null,999,"zC1","Theta","=999 if no alpha found"]
[null,null,null,null,"Hmin",{"$f":"Input!$C$36","v":2},null,null,null,null,"zT2",{"$f":"Input!$G$30+Ref!F70/100*(Input!$G$9+Input!$C$9*Ref!C73-Input!$G$28)+(Ref!F71-Ref!F70)*(Input!$G$9+Input!$C$9*Ref!C73-Input!$G$28)^2/(200*Input!$C$29*5280)+Ref!F68","v":{"$error":"#NUM!"}},null,null,null,null,999,999,null,null,999,"zC2"]
[null,"beta(rad)=",{"$f":"PI()/2+(C69+C70)/2-ASIN(Input!$C$9/(Input!$C$9-Input!$C$14)*SIN((PI()/2-(C70-C69)/2)))","v":{"$error":"#NUM!"}},null,"Use solver to find a theta that makes C44=0",null,null,null,null,null,"zT3",{"$f":"Input!$G$31+(Input!$G$9+Input!$C$9*Ref!C73-Input!$G$29)*Ref!F71/100+Ref!F68","v":{"$error":"#NUM!"}},null,null,null,null,null,null,null,null,999,"zC3"]
[null,"E=",950,null,null,null,null,null,null,null,"zI1",{"$f":"-(Input!$G$28-Input!$G$9-Input!$C$9*Ref!C70)*Ref!F70/100+Ref!F72","v":-31288.757442414822},{"$f":"IF($V$68=1,IF(M71=999,999,IF(Input!$G$9+Input!$C$9*(PI()/2+($C$69+M71)/2-ASIN(Input!$C$9/(Input!$C$9-Input!$C$14)*SIN((PI()/2-(M71-$C$69)/2))))<=Input!$G$28,1,IF(Input!$G$9+Input!$C$9*(PI()/2+($C$69+M71)/2-ASIN(Input!$C$9/(Input!$C$9-Input!$C$14)*SIN((PI()/2-(M71-$C$69)/2))))>Input!$G$29,3,2))),999)","v":999},{"$f":"IF($V$68=1,IF(N71=999,999,IF(Input!$G$9+Input!$C$9*(PI()/2+($C$69+N71)/2-ASIN(Input!$C$9/(Input!$C$9-Input!$C$14)*SIN((PI()/2-(N71-$C$69)/2))))<=Input!$G$28,1,IF(Input!$G$9+Input!$C$9*(PI()/2+($C$69+N71)/2-ASIN(Input!$C$9/(Input!$C$9-Input!$C$14)*SIN((PI()/2-(N71-$C$69)/2))))>Input!$G$29,3,2))),999)","v":999},{"$f":"IF($V$68=1,IF(O71=999,999,IF(Input!$G$9+Input!$C$9*(PI()/2+($C$69+O71)/2-ASIN(Input!$C$9/(Input!$C$9-Input!$C$14)*SIN((PI()/2-(O71-$C$69)/2))))<=Input!$G$28,1,IF(Input!$G$9+Input!$C$9*(PI()/2+($C$69+O71)/2-ASIN(Input!$C$9/(Input!$C$9-Input!$C$14)*SIN((PI()/2-(O71-$C$69)/2))))>Input!$G$29,3,2))),999)","v":999},null,{"$f":"IF($V$68=1,IF(Q71=999,999,IF(Input!$G$9+Input!$C$9*(PI()/2+($C$69+Q71)/2-ASIN(Input!$C$9/(Input!$C$9-Input!$C$14)*SIN((PI()/2-(Q71-$C$69)/2))))<=Input!$G$28,1,IF(Input!$G$9+Input!$C$9*(PI()/2+($C$69+Q71)/2-ASIN(Input!$C$9/(Input!$C$9-Input!$C$14)*SIN((PI()/2-(Q71-$C$69)/2))))>Input!$G$29,3,2))),IF($V$68=2,IF(Q72=999,999,IF(Input!$G$9+Input!$C$9*(PI()/2+($C$69+Q72)/2-ASIN(Input!$C$9/(Input!$C$9-Input!$C$14)*SIN((PI()/2-(Q72-$C$69)/2))))<=Input!$G$28,1,IF(Input!$G$9+Input!$C$9*(PI()/2+($C$69+Q72)/2-ASIN(Input!$C$9/(Input!$C$9-Input!$C$14)*SIN((PI()/2-(Q72-$C$69)/2))))>Input!$G$29,3,2))),999))","v":999},{"$f":"IF($V$68=1,IF(R71=999,999,IF(Input!$G$9+Input!$C$9*(PI()/2+($C$69+R71)/2-ASIN(Input!$C$9/(Input!$C$9-Input!$C$14)*SIN((PI()/2-(R71-$C$69)/2))))<=Input!$G$28,1,IF(Input!$G$9+Input!$C$9*(PI()/2+($C$69+R71)/2-ASIN(Input!$C$9/(Input!$C$9-Input!$C$14)*SIN((PI()/2-(R71-$C$69)/2))))>Input!$G$29,3,2))),IF($V$68=2,IF(R72=999,999,IF(Input!$G$9+Input!$C$9*(PI()/2+($C$69+R72)/2-ASIN(Input!$C$9/(Input!$C$9-Input!$C$14)*SIN((PI()/2-(R72-$C$69)/2))))<=Input!$G$28,1,IF(Input!$G$9+Input!$C$9*(PI()/2+($C$69+R72)/2-ASIN(Input!$C$9/(Input!$C$9-Input!$C$14)*SIN((PI()/2-(R72-$C$69)/2))))>Input!$G$29,3,2))),999))","v":999},null,null,{"$f":"IF($V$68=1,IF(U71=999,999,IF(Input!$G$9+Input!$C$9*(PI()/2+($C$69+U71)/2-ASIN(Input!$C$9/(Input!$C$9-Input!$C$14)*SIN((PI()/2-(U71-$C$69)/2))))<=Input!$G$28,1,IF(Input!$G$9+Input!$C$9*(PI()/2+($C$69+U71)/2-ASIN(Input!$C$9/(Input!$C$9-Input!$C$14)*SIN((PI()/2-(U71-$C$69)/2))))>Input!$G$29,3,2))),IF($V$68=2,IF(U72=999,999,IF(Input!$G$9+Input!$C$9*(PI()/2+($C$69+U72)/2-ASIN(Input!$C$9/(Input!$C$9-Input!$C$14)*SIN((PI()/2-(U72-$C$69)/2))))<=Input!$G$28,1,IF(Input!$G$9+Input!$C$9*(PI()/2+($C$69+U72)/2-ASIN(Input!$C$9/(Input!$C$9-Input!$C$14)*SIN((PI()/2-(U72-$C$69)/2))))>Input!$G$29,3,2))),IF(U73=999,999,IF(Input!$G$9+Input!$C$9*(PI()/2+($C$69+U73)/2-ASIN(Input!$C$9/(Input!$C$9-Input!$C$14)*SIN((PI()/2-(U73-$C$69)/2))))<=Input!$G$28,1,IF(Input!$G$9+Input!$C$9*(PI()/2+($C$69+U73)/2-ASIN(Input!$C$9/(Input!$C$9-Input!$C$14)*SIN((PI()/2-(U73-$C$69)/2))))>Input!$G$29,3,2)))))","v":999},"T Vertical Position (1,2,3)"]
[null,null,null,null,null,null,null,null,null,null,"zI2",{"$f":"Input!$G$30+Ref!F70/100*(Input!$G$9+Input!$C$9*Ref!C70-Input!$G$28)+(Ref!F71-Ref!F70)*(Input!$G$9+Input!$C$9*Ref!C70-Input!$G$28)^2/(200*Input!$C$29*5280)+Ref!F72","v":30875008.632710315},{"$f":"IF($V$68=1,IF(M71=999,999,IF(Input!$G$9+Input!$C$9*M71<=Input!$G$28,1,IF(Input!$G$9+Input!$C$9*M71>Input!$G$29,3,2))),999)","v":999},{"$f":"IF($V$68=1,IF(N71=999,999,IF(Input!$G$9+Input!$C$9*N71<=Input!$G$28,1,IF(Input!$G$9+Input!$C$9*N71>Input!$G$29,3,2))),999)","v":999},{"$f":"IF($V$68=1,IF(O71=999,999,IF(Input!$G$9+Input!$C$9*O71<=Input!$G$28,1,IF(Input!$G$9+Input!$C$9*O71>Input!$G$29,3,2))),999)","v":999},null,{"$f":"IF($V$68=1,IF(Q71=999,999,IF(Input!$G$9+Input!$C$9*Q71<=Input!$G$28,1,IF(Input!$G$9+Input!$C$9*Q71>Input!$G$29,3,2))),IF($V$68=2,IF(Q72=999,999,IF(Input!$G$9+Input!$C$9*Q72<=Input!$G$28,1,IF(Input!$G$9+Input!$C$9*Q72>Input!$G$29,3,2))),999))","v":999},{"$f":"IF($V$68=1,IF(R71=999,999,IF(Input!$G$9+Input!$C$9*R71<=Input!$G$28,1,IF(Input!$G$9+Input!$C$9*R71>Input!$G$29,3,2))),IF($V$68=2,IF(R72=999,999,IF(Input!$G$9+Input!$C$9*R72<=Input!$G$28,1,IF(Input!$G$9+Input!$C$9*R72>Input!$G$29,3,2))),999))","v":999},null,null,{"$f":"IF($V$68=1,IF(U71=999,999,IF(Input!$G$9+Input!$C$9*U71<=Input!$G$28,1,IF(Input!$G$9+Input!$C$9*U71>Input!$G$29,3,2))),IF($V$68=2,IF(U72=999,999,IF(Input!$G$9+Input!$C$9*U72<=Input!$G$28,1,IF(Input!$G$9+Input!$C$9*U72>Input!$G$29,3,2))),IF(U73=999,999,IF(Input!$G$9+Input!$C$9*U73<=Input!$G$28,1,IF(Input!$G$9+Input!$C$9*U73>Input!$G$29,3,2)))))","v":999},"I Vertical Position (1,2,3)"]
[null,"alpha=",{"$f":"ATAN(C70*SIN(C69)/(C70*COS(C69)+G36+C36*TAN(C69/2)-C74))*180/PI()","v":{"$error":"#NUM!"}},null,"S'=",null,null,null,null,null,"zI3",{"$f":"Input!$G$31+(Input!$G$9+Input!$C$9*Ref!C70-Input!$G$29)*Ref!F71/100+Ref!F72","v":31261.077442414822},{"$f":"IF(AND(M74=1,M75=1),1,999)","v":999},{"$f":"IF(AND(N74=1,N75=2),1,999)","v":999},{"$f":"IF(AND(O74=1,O75=3),1,999)","v":999},null,{"$f":"IF(AND(Q74=2,Q75=2),1,999)","v":999},{"$f":"IF(AND(R74=2,R75=3),1,999)","v":999},null,null,{"$f":"IF(AND(U74=3,U75=3),1,999)","v":999}]
[null,null,null,null,null,null,null,null,null,null,null,null,"zT1",null,null,"zT2",null,null,"zT3"]
[null,null,null,null,null,null,null,null,null,null,null,null,"zI1","zI2","zI3","zI1","zI2","zI3","zI1","zI2","zI3"]
[null,"3D Sightline Condition 7",null,null,"HT",{"$f":"Input!$C$35","v":4},null,null,null,7,"zC1",{"$f":"-(Input!$G$28-Ref!C85)*Ref!F81/100+Ref!F80","v":-54.88},{"$f":"(L79-L85)/(Input!$G$9+Input!$C$9*SIN(Ref!$C$86)-Ref!$C$80)-(Ref!L82-Ref!L85)/(Input!$G$9+(Input!$C$9-Input!$C$14)*SIN(Ref!$C$84)-Ref!$C$80)","v":{"$error":"#DIV/0!"}},{"$f":"(L79-L86)/(Input!$G$9+Input!$C$9*SIN(Ref!$C$86)-Ref!$C$80)-(Ref!L82-Ref!L86)/(Input!$G$9+(Input!$C$9-Input!$C$14)*SIN(Ref!$C$84)-Ref!$C$80)","v":{"$error":"#DIV/0!"}},{"$f":"(L79-L87)/(Input!$G$9+Input!$C$9*SIN(Ref!$C$86)-Ref!$C$80)-(Ref!L82-Ref!L87)/(Input!$G$9+(Input!$C$9-Input!$C$14)*SIN(Ref!$C$84)-Ref!$C$80)","v":{"$error":"#DIV/0!"}},null,{"$f":"(L79-L86)/(Input!$G$9+Input!$C$9*SIN(Ref!$C$86)-Ref!$C$80)-(Ref!L83-Ref!L86)/(Input!$G$9+(Input!$C$9-Input!$C$14)*SIN(Ref!$C$84)-Ref!$C$80)","v":{"$error":"#DIV/0!"}},{"$f":"(L79-L87)/(Input!$G$9+Input!$C$9*SIN(Ref!$C$86)-Ref!$C$80)-(Ref!L83-Ref!L87)/(Input!$G$9+(Input!$C$9-Input!$C$14)*SIN(Ref!$C$84)-Ref!$C$80)","v":{"$error":"#DIV/0!"}},null,null,{"$f":"(L79-L87)/(Input!$G$9+Input!$C$9*SIN(Ref!$C$86)-Ref!$C$80)-(Ref!L84-Ref!L87)/(Input!$G$9+(Input!$C$9-Input!$C$14)*SIN(Ref!$C$84)-Ref!$C$80)","v":{"$error":"#DIV/0!"}},1,"=0"]
[null,"N=",{"$f":"Input!$G$9+Input!$C$9*TAN(Input!$G$11/2)-(Input!$C$9-Input!$C$9*COS(C82))/SIN(Input!$G$11)-SIN(Input!$G$11-C81)/SIN(C81)*(Input!$C$9*TAN(Input!$G$11/2)-Input!$C$9*SIN(C82)+(Input!$C$9-Input!$C$9*COS(C82))/COS(Input!$G$11))","v":{"$error":"#DIV/0!"}},null,"HC",{"$f":"Input!$C$34","v":3.5},null,null,null,null,"zC2",{"$f":"Input!$G$30+Ref!F81/100*(Ref!C85-Input!$G$28)+(Ref!F82-Ref!F81)*(Ref!C85-Input!$G$28)^2/(200*Input!$C$29*5280)+Ref!F80","v":52.702840909090909},null,null,null,null,{"$f":"(L80-L86)/(Input!$G$9+Input!$C$9*SIN(Ref!$C$86)-Ref!$C$80)-(Ref!L83-Ref!L86)/(Input!$G$9+(Input!$C$9-Input!$C$14)*SIN(Ref!$C$84)-Ref!$C$80)","v":{"$error":"#DIV/0!"}},{"$f":"(L80-L87)/(Input!$G$9+Input!$C$9*SIN(Ref!$C$86)-Ref!$C$80)-(Ref!L83-Ref!L87)/(Input!$G$9+(Input!$C$9-Input!$C$14)*SIN(Ref!$C$84)-Ref!$C$80)","v":{"$error":"#DIV/0!"}},null,null,{"$f":"(L80-L87)/(Input!$G$9+Input!$C$9*SIN(Ref!$C$86)-Ref!$C$80)-(Ref!L84-Ref!L87)/(Input!$G$9+(Input!$C$9-Input!$C$14)*SIN(Ref!$C$84)-Ref!$C$80)","v":{"$error":"#DIV/0!"}}]
[null,"alpha(rad)=",0,null,"G1",{"$f":"Input!$C$30","v":-3},null,null,null,null,"zC3",{"$f":"Input!$G$31+(Ref!C85-Input!$G$29)*Ref!F82/100+Ref!F80","v":30.200000000000003},null,null,null,null,null,null,null,null,{"$f":"(L81-L87)/(Input!$G$9+Input!$C$9*SIN(Ref!$C$86)-Ref!$C$80)-(Ref!L84-Ref!L87)/(Input!$G$9+(Input!$C$9-Input!$C$14)*SIN(Ref!$C$84)-Ref!$C$80)","v":{"$error":"#DIV/0!"}}]
[null,"lambda(rad)=",{"$f":"(C85-Input!$G$9)/Input!$C$9","v":0.92317708333333337},null,"G2",{"$f":"Input!$C$31","v":3},null,null,null,null,"zT1",{"$f":"-(Input!$G$28-Input!$G$9-Input!$C$9*(Input!$G$11-Ref!C84))*Ref!F81/100+Ref!F79","v":{"$error":"#DIV/0!"}},999,999,999,null,999,999,null,null,999,"zC1","Alpha","=999 if no alpha found"]
[null,"0=",null,null,"Hmin",{"$f":"Input!$C$36","v":2},null,null,null,null,"zT2",{"$f":"Input!$G$30+Ref!F81/100*(Input!$G$9+Input!$C$9*(Input!$G$11-Ref!C84)-Input!$G$28)+(Ref!F82-Ref!F81)*(Input!$G$9+Input!$C$9*(Input!$G$11-Ref!C84)-Input!$G$28)^2/(200*Input!$C$29*5280)+Ref!F79","v":{"$error":"#DIV/0!"}},null,null,null,null,999,999,null,null,999,"zC2"]
[null,"beta(rad)=",{"$f":"PI()/2-C81-ASIN(SIN(PI()/2-C81)/(Input!$C$9-Input!$C$14)*(Input!$C$9-(Input!$G$9-C80)*TAN(C81)))","v":{"$error":"#DIV/0!"}},null,"Use solver to find a theta that makes C44=0",null,null,null,null,null,"zT3",{"$f":"Input!$G$31+(Input!$G$9+Input!$C$9*(Input!$G$11-Ref!C84)-Input!$G$29)*Ref!F82/100+Ref!F79","v":{"$error":"#DIV/0!"}},null,null,null,null,null,null,null,null,999,"zC3"]
[null,"E=",2100,null,null,null,null,null,null,null,"zI1",{"$f":"-(Input!$G$28-Input!$G$9-Input!$C$9*Input!$G$11-(Input!$G$9-Ref!C80))*Ref!F81/100+Ref!F79","v":{"$error":"#DIV/0!"}},{"$f":"IF($V$79=1,IF(M82=999,999,IF(Input!$G$9+Input!$C$9*(Input!$G$11-(PI()/2-M82-ASIN(SIN(PI()/2-M82)/(Input!$C$9-Input!$C$14)*(Input!$C$9-(Input!$G$9-(Input!$G$9+Input!$C$9*TAN(Input!$G$11/2)-(Input!$C$9-Input!$C$9*COS($C$82))/SIN(Input!$G$11)-SIN(Input!$G$11-M82)/SIN(M82)*(Input!$C$9*TAN(Input!$G$11/2)-Input!$C$9*SIN($C$82)+(Input!$C$9-Input!$C$9*COS($C$82))/COS(Input!$G$11))))*TAN(M82)))))<=Input!$G$28,1,IF(Input!$G$9+Input!$C$9*(Input!$G$11-(PI()/2-M82-ASIN(SIN(PI()/2-M82)/(Input!$C$9-Input!$C$14)*(Input!$C$9-(Input!$G$9-(Input!$G$9+Input!$C$9*TAN(Input!$G$11/2)-(Input!$C$9-Input!$C$9*COS($C$82))/SIN(Input!$G$11)-SIN(Input!$G$11-M82)/SIN(M82)*(Input!$C$9*TAN(Input!$G$11/2)-Input!$C$9*SIN($C$82)+(Input!$C$9-Input!$C$9*COS($C$82))/COS(Input!$G$11))))*TAN(M82)))))>Input!$G$29,3,2))),999)","v":999},{"$f":"IF($V$79=1,IF(N82=999,999,IF(Input!$G$9+Input!$C$9*(Input!$G$11-(PI()/2-N82-ASIN(SIN(PI()/2-N82)/(Input!$C$9-Input!$C$14)*(Input!$C$9-(Input!$G$9-(Input!$G$9+Input!$C$9*TAN(Input!$G$11/2)-(Input!$C$9-Input!$C$9*COS($C$82))/SIN(Input!$G$11)-SIN(Input!$G$11-N82)/SIN(N82)*(Input!$C$9*TAN(Input!$G$11/2)-Input!$C$9*SIN($C$82)+(Input!$C$9-Input!$C$9*COS($C$82))/COS(Input!$G$11))))*TAN(N82)))))<=Input!$G$28,1,IF(Input!$G$9+Input!$C$9*(Input!$G$11-(PI()/2-N82-ASIN(SIN(PI()/2-N82)/(Input!$C$9-Input!$C$14)*(Input!$C$9-(Input!$G$9-(Input!$G$9+Input!$C$9*TAN(Input!$G$11/2)-(Input!$C$9-Input!$C$9*COS($C$82))/SIN(Input!$G$11)-SIN(Input!$G$11-N82)/SIN(N82)*(Input!$C$9*TAN(Input!$G$11/2)-Input!$C$9*SIN($C$82)+(Input!$C$9-Input!$C$9*COS($C$82))/COS(Input!$G$11))))*TAN(N82)))))>Input!$G$29,3,2))),999)","v":999},{"$f":"IF($V$79=1,IF(O82=999,999,IF(Input!$G$9+Input!$C$9*(Input!$G$11-(PI()/2-O82-ASIN(SIN(PI()/2-O82)/(Input!$C$9-Input!$C$14)*(Input!$C$9-(Input!$G$9-(Input!$G$9+Input!$C$9*TAN(Input!$G$11/2)-(Input!$C$9-Input!$C$9*COS($C$82))/SIN(Input!$G$11)-SIN(Input!$G$11-O82)/SIN(O82)*(Input!$C$9*TAN(Input!$G$11/2)-Input!$C$9*SIN($C$82)+(Input!$C$9-Input!$C$9*COS($C$82))/COS(Input!$G$11))))*TAN(O82)))))<=Input!$G$28,1,IF(Input!$G$9+Input!$C$9*(Input!$G$11-(PI()/2-O82-ASIN(SIN(PI()/2-O82)/(Input!$C$9-Input!$C$14)*(Input!$C$9-(Input!$G$9-(Input!$G$9+Input!$C$9*TAN(Input!$G$11/2)-(Input!$C$9-Input!$C$9*COS($C$82))/SIN(Input!$G$11)-SIN(Input!$G$11-O82)/SIN(O82)*(Input!$C$9*TAN(Input!$G$11/2)-Input!$C$9*SIN($C$82)+(Input!$C$9-Input!$C$9*COS($C$82))/COS(Input!$G$11))))*TAN(O82)))))>Input!$G$29,3,2))),999)","v":999},null,{"$f":"IF($V$79=1,IF(Q82=999,999,IF(Input!$G$9+Input!$C$9*(Input!$G$11-(PI()/2-Q82-ASIN(SIN(PI()/2-Q82)/(Input!$C$9-Input!$C$14)*(Input!$C$9-(Input!$G$9-(Input!$G$9+Input!$C$9*TAN(Input!$G$11/2)-(Input!$C$9-Input!$C$9*COS($C$82))/SIN(Input!$G$11)-SIN(Input!$G$11-Q82)/SIN(Q82)*(Input!$C$9*TAN(Input!$G$11/2)-Input!$C$9*SIN($C$82)+(Input!$C$9-Input!$C$9*COS($C$82))/COS(Input!$G$11))))*TAN(Q82)))))<=Input!$G$28,1,IF(Input!$G$9+Input!$C$9*(Input!$G$11-(PI()/2-Q82-ASIN(SIN(PI()/2-Q82)/(Input!$C$9-Input!$C$14)*(Input!$C$9-(Input!$G$9-(Input!$G$9+Input!$C$9*TAN(Input!$G$11/2)-(Input!$C$9-Input!$C$9*COS($C$82))/SIN(Input!$G$11)-SIN(Input!$G$11-Q82)/SIN(Q82)*(Input!$C$9*TAN(Input!$G$11/2)-Input!$C$9*SIN($C$82)+(Input!$C$9-Input!$C$9*COS($C$82))/COS(Input!$G$11))))*TAN(Q82)))))>Input!$G$29,3,2))),IF($V$79=2,IF(Q83=999,999,IF(Input!$G$9+Input!$C$9*(Input!$G$11-(PI()/2-Q83-ASIN(SIN(PI()/2-Q83)/(Input!$C$9-Input!$C$14)*(Input!$C$9-(Input!$G$9-(Input!$G$9+Input!$C$9*TAN(Input!$G$11/2)-(Input!$C$9-Input!$C$9*COS($C$82))/SIN(Input!$G$11)-SIN(Input!$G$11-Q83)/SIN(Q83)*(Input!$C$9*TAN(Input!$G$11/2)-Input!$C$9*SIN($C$82)+(Input!$C$9-Input!$C$9*COS($C$82))/COS(Input!$G$11))))*TAN(Q83)))))<=Input!$G$28,1,IF(Input!$G$9+Input!$C$9*(Input!$G$11-(PI()/2-Q83-ASIN(SIN(PI()/2-Q83)/(Input!$C$9-Input!$C$14)*(Input!$C$9-(Input!$G$9-(Input!$G$9+Input!$C$9*TAN(Input!$G$11/2)-(Input!$C$9-Input!$C$9*COS($C$82))/SIN(Input!$G$11)-SIN(Input!$G$11-Q83)/SIN(Q83)*(Input!$C$9*TAN(Input!$G$11/2)-Input!$C$9*SIN($C$82)+(Input!$C$9-Input!$C$9*COS($C$82))/COS(Input!$G$11))))*TAN(Q83)))))>Input!$G$29,3,2))),999))","v":999},{"$f":"IF($V$79=1,IF(R82=999,999,IF(Input!$G$9+Input!$C$9*(Input!$G$11-(PI()/2-R82-ASIN(SIN(PI()/2-R82)/(Input!$C$9-Input!$C$14)*(Input!$C$9-(Input!$G$9-(Input!$G$9+Input!$C$9*TAN(Input!$G$11/2)-(Input!$C$9-Input!$C$9*COS($C$82))/SIN(Input!$G$11)-SIN(Input!$G$11-R82)/SIN(R82)*(Input!$C$9*TAN(Input!$G$11/2)-Input!$C$9*SIN($C$82)+(Input!$C$9-Input!$C$9*COS($C$82))/COS(Input!$G$11))))*TAN(R82)))))<=Input!$G$28,1,IF(Input!$G$9+Input!$C$9*(Input!$G$11-(PI()/2-R82-ASIN(SIN(PI()/2-R82)/(Input!$C$9-Input!$C$14)*(Input!$C$9-(Input!$G$9-(Input!$G$9+Input!$C$9*TAN(Input!$G$11/2)-(Input!$C$9-Input!$C$9*COS($C$82))/SIN(Input!$G$11)-SIN(Input!$G$11-R82)/SIN(R82)*(Input!$C$9*TAN(Input!$G$11/2)-Input!$C$9*SIN($C$82)+(Input!$C$9-Input!$C$9*COS($C$82))/COS(Input!$G$11))))*TAN(R82)))))>Input!$G$29,3,2))),IF($V$79=2,IF(R83=999,999,IF(Input!$G$9+Input!$C$9*(Input!$G$11-(PI()/2-R83-ASIN(SIN(PI()/2-R83)/(Input!$C$9-Input!$C$14)*(Input!$C$9-(Input!$G$9-(Input!$G$9+Input!$C$9*TAN(Input!$G$11/2)-(Input!$C$9-Input!$C$9*COS($C$82))/SIN(Input!$G$11)-SIN(Input!$G$11-R83)/SIN(R83)*(Input!$C$9*TAN(Input!$G$11/2)-Input!$C$9*SIN($C$82)+(Input!$C$9-Input!$C$9*COS($C$82))/COS(Input!$G$11))))*TAN(R83)))))<=Input!$G$28,1,IF(Input!$G$9+Input!$C$9*(Input!$G$11-(PI()/2-R83-ASIN(SIN(PI()/2-R83)/(Input!$C$9-Input!$C$14)*(Input!$C$9-(Input!$G$9-(Input!$G$9+Input!$C$9*TAN(Input!$G$11/2)-(Input!$C$9-Input!$C$9*COS($C$82))/SIN(Input!$G$11)-SIN(Input!$G$11-R83)/SIN(R83)*(Input!$C$9*TAN(Input!$G$11/2)-Input!$C$9*SIN($C$82)+(Input!$C$9-Input!$C$9*COS($C$82))/COS(Input!$G$11))))*TAN(R83)))))>Input!$G$29,3,2))),999))","v":999},null,null,{"$f":"IF($V$79=1,IF(U82=999,999,IF(Input!$G$9+Input!$C$9*(Input!$G$11-(PI()/2-U82-ASIN(SIN(PI()/2-U82)/(Input!$C$9-Input!$C$14)*(Input!$C$9-(Input!$G$9-(Input!$G$9+Input!$C$9*TAN(Input!$G$11/2)-(Input!$C$9-Input!$C$9*COS($C$82))/SIN(Input!$G$11)-SIN(Input!$G$11-U82)/SIN(U82)*(Input!$C$9*TAN(Input!$G$11/2)-Input!$C$9*SIN($C$82)+(Input!$C$9-Input!$C$9*COS($C$82))/COS(Input!$G$11))))*TAN(U82)))))<=Input!$G$28,1,IF(Input!$G$9+Input!$C$9*(Input!$G$11-(PI()/2-U82-ASIN(SIN(PI()/2-U82)/(Input!$C$9-Input!$C$14)*(Input!$C$9-(Input!$G$9-(Input!$G$9+Input!$C$9*TAN(Input!$G$11/2)-(Input!$C$9-Input!$C$9*COS($C$82))/SIN(Input!$G$11)-SIN(Input!$G$11-U82)/SIN(U82)*(Input!$C$9*TAN(Input!$G$11/2)-Input!$C$9*SIN($C$82)+(Input!$C$9-Input!$C$9*COS($C$82))/COS(Input!$G$11))))*TAN(U82)))))>Input!$G$29,3,2))),IF($V$79=2,IF(U83=999,999,IF(Input!$G$9+Input!$C$9*(Input!$G$11-(PI()/2-U83-ASIN(SIN(PI()/2-U83)/(Input!$C$9-Input!$C$14)*(Input!$C$9-(Input!$G$9-(Input!$G$9+Input!$C$9*TAN(Input!$G$11/2)-(Input!$C$9-Input!$C$9*COS($C$82))/SIN(Input!$G$11)-SIN(Input!$G$11-U83)/SIN(U83)*(Input!$C$9*TAN(Input!$G$11/2)-Input!$C$9*SIN($C$82)+(Input!$C$9-Input!$C$9*COS($C$82))/COS(Input!$G$11))))*TAN(U83)))))<=Input!$G$28,1,IF(Input!$G$9+Input!$C$9*(Input!$G$11-(PI()/2-U83-ASIN(SIN(PI()/2-U83)/(Input!$C$9-Input!$C$14)*(Input!$C$9-(Input!$G$9-(Input!$G$9+Input!$C$9*TAN(Input!$G$11/2)-(Input!$C$9-Input!$C$9*COS($C$82))/SIN(Input!$G$11)-SIN(Input!$G$11-U83)/SIN(U83)*(Input!$C$9*TAN(Input!$G$11/2)-Input!$C$9*SIN($C$82)+(Input!$C$9-Input!$C$9*COS($C$82))/COS(Input!$G$11))))*TAN(U83)))))>Input!$G$29,3,2))),IF(U84=999,999,IF(Input!$G$9+Input!$C$9*(Input!$G$11-(PI()/2-U84-ASIN(SIN(PI()/2-U84)/(Input!$C$9-Input!$C$14)*(Input!$C$9-(Input!$G$9-(Input!$G$9+Input!$C$9*TAN(Input!$G$11/2)-(Input!$C$9-Input!$C$9*COS($C$82))/SIN(Input!$G$11)-SIN(Input!$G$11-U84)/SIN(U84)*(Input!$C$9*TAN(Input!$G$11/2)-Input!$C$9*SIN($C$82)+(Input!$C$9-Input!$C$9*COS($C$82))/COS(Input!$G$11))))*TAN(U84)))))<=Input!$G$28,1,IF(Input!$G$9+Input!$C$9*(Input!$G$11-(PI()/2-U84-ASIN(SIN(PI()/2-U84)/(Input!$C$9-Input!$C$14)*(Input!$C$9-(Input!$G$9-(Input!$G$9+Input!$C$9*TAN(Input!$G$11/2)-(Input!$C$9-Input!$C$9*COS($C$82))/SIN(Input!$G$11)-SIN(Input!$G$11-U84)/SIN(U84)*(Input!$C$9*TAN(Input!$G$11/2)-Input!$C$9*SIN($C$82)+(Input!$C$9-Input!$C$9*COS($C$82))/COS(Input!$G$11))))*TAN(U84)))))>Input!$G$29,3,2)))))","v":999},"T Vertical Position (1,2,3)"]
[null,"theta(rad)=",{"$f":"Input!$G$11-C82","v":0.10807291666666663},null,null,null,null,null,null,null,"zI2",{"$f":"Input!$G$30+Ref!F81/100*(Input!$G$9+Input!$C$9*Input!$G$11+(Input!$G$9-Ref!C80)-Input!$G$28)+(Ref!F82-Ref!F81)*(Input!$G$9+Input!$C$9*Input!$G$11+(Input!$G$9-Ref!C80)-Input!$G$28)^2/(200*Input!$C$10*5280)+Ref!F79","v":{"$error":"#DIV/0!"}},{"$f":"IF($V$79=1,IF(M82=999,999,IF(Input!$G$9+Input!$C$9*Input!$G$11+Input!$G$9-(Input!$G$9+Input!$C$9*TAN(Input!$G$11/2)-(Input!$C$9-Input!$C$9*COS($C$82))/SIN(Input!$G$11)-SIN(Input!$G$11-M82)/SIN(M82)*(Input!$C$9*TAN(Input!$G$11/2)-Input!$C$9*SIN($C$82)+(Input!$C$9-Input!$C$9*COS($C$82))/COS(Input!$G$11)))<=Input!$G$28,1,IF(Input!$G$9+Input!$C$9*Input!$G$11+Input!$G$9-(Input!$G$9+Input!$C$9*TAN(Input!$G$11/2)-(Input!$C$9-Input!$C$9*COS($C$82))/SIN(Input!$G$11)-SIN(Input!$G$11-M82)/SIN(M82)*(Input!$C$9*TAN(Input!$G$11/2)-Input!$C$9*SIN($C$82)+(Input!$C$9-Input!$C$9*COS($C$82))/COS(Input!$G$11)))>Input!$G$29,3,2))),999)","v":999},{"$f":"IF($V$79=1,IF(N82=999,999,IF(Input!$G$9+Input!$C$9*Input!$G$11+Input!$G$9-(Input!$G$9+Input!$C$9*TAN(Input!$G$11/2)-(Input!$C$9-Input!$C$9*COS($C$82))/SIN(Input!$G$11)-SIN(Input!$G$11-N82)/SIN(N82)*(Input!$C$9*TAN(Input!$G$11/2)-Input!$C$9*SIN($C$82)+(Input!$C$9-Input!$C$9*COS($C$82))/COS(Input!$G$11)))<=Input!$G$28,1,IF(Input!$G$9+Input!$C$9*Input!$G$11+Input!$G$9-(Input!$G$9+Input!$C$9*TAN(Input!$G$11/2)-(Input!$C$9-Input!$C$9*COS($C$82))/SIN(Input!$G$11)-SIN(Input!$G$11-N82)/SIN(N82)*(Input!$C$9*TAN(Input!$G$11/2)-Input!$C$9*SIN($C$82)+(Input!$C$9-Input!$C$9*COS($C$82))/COS(Input!$G$11)))>Input!$G$29,3,2))),999)","v":999},{"$f":"IF($V$79=1,IF(O82=999,999,IF(Input!$G$9+Input!$C$9*Input!$G$11+Input!$G$9-(Input!$G$9+Input!$C$9*TAN(Input!$G$11/2)-(Input!$C$9-Input!$C$9*COS($C$82))/SIN(Input!$G$11)-SIN(Input!$G$11-O82)/SIN(O82)*(Input!$C$9*TAN(Input!$G$11/2)-Input!$C$9*SIN($C$82)+(Input!$C$9-Input!$C$9*COS($C$82))/COS(Input!$G$11)))<=Input!$G$28,1,IF(Input!$G$9+Input!$C$9*Input!$G$11+Input!$G$9-(Input!$G$9+Input!$C$9*TAN(Input!$G$11/2)-(Input!$C$9-Input!$C$9*COS($C$82))/SIN(Input!$G$11)-SIN(Input!$G$11-O82)/SIN(O82)*(Input!$C$9*TAN(Input!$G$11/2)-Input!$C$9*SIN($C$82)+(Input!$C$9-Input!$C$9*COS($C$82))/COS(Input!$G$11)))>Input!$G$29,3,2))),999)","v":999},null,{"$f":"IF($V$79=1,IF(Q82=999,999,IF(Input!$G$9+Input!$C$9*Input!$G$11+Input!$G$9-(Input!$G$9+Input!$C$9*TAN(Input!$G$11/2)-(Input!$C$9-Input!$C$9*COS($C$82))/SIN(Input!$G$11)-SIN(Input!$G$11-Q82)/SIN(Q82)*(Input!$C$9*TAN(Input!$G$11/2)-Input!$C$9*SIN($C$82)+(Input!$C$9-Input!$C$9*COS($C$82))/COS(Input!$G$11)))<=Input!$G$28,1,IF(Input!$G$9+Input!$C$9*Input!$G$11+Input!$G$9-(Input!$G$9+Input!$C$9*TAN(Input!$G$11/2)-(Input!$C$9-Input!$C$9*COS($C$82))/SIN(Input!$G$11)-SIN(Input!$G$11-Q82)/SIN(Q82)*(Input!$C$9*TAN(Input!$G$11/2)-Input!$C$9*SIN($C$82)+(Input!$C$9-Input!$C$9*COS($C$82))/COS(Input!$G$11)))>Input!$G$29,3,2))),IF($V$79=2,IF(Q83=999,999,IF(Input!$G$9+Input!$C$9*Input!$G$11+Input!$G$9-(Input!$G$9+Input!$C$9*TAN(Input!$G$11/2)-(Input!$C$9-Input!$C$9*COS($C$82))/SIN(Input!$G$11)-SIN(Input!$G$11-Q83)/SIN(Q83)*(Input!$C$9*TAN(Input!$G$11/2)-Input!$C$9*SIN($C$82)+(Input!$C$9-Input!$C$9*COS($C$82))/COS(Input!$G$11)))<=Input!$G$28,1,IF(Input!$G$9+Input!$C$9*Input!$G$11+Input!$G$9-(Input!$G$9+Input!$C$9*TAN(Input!$G$11/2)-(Input!$C$9-Input!$C$9*COS($C$82))/SIN(Input!$G$11)-SIN(Input!$G$11-Q83)/SIN(Q83)*(Input!$C$9*TAN(Input!$G$11/2)-Input!$C$9*SIN($C$82)+(Input!$C$9-Input!$C$9*COS($C$82))/COS(Input!$G$11)))>Input!$G$29,3,2))),999))","v":999},{"$f":"IF($V$79=1,IF(R82=999,999,IF(Input!$G$9+Input!$C$9*Input!$G$11+Input!$G$9-(Input!$G$9+Input!$C$9*TAN(Input!$G$11/2)-(Input!$C$9-Input!$C$9*COS($C$82))/SIN(Input!$G$11)-SIN(Input!$G$11-R82)/SIN(R82)*(Input!$C$9*TAN(Input!$G$11/2)-Input!$C$9*SIN($C$82)+(Input!$C$9-Input!$C$9*COS($C$82))/COS(Input!$G$11)))<=Input!$G$28,1,IF(Input!$G$9+Input!$C$9*Input!$G$11+Input!$G$9-(Input!$G$9+Input!$C$9*TAN(Input!$G$11/2)-(Input!$C$9-Input!$C$9*COS($C$82))/SIN(Input!$G$11)-SIN(Input!$G$11-R82)/SIN(R82)*(Input!$C$9*TAN(Input!$G$11/2)-Input!$C$9*SIN($C$82)+(Input!$C$9-Input!$C$9*COS($C$82))/COS(Input!$G$11)))>Input!$G$29,3,2))),IF($V$79=2,IF(R83=999,999,IF(Input!$G$9+Input!$C$9*Input!$G$11+Input!$G$9-(Input!$G$9+Input!$C$9*TAN(Input!$G$11/2)-(Input!$C$9-Input!$C$9*COS($C$82))/SIN(Input!$G$11)-SIN(Input!$G$11-R83)/SIN(R83)*(Input!$C$9*TAN(Input!$G$11/2)-Input!$C$9*SIN($C$82)+(Input!$C$9-Input!$C$9*COS($C$82))/COS(Input!$G$11)))<=Input!$G$28,1,IF(Input!$G$9+Input!$C$9*Input!$G$11+Input!$G$9-(Input!$G$9+Input!$C$9*TAN(Input!$G$11/2)-(Input!$C$9-Input!$C$9*COS($C$82))/SIN(Input!$G$11)-SIN(Input!$G$11-R83)/SIN(R83)*(Input!$C$9*TAN(Input!$G$11/2)-Input!$C$9*SIN($C$82)+(Input!$C$9-Input!$C$9*COS($C$82))/COS(Input!$G$11)))>Input!$G$29,3,2))),999))","v":999},null,null,{"$f":"IF($V$79=1,IF(U82=999,999,IF(Input!$G$9+Input!$C$9*Input!$G$11+Input!$G$9-(Input!$G$9+Input!$C$9*TAN(Input!$G$11/2)-(Input!$C$9-Input!$C$9*COS($C$82))/SIN(Input!$G$11)-SIN(Input!$G$11-U82)/SIN(U82)*(Input!$C$9*TAN(Input!$G$11/2)-Input!$C$9*SIN($C$82)+(Input!$C$9-Input!$C$9*COS($C$82))/COS(Input!$G$11)))<=Input!$G$28,1,IF(Input!$G$9+Input!$C$9*Input!$G$11+Input!$G$9-(Input!$G$9+Input!$C$9*TAN(Input!$G$11/2)-(Input!$C$9-Input!$C$9*COS($C$82))/SIN(Input!$G$11)-SIN(Input!$G$11-U82)/SIN(U82)*(Input!$C$9*TAN(Input!$G$11/2)-Input!$C$9*SIN($C$82)+(Input!$C$9-Input!$C$9*COS($C$82))/COS(Input!$G$11)))>Input!$G$29,3,2))),IF($V$79=2,IF(U83=999,999,IF(Input!$G$9+Input!$C$9*Input!$G$11+Input!$G$9-(Input!$G$9+Input!$C$9*TAN(Input!$G$11/2)-(Input!$C$9-Input!$C$9*COS($C$82))/SIN(Input!$G$11)-SIN(Input!$G$11-U83)/SIN(U83)*(Input!$C$9*TAN(Input!$G$11/2)-Input!$C$9*SIN($C$82)+(Input!$C$9-Input!$C$9*COS($C$82))/COS(Input!$G$11)))<=Input!$G$28,1,IF(Input!$G$9+Input!$C$9*Input!$G$11+Input!$G$9-(Input!$G$9+Input!$C$9*TAN(Input!$G$11/2)-(Input!$C$9-Input!$C$9*COS($C$82))/SIN(Input!$G$11)-SIN(Input!$G$11-U83)/SIN(U83)*(Input!$C$9*TAN(Input!$G$11/2)-Input!$C$9*SIN($C$82)+(Input!$C$9-Input!$C$9*COS($C$82))/COS(Input!$G$11)))>Input!$G$29,3,2))),IF(U84=999,999,IF(Input!$G$9+Input!$C$9*Input!$G$11+Input!$G$9-(Input!$G$9+Input!$C$9*TAN(Input!$G$11/2)-(Input!$C$9-Input!$C$9*COS($C$82))/SIN(Input!$G$11)-SIN(Input!$G$11-U84)/SIN(U84)*(Input!$C$9*TAN(Input!$G$11/2)-Input!$C$9*SIN($C$82)+(Input!$C$9-Input!$C$9*COS($C$82))/COS(Input!$G$11)))<=Input!$G$28,1,IF(Input!$G$9+Input!$C$9*Input!$G$11+Input!$G$9-(Input!$G$9+Input!$C$9*TAN(Input!$G$11/2)-(Input!$C$9-Input!$C$9*COS($C$82))/SIN(Input!$G$11)-SIN(Input!$G$11-U84)/SIN(U84)*(Input!$C$9*TAN(Input!$G$11/2)-Input!$C$9*SIN($C$82)+(Input!$C$9-Input!$C$9*COS($C$82))/COS(Input!$G$11)))>Input!$G$29,3,2)))))","v":999},"I Vertical Position (1,2,3)"]
[null,null,null,null,"S'=",null,null,null,null,null,"zI3",{"$f":"Input!$G$31+(Input!$G$9+Input!$C$9*Input!$G$11+(Input!$G$9-Ref!C80)-Input!$G$29)*Ref!F82/100+Ref!F79","v":{"$error":"#DIV/0!"}},{"$f":"IF(AND(M85=1,M86=1),1,999)","v":999},{"$f":"IF(AND(N85=1,N86=2),1,999)","v":999},{"$f":"IF(AND(O85=1,O86=3),1,999)","v":999},null,{"$f":"IF(AND(Q85=2,Q86=2),1,999)","v":999},{"$f":"IF(AND(R85=2,R86=3),1,999)","v":999},null,null,{"$f":"IF(AND(U85=3,U86=3),1,999)","v":999}]
[null,null,null,null,null,null,null,"The discrepency may just be precision error",null,null,null,null,"zT1",null,null,"zT2",null,null,"zT3"]
[null,null,null,null,null,null,null,null,null,null,null,null,"zI1","zI2","zI3","zI1","zI2","zI3","zI1","zI2","zI3"]
[null,"3D Sightline Condition 8",null,null,"HT",{"$f":"Input!$C$35","v":4},null,null,null,8,"zC1",{"$f":"-(Input!$G$28-Ref!C96)*Ref!F92/100+Ref!F91","v":-54.88},{"$f":"(L90-L96)/(Input!$C$9-Input!$C$9*COS(Ref!$C$97))-(Ref!L93-Ref!L96)/Input!$C$14","v":{"$error":"#DIV/0!"}},{"$f":"(L90-L97)/(Input!$C$9-Input!$C$9*COS(Ref!$C$97))-(Ref!L93-Ref!L97)/Input!$C$14","v":{"$error":"#DIV/0!"}},{"$f":"(L90-L98)/(Input!$C$9-Input!$C$9*COS(Ref!$C$97))-(Ref!L93-Ref!L98)/Input!$C$14","v":{"$error":"#DIV/0!"}},null,{"$f":"(L90-L97)/(Input!$C$9-Input!$C$9*COS(Ref!$C$97))-(Ref!L94-Ref!L97)/Input!$C$14","v":{"$error":"#DIV/0!"}},{"$f":"(L90-L98)/(Input!$C$9-Input!$C$9*COS(Ref!$C$97))-(Ref!L94-Ref!L98)/Input!$C$14","v":{"$error":"#DIV/0!"}},null,null,{"$f":"(L90-L98)/(Input!$C$9-Input!$C$9*COS(Ref!$C$97))-(Ref!L95-Ref!L98)/Input!$C$14","v":{"$error":"#DIV/0!"}},1,"=0"]
[null,"N=",{"$f":"Input!$G$9+Input!$C$9*TAN(Input!$G$11/2)-(Input!$C$9-Input!$C$9*COS(C93))/SIN(Input!$G$11)-SIN(Input!$G$11-C92)/SIN(C92)*(Input!$C$9*TAN(Input!$G$11/2)-Input!$C$9*SIN(C93)+(Input!$C$9-Input!$C$9*COS(C93))/COS(Input!$G$11))","v":{"$error":"#DIV/0!"}},null,"HC",{"$f":"Input!$C$34","v":3.5},null,null,null,null,"zC2",{"$f":"Input!$G$30+Ref!F92/100*(Ref!C96-Input!$G$28)+(Ref!F93-Ref!F92)*(Ref!C96-Input!$G$28)^2/(200*Input!$C$29*5280)+Ref!F91","v":52.702840909090909},null,null,null,null,{"$f":"(L91-L97)/(Input!$C$9-Input!$C$9*COS(Ref!$C$97))-(Ref!L94-Ref!L97)/Input!$C$14","v":{"$error":"#DIV/0!"}},{"$f":"(L91-L98)/(Input!$C$9-Input!$C$9*COS(Ref!$C$97))-(Ref!L94-Ref!L98)/Input!$C$14","v":{"$error":"#DIV/0!"}},null,null,{"$f":"(L91-L98)/(Input!$C$9-Input!$C$9*COS(Ref!$C$97))-(Ref!L95-Ref!L98)/Input!$C$14","v":{"$error":"#DIV/0!"}}]
[null,"alpha(rad)=",0,null,"G1",{"$f":"Input!$C$30","v":-3},null,null,null,null,"zC3",{"$f":"Input!$G$31+(Ref!C96-Input!$G$29)*Ref!F93/100+Ref!F91","v":30.200000000000003},null,null,null,null,null,null,null,null,{"$f":"(L92-L98)/(Input!$C$9-Input!$C$9*COS(Ref!$C$97))-(Ref!L95-Ref!L98)/Input!$C$14","v":{"$error":"#DIV/0!"}}]
[null,"lambda(rad)=",{"$f":"(C96-Input!$G$9)/Input!$C$9","v":0.92317708333333337},null,"G2",{"$f":"Input!$C$31","v":3},null,null,null,null,"zT1",{"$f":"-(Input!$G$28-Input!$G$9-Input!$C$9*Input!$G$11-(Input!$G$9-Ref!C91-Input!$C$14/TAN(Ref!C92)))*Ref!F92/100+Ref!F90","v":{"$error":"#DIV/0!"}},999,999,999,null,999,999,null,null,999,"zC1","Alpha","=999 if no alpha found"]
[null,"0=",null,null,"Hmin",{"$f":"Input!$C$36","v":2},null,null,null,null,"zT2",{"$f":"Input!$G$30+Ref!F92/100*(Input!$G$9+Input!$C$9*Input!$G$11+(Input!$G$9-Ref!C91-Input!$C$14/TAN(Ref!C92))-Input!$G$28)+(Ref!F93-Ref!F92)*(Input!$G$9+Input!$C$9*Input!$G$11+(Input!$G$9-Ref!C91-Input!$C$14/TAN(Ref!C92))-Input!$G$28)^2/(200*Input!$C$10*5280)+Ref!F90","v":{"$error":"#DIV/0!"}},null,null,null,null,999,999,null,null,999,"zC2"]
[null,null,null,null,"Use solver to find a theta that makes C44=0",null,null,null,null,null,"zT3",{"$f":"Input!$G$31+(Input!$G$9+Input!$C$9*Input!$G$11+(Input!$G$9-Ref!C91-Input!$C$14/TAN(Ref!C92))-Input!$G$29)*Ref!F93/100+Ref!F90","v":{"$error":"#DIV/0!"}},null,null,null,null,null,null,null,null,999,"zC3"]
[null,"E=",2100,null,null,null,null,null,null,null,"zI1",{"$f":"-(Input!$G$28-Input!$G$9-Input!$C$9*Input!$G$11-(Input!$G$9-Ref!C91))*Ref!F92/100+Ref!F90","v":{"$error":"#DIV/0!"}},{"$f":"IF($V$90=1,IF(M93=999,999,IF(Input!$G$9+Input!$C$9*Input!$G$11+(Input!$G$9-(Input!$G$9+Input!$C$9*TAN(Input!$G$11/2)-(Input!$C$9-Input!$C$9*COS($C$93))/SIN(Input!$G$11)-SIN(Input!$G$11-M93)/SIN(M93)*(Input!$C$9*TAN(Input!$G$11/2)-Input!$C$9*SIN($C$93)+(Input!$C$9-Input!$C$9*COS($C$93))/COS(Input!$G$11)))-Input!$C$14/TAN($M$93))<=Input!$G$28,1,IF(Input!$G$9+Input!$C$9*Input!$G$11+(Input!$G$9-(Input!$G$9+Input!$C$9*TAN(Input!$G$11/2)-(Input!$C$9-Input!$C$9*COS($C$93))/SIN(Input!$G$11)-SIN(Input!$G$11-M93)/SIN(M93)*(Input!$C$9*TAN(Input!$G$11/2)-Input!$C$9*SIN($C$93)+(Input!$C$9-Input!$C$9*COS($C$93))/COS(Input!$G$11)))-Input!$C$14/TAN($M$93))>Input!$G$29,3,2))),999)","v":999},{"$f":"IF($V$90=1,IF(N93=999,999,IF(Input!$G$9+Input!$C$9*Input!$G$11+(Input!$G$9-(Input!$G$9+Input!$C$9*TAN(Input!$G$11/2)-(Input!$C$9-Input!$C$9*COS($C$93))/SIN(Input!$G$11)-SIN(Input!$G$11-N93)/SIN(N93)*(Input!$C$9*TAN(Input!$G$11/2)-Input!$C$9*SIN($C$93)+(Input!$C$9-Input!$C$9*COS($C$93))/COS(Input!$G$11)))-Input!$C$14/TAN($M$93))<=Input!$G$28,1,IF(Input!$G$9+Input!$C$9*Input!$G$11+(Input!$G$9-(Input!$G$9+Input!$C$9*TAN(Input!$G$11/2)-(Input!$C$9-Input!$C$9*COS($C$93))/SIN(Input!$G$11)-SIN(Input!$G$11-N93)/SIN(N93)*(Input!$C$9*TAN(Input!$G$11/2)-Input!$C$9*SIN($C$93)+(Input!$C$9-Input!$C$9*COS($C$93))/COS(Input!$G$11)))-Input!$C$14/TAN($M$93))>Input!$G$29,3,2))),999)","v":999},{"$f":"IF($V$90=1,IF(O93=999,999,IF(Input!$G$9+Input!$C$9*Input!$G$11+(Input!$G$9-(Input!$G$9+Input!$C$9*TAN(Input!$G$11/2)-(Input!$C$9-Input!$C$9*COS($C$93))/SIN(Input!$G$11)-SIN(Input!$G$11-O93)/SIN(O93)*(Input!$C$9*TAN(Input!$G$11/2)-Input!$C$9*SIN($C$93)+(Input!$C$9-Input!$C$9*COS($C$93))/COS(Input!$G$11)))-Input!$C$14/TAN($M$93))<=Input!$G$28,1,IF(Input!$G$9+Input!$C$9*Input!$G$11+(Input!$G$9-(Input!$G$9+Input!$C$9*TAN(Input!$G$11/2)-(Input!$C$9-Input!$C$9*COS($C$93))/SIN(Input!$G$11)-SIN(Input!$G$11-O93)/SIN(O93)*(Input!$C$9*TAN(Input!$G$11/2)-Input!$C$9*SIN($C$93)+(Input!$C$9-Input!$C$9*COS($C$93))/COS(Input!$G$11)))-Input!$C$14/TAN($M$93))>Input!$G$29,3,2))),999)","v":999},null,{"$f":"IF($V$90=1,IF(Q93=999,999,IF(Input!$G$9+Input!$C$9*Input!$G$11+(Input!$G$9-(Input!$G$9+Input!$C$9*TAN(Input!$G$11/2)-(Input!$C$9-Input!$C$9*COS($C$93))/SIN(Input!$G$11)-SIN(Input!$G$11-Q93)/SIN(Q93)*(Input!$C$9*TAN(Input!$G$11/2)-Input!$C$9*SIN($C$93)+(Input!$C$9-Input!$C$9*COS($C$93))/COS(Input!$G$11)))-Input!$C$14/TAN($M$93))<=Input!$G$28,1,IF(Input!$G$9+Input!$C$9*Input!$G$11+(Input!$G$9-(Input!$G$9+Input!$C$9*TAN(Input!$G$11/2)-(Input!$C$9-Input!$C$9*COS($C$93))/SIN(Input!$G$11)-SIN(Input!$G$11-Q93)/SIN(Q93)*(Input!$C$9*TAN(Input!$G$11/2)-Input!$C$9*SIN($C$93)+(Input!$C$9-Input!$C$9*COS($C$93))/COS(Input!$G$11)))-Input!$C$14/TAN($M$93))>Input!$G$29,3,2))),IF($V$90=2,IF(Q94=999,999,IF(Input!$G$9+Input!$C$9*Input!$G$11+(Input!$G$9-(Input!$G$9+Input!$C$9*TAN(Input!$G$11/2)-(Input!$C$9-Input!$C$9*COS($C$93))/SIN(Input!$G$11)-SIN(Input!$G$11-Q94)/SIN(Q94)*(Input!$C$9*TAN(Input!$G$11/2)-Input!$C$9*SIN($C$93)+(Input!$C$9-Input!$C$9*COS($C$93))/COS(Input!$G$11)))-Input!$C$14/TAN($M$93))<=Input!$G$28,1,IF(Input!$G$9+Input!$C$9*Input!$G$11+(Input!$G$9-(Input!$G$9+Input!$C$9*TAN(Input!$G$11/2)-(Input!$C$9-Input!$C$9*COS($C$93))/SIN(Input!$G$11)-SIN(Input!$G$11-Q94)/SIN(Q94)*(Input!$C$9*TAN(Input!$G$11/2)-Input!$C$9*SIN($C$93)+(Input!$C$9-Input!$C$9*COS($C$93))/COS(Input!$G$11)))-Input!$C$14/TAN($M$93))>Input!$G$29,3,2))),999))","v":999},{"$f":"IF($V$90=1,IF(R93=999,999,IF(Input!$G$9+Input!$C$9*Input!$G$11+(Input!$G$9-(Input!$G$9+Input!$C$9*TAN(Input!$G$11/2)-(Input!$C$9-Input!$C$9*COS($C$93))/SIN(Input!$G$11)-SIN(Input!$G$11-R93)/SIN(R93)*(Input!$C$9*TAN(Input!$G$11/2)-Input!$C$9*SIN($C$93)+(Input!$C$9-Input!$C$9*COS($C$93))/COS(Input!$G$11)))-Input!$C$14/TAN($M$93))<=Input!$G$28,1,IF(Input!$G$9+Input!$C$9*Input!$G$11+(Input!$G$9-(Input!$G$9+Input!$C$9*TAN(Input!$G$11/2)-(Input!$C$9-Input!$C$9*COS($C$93))/SIN(Input!$G$11)-SIN(Input!$G$11-R93)/SIN(R93)*(Input!$C$9*TAN(Input!$G$11/2)-Input!$C$9*SIN($C$93)+(Input!$C$9-Input!$C$9*COS($C$93))/COS(Input!$G$11)))-Input!$C$14/TAN($M$93))>Input!$G$29,3,2))),IF($V$90=2,IF(R94=999,999,IF(Input!$G$9+Input!$C$9*Input!$G$11+(Input!$G$9-(Input!$G$9+Input!$C$9*TAN(Input!$G$11/2)-(Input!$C$9-Input!$C$9*COS($C$93))/SIN(Input!$G$11)-SIN(Input!$G$11-R94)/SIN(R94)*(Input!$C$9*TAN(Input!$G$11/2)-Input!$C$9*SIN($C$93)+(Input!$C$9-Input!$C$9*COS($C$93))/COS(Input!$G$11)))-Input!$C$14/TAN($M$93))<=Input!$G$28,1,IF(Input!$G$9+Input!$C$9*Input!$G$11+(Input!$G$9-(Input!$G$9+Input!$C$9*TAN(Input!$G$11/2)-(Input!$C$9-Input!$C$9*COS($C$93))/SIN(Input!$G$11)-SIN(Input!$G$11-R94)/SIN(R94)*(Input!$C$9*TAN(Input!$G$11/2)-Input!$C$9*SIN($C$93)+(Input!$C$9-Input!$C$9*COS($C$93))/COS(Input!$G$11)))-Input!$C$14/TAN($M$93))>Input!$G$29,3,2))),999))","v":999},null,null,{"$f":"IF($V$90=1,IF(U93=999,999,IF(Input!$G$9+Input!$C$9*Input!$G$11+(Input!$G$9-(Input!$G$9+Input!$C$9*TAN(Input!$G$11/2)-(Input!$C$9-Input!$C$9*COS($C$93))/SIN(Input!$G$11)-SIN(Input!$G$11-U93)/SIN(U93)*(Input!$C$9*TAN(Input!$G$11/2)-Input!$C$9*SIN($C$93)+(Input!$C$9-Input!$C$9*COS($C$93))/COS(Input!$G$11)))-Input!$C$14/TAN($M$93))<=Input!$G$28,1,IF(Input!$G$9+Input!$C$9*Input!$G$11+(Input!$G$9-(Input!$G$9+Input!$C$9*TAN(Input!$G$11/2)-(Input!$C$9-Input!$C$9*COS($C$93))/SIN(Input!$G$11)-SIN(Input!$G$11-U93)/SIN(U93)*(Input!$C$9*TAN(Input!$G$11/2)-Input!$C$9*SIN($C$93)+(Input!$C$9-Input!$C$9*COS($C$93))/COS(Input!$G$11)))-Input!$C$14/TAN($M$93))>Input!$G$29,3,2))),IF($V$90=2,IF(U94=999,999,IF(Input!$G$9+Input!$C$9*Input!$G$11+(Input!$G$9-(Input!$G$9+Input!$C$9*TAN(Input!$G$11/2)-(Input!$C$9-Input!$C$9*COS($C$93))/SIN(Input!$G$11)-SIN(Input!$G$11-U94)/SIN(U94)*(Input!$C$9*TAN(Input!$G$11/2)-Input!$C$9*SIN($C$93)+(Input!$C$9-Input!$C$9*COS($C$93))/COS(Input!$G$11)))-Input!$C$14/TAN($M$93))<=Input!$G$28,1,IF(Input!$G$9+Input!$C$9*Input!$G$11+(Input!$G$9-(Input!$G$9+Input!$C$9*TAN(Input!$G$11/2)-(Input!$C$9-Input!$C$9*COS($C$93))/SIN(Input!$G$11)-SIN(Input!$G$11-U94)/SIN(U94)*(Input!$C$9*TAN(Input!$G$11/2)-Input!$C$9*SIN($C$93)+(Input!$C$9-Input!$C$9*COS($C$93))/COS(Input!$G$11)))-Input!$C$14/TAN($M$93))>Input!$G$29,3,2))),IF(U95=999,999,IF(Input!$G$9+Input!$C$9*Input!$G$11+(Input!$G$9-(Input!$G$9+Input!$C$9*TAN(Input!$G$11/2)-(Input!$C$9-Input!$C$9*COS($C$93))/SIN(Input!$G$11)-SIN(Input!$G$11-U95)/SIN(U95)*(Input!$C$9*TAN(Input!$G$11/2)-Input!$C$9*SIN($C$93)+(Input!$C$9-Input!$C$9*COS($C$93))/COS(Input!$G$11)))-Input!$C$14/TAN($M$93))<=Input!$G$28,1,IF(Input!$G$9+Input!$C$9*Input!$G$11+(Input!$G$9-(Input!$G$9+Input!$C$9*TAN(Input!$G$11/2)-(Input!$C$9-Input!$C$9*COS($C$93))/SIN(Input!$G$11)-SIN(Input!$G$11-U95)/SIN(U95)*(Input!$C$9*TAN(Input!$G$11/2)-Input!$C$9*SIN($C$93)+(Input!$C$9-Input!$C$9*COS($C$93))/COS(Input!$G$11)))-Input!$C$14/TAN($M$93))>Input!$G$29,3,2)))))","v":999},"T Vertical Position (1,2,3)"]
[null,"theta(rad)=",{"$f":"Input!$G$11-C93","v":0.10807291666666663},null,null,null,null,null,null,null,"zI2",{"$f":"Input!$G$30+Ref!F92/100*(Input!$G$9+Input!$C$9*Input!$G$11+(Input!$G$9-Ref!C91)-Input!$G$28)+(Ref!F93-Ref!F92)*(Input!$G$9+Input!$C$9*Input!$G$11+(Input!$G$9-Ref!C91)-Input!$G$28)^2/(200*Input!$C$10*5280)+Ref!F90","v":{"$error":"#DIV/0!"}},{"$f":"IF($V$79=1,IF(M93=999,999,IF(Input!$G$9+Input!$C$9*Input!$G$11+Input!$G$9-(Input!$G$9+Input!$C$9*TAN(Input!$G$11/2)-(Input!$C$9-Input!$C$9*COS($C$93))/SIN(Input!$G$11)-SIN(Input!$G$11-M93)/SIN(M93)*(Input!$C$9*TAN(Input!$G$11/2)-Input!$C$9*SIN($C$93)+(Input!$C$9-Input!$C$9*COS($C$93))/COS(Input!$G$11)))<=Input!$G$28,1,IF(Input!$G$9+Input!$C$9*Input!$G$11+Input!$G$9-(Input!$G$9+Input!$C$9*TAN(Input!$G$11/2)-(Input!$C$9-Input!$C$9*COS($C$93))/SIN(Input!$G$11)-SIN(Input!$G$11-M93)/SIN(M93)*(Input!$C$9*TAN(Input!$G$11/2)-Input!$C$9*SIN($C$93)+(Input!$C$9-Input!$C$9*COS($C$93))/COS(Input!$G$11)))>Input!$G$29,3,2))),999)","v":999},{"$f":"IF($V$79=1,IF(N93=999,999,IF(Input!$G$9+Input!$C$9*Input!$G$11+Input!$G$9-(Input!$G$9+Input!$C$9*TAN(Input!$G$11/2)-(Input!$C$9-Input!$C$9*COS($C$93))/SIN(Input!$G$11)-SIN(Input!$G$11-N93)/SIN(N93)*(Input!$C$9*TAN(Input!$G$11/2)-Input!$C$9*SIN($C$93)+(Input!$C$9-Input!$C$9*COS($C$93))/COS(Input!$G$11)))<=Input!$G$28,1,IF(Input!$G$9+Input!$C$9*Input!$G$11+Input!$G$9-(Input!$G$9+Input!$C$9*TAN(Input!$G$11/2)-(Input!$C$9-Input!$C$9*COS($C$93))/SIN(Input!$G$11)-SIN(Input!$G$11-N93)/SIN(N93)*(Input!$C$9*TAN(Input!$G$11/2)-Input!$C$9*SIN($C$93)+(Input!$C$9-Input!$C$9*COS($C$93))/COS(Input!$G$11)))>Input!$G$29,3,2))),999)","v":999},{"$f":"IF($V$79=1,IF(O93=999,999,IF(Input!$G$9+Input!$C$9*Input!$G$11+Input!$G$9-(Input!$G$9+Input!$C$9*TAN(Input!$G$11/2)-(Input!$C$9-Input!$C$9*COS($C$93))/SIN(Input!$G$11)-SIN(Input!$G$11-O93)/SIN(O93)*(Input!$C$9*TAN(Input!$G$11/2)-Input!$C$9*SIN($C$93)+(Input!$C$9-Input!$C$9*COS($C$93))/COS(Input!$G$11)))<=Input!$G$28,1,IF(Input!$G$9+Input!$C$9*Input!$G$11+Input!$G$9-(Input!$G$9+Input!$C$9*TAN(Input!$G$11/2)-(Input!$C$9-Input!$C$9*COS($C$93))/SIN(Input!$G$11)-SIN(Input!$G$11-O93)/SIN(O93)*(Input!$C$9*TAN(Input!$G$11/2)-Input!$C$9*SIN($C$93)+(Input!$C$9-Input!$C$9*COS($C$93))/COS(Input!$G$11)))>Input!$G$29,3,2))),999)","v":999},null,{"$f":"IF($V$79=1,IF(Q93=999,999,IF(Input!$G$9+Input!$C$9*Input!$G$11+Input!$G$9-(Input!$G$9+Input!$C$9*TAN(Input!$G$11/2)-(Input!$C$9-Input!$C$9*COS($C$93))/SIN(Input!$G$11)-SIN(Input!$G$11-Q93)/SIN(Q93)*(Input!$C$9*TAN(Input!$G$11/2)-Input!$C$9*SIN($C$93)+(Input!$C$9-Input!$C$9*COS($C$93))/COS(Input!$G$11)))<=Input!$G$28,1,IF(Input!$G$9+Input!$C$9*Input!$G$11+Input!$G$9-(Input!$G$9+Input!$C$9*TAN(Input!$G$11/2)-(Input!$C$9-Input!$C$9*COS($C$93))/SIN(Input!$G$11)-SIN(Input!$G$11-Q93)/SIN(Q93)*(Input!$C$9*TAN(Input!$G$11/2)-Input!$C$9*SIN($C$93)+(Input!$C$9-Input!$C$9*COS($C$93))/COS(Input!$G$11)))>Input!$G$29,3,2))),IF($V$79=2,IF(Q94=999,999,IF(Input!$G$9+Input!$C$9*Input!$G$11+Input!$G$9-(Input!$G$9+Input!$C$9*TAN(Input!$G$11/2)-(Input!$C$9-Input!$C$9*COS($C$93))/SIN(Input!$G$11)-SIN(Input!$G$11-Q94)/SIN(Q94)*(Input!$C$9*TAN(Input!$G$11/2)-Input!$C$9*SIN($C$93)+(Input!$C$9-Input!$C$9*COS($C$93))/COS(Input!$G$11)))<=Input!$G$28,1,IF(Input!$G$9+Input!$C$9*Input!$G$11+Input!$G$9-(Input!$G$9+Input!$C$9*TAN(Input!$G$11/2)-(Input!$C$9-Input!$C$9*COS($C$93))/SIN(Input!$G$11)-SIN(Input!$G$11-Q94)/SIN(Q94)*(Input!$C$9*TAN(Input!$G$11/2)-Input!$C$9*SIN($C$93)+(Input!$C$9-Input!$C$9*COS($C$93))/COS(Input!$G$11)))>Input!$G$29,3,2))),999))","v":999},{"$f":"IF($V$79=1,IF(R93=999,999,IF(Input!$G$9+Input!$C$9*Input!$G$11+Input!$G$9-(Input!$G$9+Input!$C$9*TAN(Input!$G$11/2)-(Input!$C$9-Input!$C$9*COS($C$93))/SIN(Input!$G$11)-SIN(Input!$G$11-R93)/SIN(R93)*(Input!$C$9*TAN(Input!$G$11/2)-Input!$C$9*SIN($C$93)+(Input!$C$9-Input!$C$9*COS($C$93))/COS(Input!$G$11)))<=Input!$G$28,1,IF(Input!$G$9+Input!$C$9*Input!$G$11+Input!$G$9-(Input!$G$9+Input!$C$9*TAN(Input!$G$11/2)-(Input!$C$9-Input!$C$9*COS($C$93))/SIN(Input!$G$11)-SIN(Input!$G$11-R93)/SIN(R93)*(Input!$C$9*TAN(Input!$G$11/2)-Input!$C$9*SIN($C$93)+(Input!$C$9-Input!$C$9*COS($C$93))/COS(Input!$G$11)))>Input!$G$29,3,2))),IF($V$79=2,IF(R94=999,999,IF(Input!$G$9+Input!$C$9*Input!$G$11+Input!$G$9-(Input!$G$9+Input!$C$9*TAN(Input!$G$11/2)-(Input!$C$9-Input!$C$9*COS($C$93))/SIN(Input!$G$11)-SIN(Input!$G$11-R94)/SIN(R94)*(Input!$C$9*TAN(Input!$G$11/2)-Input!$C$9*SIN($C$93)+(Input!$C$9-Input!$C$9*COS($C$93))/COS(Input!$G$11)))<=Input!$G$28,1,IF(Input!$G$9+Input!$C$9*Input!$G$11+Input!$G$9-(Input!$G$9+Input!$C$9*TAN(Input!$G$11/2)-(Input!$C$9-Input!$C$9*COS($C$93))/SIN(Input!$G$11)-SIN(Input!$G$11-R94)/SIN(R94)*(Input!$C$9*TAN(Input!$G$11/2)-Input!$C$9*SIN($C$93)+(Input!$C$9-Input!$C$9*COS($C$93))/COS(Input!$G$11)))>Input!$G$29,3,2))),999))","v":999},null,null,{"$f":"IF($V$79=1,IF(U93=999,999,IF(Input!$G$9+Input!$C$9*Input!$G$11+Input!$G$9-(Input!$G$9+Input!$C$9*TAN(Input!$G$11/2)-(Input!$C$9-Input!$C$9*COS($C$93))/SIN(Input!$G$11)-SIN(Input!$G$11-U93)/SIN(U93)*(Input!$C$9*TAN(Input!$G$11/2)-Input!$C$9*SIN($C$93)+(Input!$C$9-Input!$C$9*COS($C$93))/COS(Input!$G$11)))<=Input!$G$28,1,IF(Input!$G$9+Input!$C$9*Input!$G$11+Input!$G$9-(Input!$G$9+Input!$C$9*TAN(Input!$G$11/2)-(Input!$C$9-Input!$C$9*COS($C$93))/SIN(Input!$G$11)-SIN(Input!$G$11-U93)/SIN(U93)*(Input!$C$9*TAN(Input!$G$11/2)-Input!$C$9*SIN($C$93)+(Input!$C$9-Input!$C$9*COS($C$93))/COS(Input!$G$11)))>Input!$G$29,3,2))),IF($V$79=2,IF(U94=999,999,IF(Input!$G$9+Input!$C$9*Input!$G$11+Input!$G$9-(Input!$G$9+Input!$C$9*TAN(Input!$G$11/2)-(Input!$C$9-Input!$C$9*COS($C$93))/SIN(Input!$G$11)-SIN(Input!$G$11-U94)/SIN(U94)*(Input!$C$9*TAN(Input!$G$11/2)-Input!$C$9*SIN($C$93)+(Input!$C$9-Input!$C$9*COS($C$93))/COS(Input!$G$11)))<=Input!$G$28,1,IF(Input!$G$9+Input!$C$9*Input!$G$11+Input!$G$9-(Input!$G$9+Input!$C$9*TAN(Input!$G$11/2)-(Input!$C$9-Input!$C$9*COS($C$93))/SIN(Input!$G$11)-SIN(Input!$G$11-U94)/SIN(U94)*(Input!$C$9*TAN(Input!$G$11/2)-Input!$C$9*SIN($C$93)+(Input!$C$9-Input!$C$9*COS($C$93))/COS(Input!$G$11)))>Input!$G$29,3,2))),IF(U95=999,999,IF(Input!$G$9+Input!$C$9*Input!$G$11+Input!$G$9-(Input!$G$9+Input!$C$9*TAN(Input!$G$11/2)-(Input!$C$9-Input!$C$9*COS($C$93))/SIN(Input!$G$11)-SIN(Input!$G$11-U95)/SIN(U95)*(Input!$C$9*TAN(Input!$G$11/2)-Input!$C$9*SIN($C$93)+(Input!$C$9-Input!$C$9*COS($C$93))/COS(Input!$G$11)))<=Input!$G$28,1,IF(Input!$G$9+Input!$C$9*Input!$G$11+Input!$G$9-(Input!$G$9+Input!$C$9*TAN(Input!$G$11/2)-(Input!$C$9-Input!$C$9*COS($C$93))/SIN(Input!$G$11)-SIN(Input!$G$11-U95)/SIN(U95)*(Input!$C$9*TAN(Input!$G$11/2)-Input!$C$9*SIN($C$93)+(Input!$C$9-Input!$C$9*COS($C$93))/COS(Input!$G$11)))>Input!$G$29,3,2)))))","v":999},"I Vertical Position (1,2,3)"]
[null,null,null,null,"S'=",null,null,null,null,null,"zI3",{"$f":"Input!$G$31+(Input!$G$9+Input!$C$9*Input!$G$11+(Input!$G$9-Ref!C91)-Input!$G$29)*Ref!F93/100+Ref!F90","v":{"$error":"#DIV/0!"}},{"$f":"IF(AND(M96=1,M97=1),1,999)","v":999},{"$f":"IF(AND(N96=1,N97=2),1,999)","v":999},{"$f":"IF(AND(O96=1,O97=3),1,999)","v":999},null,{"$f":"IF(AND(Q96=2,Q97=2),1,999)","v":999},{"$f":"IF(AND(R96=2,R97=3),1,999)","v":999},null,null,{"$f":"IF(AND(U96=3,U97=3),1,999)","v":999}]
[]
[null,null,null,null,null,null,null,null,null,null,null,"Speed","Level SSD"]
[null,"Facility Types",null,"Type","Lanes","Capacity",null,null,"To the right",null,null,15,80,null,"SSD1",{"$f":"1.47*Input!$C$11*2.5+Input!$C$11^2/(30*((11.2/32.2)+Input!C30/100))","v":681.98945508435941}]
[null,"Rural two-lane highway",null,1,1,1900,null,null,"To the left",null,null,20,115,null,"SSD2",{"$f":"1.47*Input!$C$11*2.5+Input!$C$11^2/(30*((11.2/32.2)+Input!C31/100))","v":611.62145186037606}]
[null,"Rural four-lane undivided highway",null,2,2,2200,null,null,null,null,null,25,155]
[null,"Rural four-lane divided highway",null,3,2,2200,null,null,null,null,null,30,200]
[null,"Rural freeway (4 lanes)",null,4,2,2400,null,null,null,null,null,35,250,null,"Design SSD",{"$f":"ROUNDUP(IF(Input!B31=\"\",IF(ABS(Input!C30)>=3,Ref!P101,VLOOKUP(Input!C11,Ref!L101:M114,2)),IF(OR(AND(Input!C30>=3,Input!C31>=3),AND(Input!C30<=-3,Input!C31<=-3)),(Ref!P101+Ref!P102)/2,VLOOKUP(Input!C11,Ref!L101:M114,2))),0)","v":682}]
[null,"Rural freeway (6 lanes)",null,5,3,2400,null,null,null,null,null,40,305]
[null,"Urban freeway (4 lanes)",null,6,2,2400,null,null,null,null,null,45,360]
[null,"Urban freeway (6 lanes)",null,7,3,2400,null,null,null,null,null,50,425]
[null,"Urban freeway (8 lanes)",null,8,4,2400,null,null,null,null,null,55,495]
[null,"Rural one-lane entrance ramp",null,9,1,2200,null,null,null,null,null,60,570]
[null,"Rural one-lane exit ramp",null,10,1,2200,null,null,null,null,null,65,645]
[null,"Urban one-lane entrance ramp",null,11,1,2200,null,null,null,null,null,70,730]
[null,"Urban one-lane exit ramp",null,12,1,2200,null,null,null,null,null,75,820]
[null,"Urban two-lane entrance ramp",null,13,2,2200,null,null,null,null,null,80,910]
[null,"Urban two-lane exit ramp",null,14,2,2200]
[]
[null,"Type/hr(8%)",1,2,3,4,5,6,7,8,9,10,11,12,13,14]
[null,1,6.7999999999999996E-3,7.3000000000000001E-3,7.3000000000000001E-3,1.44E-2,1.44E-2,1.0200000000000001E-2,1.0200000000000001E-2,1.0200000000000001E-2,1.44E-2,1.44E-2,1.0200000000000001E-2,1.0200000000000001E-2,1.0200000000000001E-2,1.0200000000000001E-2]
[null,2,4.4000000000000003E-3,5.0000000000000001E-3,5.0000000000000001E-3,1.17E-2,1.17E-2,7.3000000000000001E-3,7.3000000000000001E-3,7.3000000000000001E-3,1.17E-2,1.17E-2,7.3000000000000001E-3,7.3000000000000001E-3,7.3000000000000001E-3,7.3000000000000001E-3]
[null,3,4.1000000000000003E-3,4.7000000000000002E-3,4.7000000000000002E-3,1.09E-2,1.09E-2,6.7000000000000002E-3,6.7000000000000002E-3,6.7000000000000002E-3,1.09E-2,1.09E-2,6.7000000000000002E-3,6.7000000000000002E-3,6.7000000000000002E-3,6.7000000000000002E-3]
[null,4,5.1999999999999998E-3,5.7999999999999996E-3,5.7999999999999996E-3,1.18E-2,1.18E-2,7.7999999999999996E-3,7.7999999999999996E-3,7.7999999999999996E-3,1.18E-2,1.18E-2,7.7999999999999996E-3,7.7999999999999996E-3,7.7999999999999996E-3,7.7999999999999996E-3]
[null,5,1.04E-2,1.12E-2,1.12E-2,1.52E-2,1.52E-2,1.21E-2,1.21E-2,1.21E-2,1.52E-2,1.52E-2,1.21E-2,1.21E-2,1.21E-2,1.21E-2]
[null,6,2.6700000000000002E-2,2.7099999999999999E-2,2.7099999999999999E-2,2.4799999999999999E-2,2.4799999999999999E-2,2.5700000000000001E-2,2.5700000000000001E-2,2.5700000000000001E-2,2.4799999999999999E-2,2.4799999999999999E-2,2.5700000000000001E-2,2.5700000000000001E-2,2.5700000000000001E-2,2.5700000000000001E-2]
[null,7,5.0799999999999998E-2,4.99E-2,4.99E-2,4.1399999999999999E-2,4.1399999999999999E-2,5.1299999999999998E-2,5.1299999999999998E-2,5.1299999999999998E-2,4.1399999999999999E-2,4.1399999999999999E-2,5.1299999999999998E-2,5.1299999999999998E-2,5.1299999999999998E-2,5.1299999999999998E-2]
[null,8,6.5299999999999997E-2,6.4299999999999996E-2,6.4299999999999996E-2,5.3999999999999999E-2,5.3999999999999999E-2,6.8199999999999997E-2,6.8199999999999997E-2,6.8199999999999997E-2,5.3999999999999999E-2,5.3999999999999999E-2,6.8199999999999997E-2,6.8199999999999997E-2,6.8199999999999997E-2,6.8199999999999997E-2]
[null,9,5.7299999999999997E-2,5.8000000000000003E-2,5.8000000000000003E-2,5.2499999999999998E-2,5.2499999999999998E-2,6.13E-2,6.13E-2,6.13E-2,5.2499999999999998E-2,5.2499999999999998E-2,6.13E-2,6.13E-2,6.13E-2,6.13E-2]
[null,10,5.1299999999999998E-2,5.2999999999999999E-2,5.2999999999999999E-2,5.1499999999999997E-2,5.1499999999999997E-2,5.2200000000000003E-2,5.2200000000000003E-2,5.2200000000000003E-2,5.1499999999999997E-2,5.1499999999999997E-2,5.2200000000000003E-2,5.2200000000000003E-2,5.2200000000000003E-2,5.2200000000000003E-2]
[null,11,5.1700000000000003E-2,5.3800000000000001E-2,5.3800000000000001E-2,5.3199999999999997E-2,5.3199999999999997E-2,4.99E-2,4.99E-2,4.99E-2,5.3199999999999997E-2,5.3199999999999997E-2,4.99E-2,4.99E-2,4.99E-2,4.99E-2]
[null,12,5.4100000000000002E-2,5.5899999999999998E-2,5.5899999999999998E-2,5.4800000000000001E-2,5.4800000000000001E-2,5.1299999999999998E-2,5.1299999999999998E-2,5.1299999999999998E-2,5.4800000000000001E-2,5.4800000000000001E-2,5.1299999999999998E-2,5.1299999999999998E-2,5.1299999999999998E-2,5.1299999999999998E-2]
[null,13,5.67E-2,5.8099999999999999E-2,5.8099999999999999E-2,5.6399999999999999E-2,5.6399999999999999E-2,5.3199999999999997E-2,5.3199999999999997E-2,5.3199999999999997E-2,5.6399999999999999E-2,5.6399999999999999E-2,5.3199999999999997E-2,5.3199999999999997E-2,5.3199999999999997E-2,5.3199999999999997E-2]
[null,14,5.79E-2,5.9900000000000002E-2,5.9900000000000002E-2,5.8500000000000003E-2,5.8500000000000003E-2,5.4800000000000001E-2,5.4800000000000001E-2,5.4800000000000001E-2,5.8500000000000003E-2,5.8500000000000003E-2,5.4800000000000001E-2,5.4800000000000001E-2,5.4800000000000001E-2,5.4800000000000001E-2]
[null,15,6.4799999999999996E-2,6.5799999999999997E-2,6.5799999999999997E-2,6.3E-2,6.3E-2,6.08E-2,6.08E-2,6.08E-2,6.3E-2,6.3E-2,6.08E-2,6.08E-2,6.08E-2,6.08E-2]
[null,16,7.6899999999999996E-2,7.5800000000000006E-2,7.5800000000000006E-2,6.8599999999999994E-2,6.8599999999999994E-2,7.0599999999999996E-2,7.0599999999999996E-2,7.0599999999999996E-2,6.8599999999999994E-2,6.8599999999999994E-2,7.0599999999999996E-2,7.0599999999999996E-2,7.0599999999999996E-2,7.0599999999999996E-2]
[null,17,0.08,0.08,0.08,0.08,0.08,0.08,0.08,0.08,0.08,0.08,0.08,0.08,0.08,0.08]
[null,18,7.8299999999999995E-2,7.4999999999999997E-2,7.4999999999999997E-2,6.8099999999999994E-2,6.8099999999999994E-2,7.2999999999999995E-2,7.2999999999999995E-2,7.2999999999999995E-2,6.8099999999999994E-2,6.8099999999999994E-2,7.2999999999999995E-2,7.2999999999999995E-2,7.2999999999999995E-2,7.2999999999999995E-2]
[null,19,5.8299999999999998E-2,5.4800000000000001E-2,5.4800000000000001E-2,5.3100000000000001E-2,5.3100000000000001E-2,5.6800000000000003E-2,5.6800000000000003E-2,5.6800000000000003E-2,5.3100000000000001E-2,5.3100000000000001E-2,5.6800000000000003E-2,5.6800000000000003E-2,5.6800000000000003E-2,5.6800000000000003E-2]
[null,20,4.3900000000000002E-2,4.1399999999999999E-2,4.1399999999999999E-2,4.2700000000000002E-2,4.2700000000000002E-2,4.2900000000000001E-2,4.2900000000000001E-2,4.2900000000000001E-2,4.2700000000000002E-2,4.2700000000000002E-2,4.2900000000000001E-2,4.2900000000000001E-2,4.2900000000000001E-2,4.2900000000000001E-2]
[null,21,3.6200000000000003E-2,3.4099999999999998E-2,3.4099999999999998E-2,3.6600000000000001E-2,3.6600000000000001E-2,3.5099999999999999E-2,3.5099999999999999E-2,3.5099999999999999E-2,3.6600000000000001E-2,3.6600000000000001E-2,3.5099999999999999E-2,3.5099999999999999E-2,3.5099999999999999E-2,3.5099999999999999E-2]
[null,22,2.76E-2,2.7199999999999998E-2,2.7199999999999998E-2,3.1399999999999997E-2,3.1399999999999997E-2,2.9700000000000001E-2,2.9700000000000001E-2,2.9700000000000001E-2,3.1399999999999997E-2,3.1399999999999997E-2,2.9700000000000001E-2,2.9700000000000001E-2,2.9700000000000001E-2,2.9700000000000001E-2]
[null,23,1.89E-2,1.89E-2,1.89E-2,2.5499999999999998E-2,2.5499999999999998E-2,2.2800000000000001E-2,2.2800000000000001E-2,2.2800000000000001E-2,2.5499999999999998E-2,2.5499999999999998E-2,2.2800000000000001E-2,2.2800000000000001E-2,2.2800000000000001E-2,2.2800000000000001E-2]
[null,24,1.24E-2,1.2999999999999999E-2,1.2999999999999999E-2,1.9900000000000001E-2,1.9900000000000001E-2,1.6299999999999999E-2,1.6299999999999999E-2,1.6299999999999999E-2,1.9900000000000001E-2,1.9900000000000001E-2,1.6299999999999999E-2,1.6299999999999999E-2,1.6299999999999999E-2,1.6299999999999999E-2]
[null,null,{"$f":"SUM(C118:C141)","v":0.99999999999999989},0.99999999999999989,0.99999999999999989,0.99999999999999989,0.99999999999999989,0.99999999999999989,0.99999999999999989,0.99999999999999989,0.99999999999999989,0.99999999999999989,0.99999999999999989,0.99999999999999989,0.99999999999999989,0.99999999999999989]
[]
[null,"Type/hr(9%)",1,2,3,4,5,6,7,8,9,10,11,12,13,14]
[null,1,6.3E-3,6.8999999999999999E-3,6.8999999999999999E-3,1.3899999999999999E-2,1.3899999999999999E-2,9.7000000000000003E-3,9.7000000000000003E-3,9.7000000000000003E-3,1.3899999999999999E-2,1.3899999999999999E-2,9.7000000000000003E-3,9.7000000000000003E-3,9.7000000000000003E-3,9.7000000000000003E-3]
[null,2,3.8999999999999998E-3,4.5999999999999999E-3,4.5999999999999999E-3,1.12E-2,1.12E-2,6.7999999999999996E-3,6.7999999999999996E-3,6.7999999999999996E-3,1.12E-2,1.12E-2,6.7999999999999996E-3,6.7999999999999996E-3,6.7999999999999996E-3,6.7999999999999996E-3]
[null,3,3.5999999999999999E-3,4.3E-3,4.3E-3,1.04E-2,1.04E-2,6.1999999999999998E-3,6.1999999999999998E-3,6.1999999999999998E-3,1.04E-2,1.04E-2,6.1999999999999998E-3,6.1999999999999998E-3,6.1999999999999998E-3,6.1999999999999998E-3]
[null,4,4.7000000000000002E-3,5.4000000000000003E-3,5.4000000000000003E-3,1.1299999999999999E-2,1.1299999999999999E-2,7.3000000000000001E-3,7.3000000000000001E-3,7.3000000000000001E-3,1.1299999999999999E-2,1.1299999999999999E-2,7.3000000000000001E-3,7.3000000000000001E-3,7.3000000000000001E-3,7.3000000000000001E-3]
[null,5,9.9000000000000008E-3,1.0800000000000001E-2,1.0800000000000001E-2,1.47E-2,1.47E-2,1.1599999999999999E-2,1.1599999999999999E-2,1.1599999999999999E-2,1.47E-2,1.47E-2,1.1599999999999999E-2,1.1599999999999999E-2,1.1599999999999999E-2,1.1599999999999999E-2]
[null,6,2.6200000000000001E-2,2.6700000000000002E-2,2.6700000000000002E-2,2.4299999999999999E-2,2.4299999999999999E-2,2.52E-2,2.52E-2,2.52E-2,2.4299999999999999E-2,2.4299999999999999E-2,2.52E-2,2.52E-2,2.52E-2,2.52E-2]
[null,7,5.0299999999999997E-2,4.9500000000000002E-2,4.9500000000000002E-2,4.0899999999999999E-2,4.0899999999999999E-2,5.0799999999999998E-2,5.0799999999999998E-2,5.0799999999999998E-2,4.0899999999999999E-2,4.0899999999999999E-2,5.0799999999999998E-2,5.0799999999999998E-2,5.0799999999999998E-2,5.0799999999999998E-2]
[null,8,6.4799999999999996E-2,6.3899999999999998E-2,6.3899999999999998E-2,5.3499999999999999E-2,5.3499999999999999E-2,6.7699999999999996E-2,6.7699999999999996E-2,6.7699999999999996E-2,5.3499999999999999E-2,5.3499999999999999E-2,6.7699999999999996E-2,6.7699999999999996E-2,6.7699999999999996E-2,6.7699999999999996E-2]
[null,9,5.6800000000000003E-2,5.7599999999999998E-2,5.7599999999999998E-2,5.1999999999999998E-2,5.1999999999999998E-2,6.08E-2,6.08E-2,6.08E-2,5.1999999999999998E-2,5.1999999999999998E-2,6.08E-2,6.08E-2,6.08E-2,6.08E-2]
[null,10,5.0799999999999998E-2,5.2600000000000001E-2,5.2600000000000001E-2,5.0999999999999997E-2,5.0999999999999997E-2,5.1700000000000003E-2,5.1700000000000003E-2,5.1700000000000003E-2,5.0999999999999997E-2,5.0999999999999997E-2,5.1700000000000003E-2,5.1700000000000003E-2,5.1700000000000003E-2,5.1700000000000003E-2]
[null,11,5.1200000000000002E-2,5.3400000000000003E-2,5.3400000000000003E-2,5.2699999999999997E-2,5.2699999999999997E-2,4.9399999999999999E-2,4.9399999999999999E-2,4.9399999999999999E-2,5.2699999999999997E-2,5.2699999999999997E-2,4.9399999999999999E-2,4.9399999999999999E-2,4.9399999999999999E-2,4.9399999999999999E-2]
[null,12,5.3600000000000002E-2,5.5500000000000001E-2,5.5500000000000001E-2,5.4300000000000001E-2,5.4300000000000001E-2,5.0799999999999998E-2,5.0799999999999998E-2,5.0799999999999998E-2,5.4300000000000001E-2,5.4300000000000001E-2,5.0799999999999998E-2,5.0799999999999998E-2,5.0799999999999998E-2,5.0799999999999998E-2]
[null,13,5.62E-2,5.7700000000000001E-2,5.7700000000000001E-2,5.5899999999999998E-2,5.5899999999999998E-2,5.2699999999999997E-2,5.2699999999999997E-2,5.2699999999999997E-2,5.5899999999999998E-2,5.5899999999999998E-2,5.2699999999999997E-2,5.2699999999999997E-2,5.2699999999999997E-2,5.2699999999999997E-2]
[null,14,5.74E-2,5.9499999999999997E-2,5.9499999999999997E-2,5.8000000000000003E-2,5.8000000000000003E-2,5.4300000000000001E-2,5.4300000000000001E-2,5.4300000000000001E-2,5.8000000000000003E-2,5.8000000000000003E-2,5.4300000000000001E-2,5.4300000000000001E-2,5.4300000000000001E-2,5.4300000000000001E-2]
[null,15,6.4299999999999996E-2,6.54E-2,6.54E-2,6.25E-2,6.25E-2,6.0299999999999999E-2,6.0299999999999999E-2,6.0299999999999999E-2,6.25E-2,6.25E-2,6.0299999999999999E-2,6.0299999999999999E-2,6.0299999999999999E-2,6.0299999999999999E-2]
[null,16,7.6399999999999996E-2,7.46E-2,7.46E-2,6.9599999999999995E-2,6.9599999999999995E-2,7.0099999999999996E-2,7.0099999999999996E-2,7.0099999999999996E-2,6.9599999999999995E-2,6.9599999999999995E-2,7.0099999999999996E-2,7.0099999999999996E-2,7.0099999999999996E-2,7.0099999999999996E-2]
[null,17,0.09,0.09,0.09,0.09,0.09,0.09,0.09,0.09,0.09,0.09,0.09,0.09,0.09,0.09]
[null,18,7.9299999999999995E-2,7.46E-2,7.46E-2,6.7599999999999993E-2,6.7599999999999993E-2,7.3999999999999996E-2,7.3999999999999996E-2,7.3999999999999996E-2,6.7599999999999993E-2,6.7599999999999993E-2,7.3999999999999996E-2,7.3999999999999996E-2,7.3999999999999996E-2,7.3999999999999996E-2]
[null,19,5.7799999999999997E-2,5.4399999999999997E-2,5.4399999999999997E-2,5.2600000000000001E-2,5.2600000000000001E-2,5.6300000000000003E-2,5.6300000000000003E-2,5.6300000000000003E-2,5.2600000000000001E-2,5.2600000000000001E-2,5.6300000000000003E-2,5.6300000000000003E-2,5.6300000000000003E-2,5.6300000000000003E-2]
[null,20,4.3400000000000001E-2,4.1000000000000002E-2,4.1000000000000002E-2,4.2200000000000001E-2,4.2200000000000001E-2,4.24E-2,4.24E-2,4.24E-2,4.2200000000000001E-2,4.2200000000000001E-2,4.24E-2,4.24E-2,4.24E-2,4.24E-2]
[null,21,3.5700000000000003E-2,3.3700000000000001E-2,3.3700000000000001E-2,3.61E-2,3.61E-2,3.4599999999999999E-2,3.4599999999999999E-2,3.4599999999999999E-2,3.61E-2,3.61E-2,3.4599999999999999E-2,3.4599999999999999E-2,3.4599999999999999E-2,3.4599999999999999E-2]
[null,22,2.7099999999999999E-2,2.6800000000000001E-2,2.6800000000000001E-2,3.09E-2,3.09E-2,2.92E-2,2.92E-2,2.92E-2,3.09E-2,3.09E-2,2.92E-2,2.92E-2,2.92E-2,2.92E-2]
[null,23,1.84E-2,1.8499999999999999E-2,1.8499999999999999E-2,2.5000000000000001E-2,2.5000000000000001E-2,2.23E-2,2.23E-2,2.23E-2,2.5000000000000001E-2,2.5000000000000001E-2,2.23E-2,2.23E-2,2.23E-2,2.23E-2]
[null,24,1.1900000000000001E-2,1.26E-2,1.26E-2,1.9400000000000001E-2,1.9400000000000001E-2,1.5800000000000002E-2,1.5800000000000002E-2,1.5800000000000002E-2,1.9400000000000001E-2,1.9400000000000001E-2,1.5800000000000002E-2,1.5800000000000002E-2,1.5800000000000002E-2,1.5800000000000002E-2]
[null,null,{"$f":"SUM(C145:C168)","v":1},1,1,1,1,0.99999999999999989,0.99999999999999989,0.99999999999999989,1,1,0.99999999999999989,0.99999999999999989,0.99999999999999989,0.99999999999999989]
[]
[null,"Type/hr(10%)",1,2,3,4,5,6,7,8,9,10,11,12,13,14]
[null,1,5.8999999999999999E-3,6.4000000000000003E-3,6.4000000000000003E-3,1.35E-2,1.35E-2,9.2999999999999992E-3,9.2999999999999992E-3,9.2999999999999992E-3,1.35E-2,1.35E-2,9.2999999999999992E-3,9.2999999999999992E-3,9.2999999999999992E-3,9.2999999999999992E-3]
[null,2,3.5000000000000001E-3,4.1000000000000003E-3,4.1000000000000003E-3,1.0800000000000001E-2,1.0800000000000001E-2,6.4000000000000003E-3,6.4000000000000003E-3,6.4000000000000003E-3,1.0800000000000001E-2,1.0800000000000001E-2,6.4000000000000003E-3,6.4000000000000003E-3,6.4000000000000003E-3,6.4000000000000003E-3]
[null,3,3.2000000000000002E-3,3.8E-3,3.8E-3,0.01,0.01,5.7999999999999996E-3,5.7999999999999996E-3,5.7999999999999996E-3,0.01,0.01,5.7999999999999996E-3,5.7999999999999996E-3,5.7999999999999996E-3,5.7999999999999996E-3]
[null,4,4.3E-3,4.8999999999999998E-3,4.8999999999999998E-3,1.09E-2,1.09E-2,6.8999999999999999E-3,6.8999999999999999E-3,6.8999999999999999E-3,1.09E-2,1.09E-2,6.8999999999999999E-3,6.8999999999999999E-3,6.8999999999999999E-3,6.8999999999999999E-3]
[null,5,9.4999999999999998E-3,1.03E-2,1.03E-2,1.43E-2,1.43E-2,1.12E-2,1.12E-2,1.12E-2,1.43E-2,1.43E-2,1.12E-2,1.12E-2,1.12E-2,1.12E-2]
[null,6,2.58E-2,2.6200000000000001E-2,2.6200000000000001E-2,2.3900000000000001E-2,2.3900000000000001E-2,2.4799999999999999E-2,2.4799999999999999E-2,2.4799999999999999E-2,2.3900000000000001E-2,2.3900000000000001E-2,2.4799999999999999E-2,2.4799999999999999E-2,2.4799999999999999E-2,2.4799999999999999E-2]
[null,7,4.99E-2,4.9000000000000002E-2,4.9000000000000002E-2,4.0500000000000001E-2,4.0500000000000001E-2,5.04E-2,5.04E-2,5.04E-2,4.0500000000000001E-2,4.0500000000000001E-2,5.04E-2,5.04E-2,5.04E-2,5.04E-2]
[null,8,6.4399999999999999E-2,6.3399999999999998E-2,6.3399999999999998E-2,5.3100000000000001E-2,5.3100000000000001E-2,6.7299999999999999E-2,6.7299999999999999E-2,6.7299999999999999E-2,5.3100000000000001E-2,5.3100000000000001E-2,6.7299999999999999E-2,6.7299999999999999E-2,6.7299999999999999E-2,6.7299999999999999E-2]
[null,9,5.6399999999999999E-2,5.7099999999999998E-2,5.7099999999999998E-2,5.16E-2,5.16E-2,6.0400000000000002E-2,6.0400000000000002E-2,6.0400000000000002E-2,5.16E-2,5.16E-2,6.0400000000000002E-2,6.0400000000000002E-2,6.0400000000000002E-2,6.0400000000000002E-2]
[null,10,5.04E-2,5.21E-2,5.21E-2,5.0599999999999999E-2,5.0599999999999999E-2,5.1299999999999998E-2,5.1299999999999998E-2,5.1299999999999998E-2,5.0599999999999999E-2,5.0599999999999999E-2,5.1299999999999998E-2,5.1299999999999998E-2,5.1299999999999998E-2,5.1299999999999998E-2]
[null,11,5.0799999999999998E-2,5.2900000000000003E-2,5.2900000000000003E-2,5.2299999999999999E-2,5.2299999999999999E-2,4.9000000000000002E-2,4.9000000000000002E-2,4.9000000000000002E-2,5.2299999999999999E-2,5.2299999999999999E-2,4.9000000000000002E-2,4.9000000000000002E-2,4.9000000000000002E-2,4.9000000000000002E-2]
[null,12,5.3199999999999997E-2,5.5E-2,5.5E-2,5.3900000000000003E-2,5.3900000000000003E-2,5.04E-2,5.04E-2,5.04E-2,5.3900000000000003E-2,5.3900000000000003E-2,5.04E-2,5.04E-2,5.04E-2,5.04E-2]
[null,13,5.5800000000000002E-2,5.7200000000000001E-2,5.7200000000000001E-2,5.5500000000000001E-2,5.5500000000000001E-2,5.2299999999999999E-2,5.2299999999999999E-2,5.2299999999999999E-2,5.5500000000000001E-2,5.5500000000000001E-2,5.2299999999999999E-2,5.2299999999999999E-2,5.2299999999999999E-2,5.2299999999999999E-2]
[null,14,5.7000000000000002E-2,5.8999999999999997E-2,5.8999999999999997E-2,5.7599999999999998E-2,5.7599999999999998E-2,5.3900000000000003E-2,5.3900000000000003E-2,5.3900000000000003E-2,5.7599999999999998E-2,5.7599999999999998E-2,5.3900000000000003E-2,5.3900000000000003E-2,5.3900000000000003E-2,5.3900000000000003E-2]
[null,15,6.3899999999999998E-2,6.4899999999999999E-2,6.4899999999999999E-2,6.2100000000000002E-2,6.2100000000000002E-2,5.9900000000000002E-2,5.9900000000000002E-2,5.9900000000000002E-2,6.2100000000000002E-2,6.2100000000000002E-2,5.9900000000000002E-2,5.9900000000000002E-2,5.9900000000000002E-2,5.9900000000000002E-2]
[null,16,7.5999999999999998E-2,7.5600000000000001E-2,7.5600000000000001E-2,6.8400000000000002E-2,6.8400000000000002E-2,6.9699999999999998E-2,6.9699999999999998E-2,6.9699999999999998E-2,6.8400000000000002E-2,6.8400000000000002E-2,6.9699999999999998E-2,6.9699999999999998E-2,6.9699999999999998E-2,6.9699999999999998E-2]
[null,17,0.1,0.1,0.1,0.1,0.1,0.1,0.1,0.1,0.1,0.1,0.1,0.1,0.1,0.1]
[null,18,7.8100000000000003E-2,7.4099999999999999E-2,7.4099999999999999E-2,6.7199999999999996E-2,6.7199999999999996E-2,7.2800000000000004E-2,7.2800000000000004E-2,7.2800000000000004E-2,6.7199999999999996E-2,6.7199999999999996E-2,7.2800000000000004E-2,7.2800000000000004E-2,7.2800000000000004E-2,7.2800000000000004E-2]
[null,19,5.74E-2,5.3900000000000003E-2,5.3900000000000003E-2,5.2200000000000003E-2,5.2200000000000003E-2,5.5899999999999998E-2,5.5899999999999998E-2,5.5899999999999998E-2,5.2200000000000003E-2,5.2200000000000003E-2,5.5899999999999998E-2,5.5899999999999998E-2,5.5899999999999998E-2,5.5899999999999998E-2]
[null,20,4.2999999999999997E-2,4.0500000000000001E-2,4.0500000000000001E-2,4.1799999999999997E-2,4.1799999999999997E-2,4.2000000000000003E-2,4.2000000000000003E-2,4.2000000000000003E-2,4.1799999999999997E-2,4.1799999999999997E-2,4.2000000000000003E-2,4.2000000000000003E-2,4.2000000000000003E-2,4.2000000000000003E-2]
[null,21,3.5299999999999998E-2,3.32E-2,3.32E-2,3.5700000000000003E-2,3.5700000000000003E-2,3.4200000000000001E-2,3.4200000000000001E-2,3.4200000000000001E-2,3.5700000000000003E-2,3.5700000000000003E-2,3.4200000000000001E-2,3.4200000000000001E-2,3.4200000000000001E-2,3.4200000000000001E-2]
[null,22,2.6700000000000002E-2,2.63E-2,2.63E-2,3.0499999999999999E-2,3.0499999999999999E-2,2.8799999999999999E-2,2.8799999999999999E-2,2.8799999999999999E-2,3.0499999999999999E-2,3.0499999999999999E-2,2.8799999999999999E-2,2.8799999999999999E-2,2.8799999999999999E-2,2.8799999999999999E-2]
[null,23,1.7999999999999999E-2,1.7999999999999999E-2,1.7999999999999999E-2,2.46E-2,2.46E-2,2.1899999999999999E-2,2.1899999999999999E-2,2.1899999999999999E-2,2.46E-2,2.46E-2,2.1899999999999999E-2,2.1899999999999999E-2,2.1899999999999999E-2,2.1899999999999999E-2]
[null,24,1.15E-2,1.21E-2,1.21E-2,1.9E-2,1.9E-2,1.54E-2,1.54E-2,1.54E-2,1.9E-2,1.9E-2,1.54E-2,1.54E-2,1.54E-2,1.54E-2]
[null,null,{"$f":"SUM(C172:C195)","v":0.99999999999999989},1,1,0.99999999999999989,0.99999999999999989,1,1,1,0.99999999999999989,0.99999999999999989,1,1,1,1]
[]
[null,"Type/hr(11%)",1,2,3,4,5,6,7,8,9,10,11,12,13,14]
[null,1,5.4999999999999997E-3,6.0000000000000001E-3,6.0000000000000001E-3,1.3100000000000001E-2,1.3100000000000001E-2,8.8000000000000005E-3,8.8000000000000005E-3,8.8000000000000005E-3,1.3100000000000001E-2,1.3100000000000001E-2,8.8000000000000005E-3,8.8000000000000005E-3,8.8000000000000005E-3,8.8000000000000005E-3]
[null,2,3.0999999999999999E-3,3.7000000000000002E-3,3.7000000000000002E-3,1.04E-2,1.04E-2,5.8999999999999999E-3,5.8999999999999999E-3,5.8999999999999999E-3,1.04E-2,1.04E-2,5.8999999999999999E-3,5.8999999999999999E-3,5.8999999999999999E-3,5.8999999999999999E-3]
[null,3,2.8E-3,3.3999999999999998E-3,3.3999999999999998E-3,9.5999999999999992E-3,9.5999999999999992E-3,5.3E-3,5.3E-3,5.3E-3,9.5999999999999992E-3,9.5999999999999992E-3,5.3E-3,5.3E-3,5.3E-3,5.3E-3]
[null,4,3.8999999999999998E-3,4.4999999999999997E-3,4.4999999999999997E-3,1.0500000000000001E-2,1.0500000000000001E-2,6.4000000000000003E-3,6.4000000000000003E-3,6.4000000000000003E-3,1.0500000000000001E-2,1.0500000000000001E-2,6.4000000000000003E-3,6.4000000000000003E-3,6.4000000000000003E-3,6.4000000000000003E-3]
[null,5,9.1000000000000004E-3,9.9000000000000008E-3,9.9000000000000008E-3,1.3899999999999999E-2,1.3899999999999999E-2,1.0699999999999999E-2,1.0699999999999999E-2,1.0699999999999999E-2,1.3899999999999999E-2,1.3899999999999999E-2,1.0699999999999999E-2,1.0699999999999999E-2,1.0699999999999999E-2,1.0699999999999999E-2]
[null,6,2.5399999999999999E-2,2.58E-2,2.58E-2,2.35E-2,2.35E-2,2.4299999999999999E-2,2.4299999999999999E-2,2.4299999999999999E-2,2.35E-2,2.35E-2,2.4299999999999999E-2,2.4299999999999999E-2,2.4299999999999999E-2,2.4299999999999999E-2]
[null,7,4.9500000000000002E-2,4.8599999999999997E-2,4.8599999999999997E-2,4.0099999999999997E-2,4.0099999999999997E-2,4.99E-2,4.99E-2,4.99E-2,4.0099999999999997E-2,4.0099999999999997E-2,4.99E-2,4.99E-2,4.99E-2,4.99E-2]
[null,8,6.4000000000000001E-2,6.3E-2,6.3E-2,5.2699999999999997E-2,5.2699999999999997E-2,6.6799999999999998E-2,6.6799999999999998E-2,6.6799999999999998E-2,5.2699999999999997E-2,5.2699999999999997E-2,6.6799999999999998E-2,6.6799999999999998E-2,6.6799999999999998E-2,6.6799999999999998E-2]
[null,9,5.6000000000000001E-2,5.67E-2,5.67E-2,5.1200000000000002E-2,5.1200000000000002E-2,5.9900000000000002E-2,5.9900000000000002E-2,5.9900000000000002E-2,5.1200000000000002E-2,5.1200000000000002E-2,5.9900000000000002E-2,5.9900000000000002E-2,5.9900000000000002E-2,5.9900000000000002E-2]
[null,10,0.05,5.1700000000000003E-2,5.1700000000000003E-2,5.0200000000000002E-2,5.0200000000000002E-2,5.0799999999999998E-2,5.0799999999999998E-2,5.0799999999999998E-2,5.0200000000000002E-2,5.0200000000000002E-2,5.0799999999999998E-2,5.0799999999999998E-2,5.0799999999999998E-2,5.0799999999999998E-2]
[null,11,5.04E-2,5.2499999999999998E-2,5.2499999999999998E-2,5.1900000000000002E-2,5.1900000000000002E-2,4.8500000000000001E-2,4.8500000000000001E-2,4.8500000000000001E-2,5.1900000000000002E-2,5.1900000000000002E-2,4.8500000000000001E-2,4.8500000000000001E-2,4.8500000000000001E-2,4.8500000000000001E-2]
[null,12,5.28E-2,5.4600000000000003E-2,5.4600000000000003E-2,5.3499999999999999E-2,5.3499999999999999E-2,4.99E-2,4.99E-2,4.99E-2,5.3499999999999999E-2,5.3499999999999999E-2,4.99E-2,4.99E-2,4.99E-2,4.99E-2]
[null,13,5.5399999999999998E-2,5.6800000000000003E-2,5.6800000000000003E-2,5.5100000000000003E-2,5.5100000000000003E-2,5.1799999999999999E-2,5.1799999999999999E-2,5.1799999999999999E-2,5.5100000000000003E-2,5.5100000000000003E-2,5.1799999999999999E-2,5.1799999999999999E-2,5.1799999999999999E-2,5.1799999999999999E-2]
[null,14,5.6599999999999998E-2,5.8599999999999999E-2,5.8599999999999999E-2,5.7200000000000001E-2,5.7200000000000001E-2,5.3400000000000003E-2,5.3400000000000003E-2,5.3400000000000003E-2,5.7200000000000001E-2,5.7200000000000001E-2,5.3400000000000003E-2,5.3400000000000003E-2,5.3400000000000003E-2,5.3400000000000003E-2]
[null,15,6.3500000000000001E-2,6.4500000000000002E-2,6.4500000000000002E-2,6.1699999999999998E-2,6.1699999999999998E-2,5.9400000000000001E-2,5.9400000000000001E-2,5.9400000000000001E-2,6.1699999999999998E-2,6.1699999999999998E-2,5.9400000000000001E-2,5.9400000000000001E-2,5.9400000000000001E-2,5.9400000000000001E-2]
[null,16,7.5600000000000001E-2,7.4399999999999994E-2,7.4399999999999994E-2,6.7199999999999996E-2,6.7199999999999996E-2,6.9199999999999998E-2,6.9199999999999998E-2,6.9199999999999998E-2,6.7199999999999996E-2,6.7199999999999996E-2,6.9199999999999998E-2,6.9199999999999998E-2,6.9199999999999998E-2,6.9199999999999998E-2]
[null,17,0.11,0.11,0.11,0.11,0.11,0.11,0.11,0.11,0.11,0.11,0.11,0.11,0.11,0.11]
[null,18,7.6899999999999996E-2,7.3700000000000002E-2,7.3700000000000002E-2,6.6799999999999998E-2,6.6799999999999998E-2,7.3800000000000004E-2,7.3800000000000004E-2,7.3800000000000004E-2,6.6799999999999998E-2,6.6799999999999998E-2,7.3800000000000004E-2,7.3800000000000004E-2,7.3800000000000004E-2,7.3800000000000004E-2]
[null,19,5.7000000000000002E-2,5.3499999999999999E-2,5.3499999999999999E-2,5.1799999999999999E-2,5.1799999999999999E-2,5.5399999999999998E-2,5.5399999999999998E-2,5.5399999999999998E-2,5.1799999999999999E-2,5.1799999999999999E-2,5.5399999999999998E-2,5.5399999999999998E-2,5.5399999999999998E-2,5.5399999999999998E-2]
[null,20,4.2599999999999999E-2,4.0099999999999997E-2,4.0099999999999997E-2,4.1399999999999999E-2,4.1399999999999999E-2,4.1500000000000002E-2,4.1500000000000002E-2,4.1500000000000002E-2,4.1399999999999999E-2,4.1399999999999999E-2,4.1500000000000002E-2,4.1500000000000002E-2,4.1500000000000002E-2,4.1500000000000002E-2]
[null,21,3.49E-2,3.2800000000000003E-2,3.2800000000000003E-2,3.5299999999999998E-2,3.5299999999999998E-2,3.3700000000000001E-2,3.3700000000000001E-2,3.3700000000000001E-2,3.5299999999999998E-2,3.5299999999999998E-2,3.3700000000000001E-2,3.3700000000000001E-2,3.3700000000000001E-2,3.3700000000000001E-2]
[null,22,2.63E-2,2.5899999999999999E-2,2.5899999999999999E-2,3.0099999999999998E-2,3.0099999999999998E-2,2.8299999999999999E-2,2.8299999999999999E-2,2.8299999999999999E-2,3.0099999999999998E-2,3.0099999999999998E-2,2.8299999999999999E-2,2.8299999999999999E-2,2.8299999999999999E-2,2.8299999999999999E-2]
[null,23,1.7600000000000001E-2,1.7600000000000001E-2,1.7600000000000001E-2,2.4199999999999999E-2,2.4199999999999999E-2,2.1399999999999999E-2,2.1399999999999999E-2,2.1399999999999999E-2,2.4199999999999999E-2,2.4199999999999999E-2,2.1399999999999999E-2,2.1399999999999999E-2,2.1399999999999999E-2,2.1399999999999999E-2]
[null,24,1.11E-2,1.17E-2,1.17E-2,1.8599999999999998E-2,1.8599999999999998E-2,1.49E-2,1.49E-2,1.49E-2,1.8599999999999998E-2,1.8599999999999998E-2,1.49E-2,1.49E-2,1.49E-2,1.49E-2]
[null,null,{"$f":"SUM(C199:C222)","v":1},1,1,0.99999999999999989,0.99999999999999989,0.99999999999999989,0.99999999999999989,0.99999999999999989,0.99999999999999989,0.99999999999999989,0.99999999999999989,0.99999999999999989,0.99999999999999989,0.99999999999999989]
[]
[null,"Type/hr(12%)",1,2,3,4,5,6,7,8,9,10,11,12,13,14]
[null,1,5.0000000000000001E-3,5.5999999999999999E-3,5.5999999999999999E-3,1.26E-2,1.26E-2,8.3999999999999995E-3,8.3999999999999995E-3,8.3999999999999995E-3,1.26E-2,1.26E-2,8.3999999999999995E-3,8.3999999999999995E-3,8.3999999999999995E-3,8.3999999999999995E-3]
[null,2,2.5999999999999999E-3,3.3E-3,3.3E-3,9.9000000000000008E-3,9.9000000000000008E-3,5.4999999999999997E-3,5.4999999999999997E-3,5.4999999999999997E-3,9.9000000000000008E-3,9.9000000000000008E-3,5.4999999999999997E-3,5.4999999999999997E-3,5.4999999999999997E-3,5.4999999999999997E-3]
[null,3,2.3E-3,3.0000000000000001E-3,3.0000000000000001E-3,9.1000000000000004E-3,9.1000000000000004E-3,4.8999999999999998E-3,4.8999999999999998E-3,4.8999999999999998E-3,9.1000000000000004E-3,9.1000000000000004E-3,4.8999999999999998E-3,4.8999999999999998E-3,4.8999999999999998E-3,4.8999999999999998E-3]
[null,4,3.3999999999999998E-3,4.1000000000000003E-3,4.1000000000000003E-3,0.01,0.01,6.0000000000000001E-3,6.0000000000000001E-3,6.0000000000000001E-3,0.01,0.01,6.0000000000000001E-3,6.0000000000000001E-3,6.0000000000000001E-3,6.0000000000000001E-3]
[null,5,8.6E-3,9.4999999999999998E-3,9.4999999999999998E-3,1.34E-2,1.34E-2,1.03E-2,1.03E-2,1.03E-2,1.34E-2,1.34E-2,1.03E-2,1.03E-2,1.03E-2,1.03E-2]
[null,6,2.4899999999999999E-2,2.5399999999999999E-2,2.5399999999999999E-2,2.3E-2,2.3E-2,2.3900000000000001E-2,2.3900000000000001E-2,2.3900000000000001E-2,2.3E-2,2.3E-2,2.3900000000000001E-2,2.3900000000000001E-2,2.3900000000000001E-2,2.3900000000000001E-2]
[null,7,4.9000000000000002E-2,4.82E-2,4.82E-2,3.9600000000000003E-2,3.9600000000000003E-2,4.9500000000000002E-2,4.9500000000000002E-2,4.9500000000000002E-2,3.9600000000000003E-2,3.9600000000000003E-2,4.9500000000000002E-2,4.9500000000000002E-2,4.9500000000000002E-2,4.9500000000000002E-2]
[null,8,6.3500000000000001E-2,6.2600000000000003E-2,6.2600000000000003E-2,5.2200000000000003E-2,5.2200000000000003E-2,6.6400000000000001E-2,6.6400000000000001E-2,6.6400000000000001E-2,5.2200000000000003E-2,5.2200000000000003E-2,6.6400000000000001E-2,6.6400000000000001E-2,6.6400000000000001E-2,6.6400000000000001E-2]
[null,9,5.5500000000000001E-2,5.6300000000000003E-2,5.6300000000000003E-2,5.0700000000000002E-2,5.0700000000000002E-2,5.9499999999999997E-2,5.9499999999999997E-2,5.9499999999999997E-2,5.0700000000000002E-2,5.0700000000000002E-2,5.9499999999999997E-2,5.9499999999999997E-2,5.9499999999999997E-2,5.9499999999999997E-2]
[null,10,4.9500000000000002E-2,5.1299999999999998E-2,5.1299999999999998E-2,4.9700000000000001E-2,4.9700000000000001E-2,5.04E-2,5.04E-2,5.04E-2,4.9700000000000001E-2,4.9700000000000001E-2,5.04E-2,5.04E-2,5.04E-2,5.04E-2]
[null,11,4.99E-2,5.21E-2,5.21E-2,5.1400000000000001E-2,5.1400000000000001E-2,4.8099999999999997E-2,4.8099999999999997E-2,4.8099999999999997E-2,5.1400000000000001E-2,5.1400000000000001E-2,4.8099999999999997E-2,4.8099999999999997E-2,4.8099999999999997E-2,4.8099999999999997E-2]
[null,12,5.2299999999999999E-2,5.4199999999999998E-2,5.4199999999999998E-2,5.2999999999999999E-2,5.2999999999999999E-2,4.9500000000000002E-2,4.9500000000000002E-2,4.9500000000000002E-2,5.2999999999999999E-2,5.2999999999999999E-2,4.9500000000000002E-2,4.9500000000000002E-2,4.9500000000000002E-2,4.9500000000000002E-2]
[null,13,5.4899999999999997E-2,5.6399999999999999E-2,5.6399999999999999E-2,5.4600000000000003E-2,5.4600000000000003E-2,5.1400000000000001E-2,5.1400000000000001E-2,5.1400000000000001E-2,5.4600000000000003E-2,5.4600000000000003E-2,5.1400000000000001E-2,5.1400000000000001E-2,5.1400000000000001E-2,5.1400000000000001E-2]
[null,14,5.6099999999999997E-2,5.8200000000000002E-2,5.8200000000000002E-2,5.67E-2,5.67E-2,5.2999999999999999E-2,5.2999999999999999E-2,5.2999999999999999E-2,5.67E-2,5.67E-2,5.2999999999999999E-2,5.2999999999999999E-2,5.2999999999999999E-2,5.2999999999999999E-2]
[null,15,6.3E-2,6.4100000000000004E-2,6.4100000000000004E-2,6.1199999999999997E-2,6.1199999999999997E-2,5.8999999999999997E-2,5.8999999999999997E-2,5.8999999999999997E-2,6.1199999999999997E-2,6.1199999999999997E-2,5.8999999999999997E-2,5.8999999999999997E-2,5.8999999999999997E-2,5.8999999999999997E-2]
[null,16,7.51E-2,7.3200000000000001E-2,7.3200000000000001E-2,6.8199999999999997E-2,6.8199999999999997E-2,6.88E-2,6.88E-2,6.88E-2,6.8199999999999997E-2,6.8199999999999997E-2,6.88E-2,6.88E-2,6.88E-2,6.88E-2]
[null,17,0.12,0.12,0.12,0.12,0.12,0.12,0.12,0.12,0.12,0.12,0.12,0.12,0.12,0.12]
[null,18,7.7899999999999997E-2,7.3300000000000004E-2,7.3300000000000004E-2,6.6299999999999998E-2,6.6299999999999998E-2,7.2599999999999998E-2,7.2599999999999998E-2,7.2599999999999998E-2,6.6299999999999998E-2,6.6299999999999998E-2,7.2599999999999998E-2,7.2599999999999998E-2,7.2599999999999998E-2,7.2599999999999998E-2]
[null,19,5.6500000000000002E-2,5.3100000000000001E-2,5.3100000000000001E-2,5.1299999999999998E-2,5.1299999999999998E-2,5.5E-2,5.5E-2,5.5E-2,5.1299999999999998E-2,5.1299999999999998E-2,5.5E-2,5.5E-2,5.5E-2,5.5E-2]
[null,20,4.2099999999999999E-2,3.9699999999999999E-2,3.9699999999999999E-2,4.0899999999999999E-2,4.0899999999999999E-2,4.1099999999999998E-2,4.1099999999999998E-2,4.1099999999999998E-2,4.0899999999999999E-2,4.0899999999999999E-2,4.1099999999999998E-2,4.1099999999999998E-2,4.1099999999999998E-2,4.1099999999999998E-2]
[null,21,3.44E-2,3.2399999999999998E-2,3.2399999999999998E-2,3.4799999999999998E-2,3.4799999999999998E-2,3.3300000000000003E-2,3.3300000000000003E-2,3.3300000000000003E-2,3.4799999999999998E-2,3.4799999999999998E-2,3.3300000000000003E-2,3.3300000000000003E-2,3.3300000000000003E-2,3.3300000000000003E-2]
[null,22,2.58E-2,2.5499999999999998E-2,2.5499999999999998E-2,2.9600000000000001E-2,2.9600000000000001E-2,2.7900000000000001E-2,2.7900000000000001E-2,2.7900000000000001E-2,2.9600000000000001E-2,2.9600000000000001E-2,2.7900000000000001E-2,2.7900000000000001E-2,2.7900000000000001E-2,2.7900000000000001E-2]
[null,23,1.7100000000000001E-2,1.72E-2,1.72E-2,2.3699999999999999E-2,2.3699999999999999E-2,2.1000000000000001E-2,2.1000000000000001E-2,2.1000000000000001E-2,2.3699999999999999E-2,2.3699999999999999E-2,2.1000000000000001E-2,2.1000000000000001E-2,2.1000000000000001E-2,2.1000000000000001E-2]
[null,24,1.06E-2,1.1299999999999999E-2,1.1299999999999999E-2,1.8100000000000002E-2,1.8100000000000002E-2,1.4500000000000001E-2,1.4500000000000001E-2,1.4500000000000001E-2,1.8100000000000002E-2,1.8100000000000002E-2,1.4500000000000001E-2,1.4500000000000001E-2,1.4500000000000001E-2,1.4500000000000001E-2]
[null,null,{"$f":"SUM(C226:C249)","v":1},1.0000000000000002,1.0000000000000002,1,1,1,1,1,1,1,1,1,1,1]

{"sheet":"Crash","index":6,"n_rows":53,"n_cols":26,"rows_kept":53,"cut":false,"hidden":false,"merged":[[48,4,48,5],[1,16,1,20],[1,21,1,25],[9,1,9,2],[24,1,24,2],[16,1,16,3],[1,1,1,4],[1,11,1,15],[28,7,28,8],[31,2,31,6],[31,7,31,11],[31,12,31,16],[31,17,31,21]]}
[null,null,null,null,null,null,null,"Dir AADT",{"$f":"UserInput!C10","v":50000},null,"Crash/yr/25'/dir",{"$f":"C53","v":4.3893244862902372E-2}]
[null,"Crash Probability per 25'",null,null,null,null,null,null,null,null,null,"Crash/yr/hr/ln per 25'",null,null,null,null,"Flow Rate (veh/hr/ln)",null,null,null,null,"Number of Vehicles at Risk per yr/hr/ln"]
[null,null,"Final","Prob","Exists?",null,null,"Hr of Day","k","Hourly Volume","Crash/yr/hr/dir","Lane 1","Lane 2","Lane 3","Lane 4","Lane 5","Lane 1","Lane 2","Lane 3","Lane 4","Lane 5","Lane 1","Lane 2","Lane 3","Lane 4","Lane 5"]
[null,"Lane 1 (closest to obstruction)",{"$f":"IF(E4=1,D4,0)","v":0.2},0.2,{"$f":"IF(Input!$C$40>=1,1,0)","v":1},null,null,0,{"$f":"IF($J$29=\"No\",IF(UserInput!$C$38=0.08,UserInput!F41,IF(UserInput!$C$38=0.09,UserInput!H41,IF(UserInput!$C$38=0.1,UserInput!J41,IF(UserInput!$C$38=0.11,UserInput!L41,UserInput!N41)))),IF(UserInput!$C$38=0.08,UserInput!G41,IF(UserInput!$C$38=0.09,UserInput!I41,IF(UserInput!$C$38=0.1,UserInput!K41,IF(UserInput!$C$38=0.11,UserInput!M41,UserInput!O41)))))","v":1.0200000000000001E-2},{"$f":"$I$1*I4","v":510.00000000000006},{"$f":"$L$1*I4","v":4.4771109760160426E-4},{"$f":"IF(Input!$C$40>0,$K4*Input!$C$43,0)","v":1.1192777440040106E-4},{"$f":"IF(Input!$C$40>1,$K4*Input!$C$44,0)","v":1.1192777440040106E-4},{"$f":"IF(Input!$C$40>2,$K4*Input!$C$45,0)","v":1.1192777440040106E-4},{"$f":"IF(Input!$C$40>3,$K4*Input!$C$46,0)","v":1.1192777440040106E-4},{"$f":"IF(Input!$C$40>4,$K4*Input!$C$47,0)","v":0},{"$f":"$J4*Input!$C$43","v":127.50000000000001},{"$f":"$J4*Input!$C$44","v":127.50000000000001},{"$f":"$J4*Input!$C$45","v":127.50000000000001},{"$f":"$J4*Input!$C$46","v":127.50000000000001},{"$f":"$J4*Input!$C$47","v":0},{"$f":"L4*Q4*(0.5*(1+$D$19)*MIN($D$19,Q4)+$D$19*MAX(0,(Q4-$D$19)))/Q4","v":0.74140957762825677},{"$f":"IF(R4=0,0,M4*R4*(0.5*(1+$D$20)*MIN($D$20,R4)+$D$20*MAX(0,(R4-$D$20)))/R4)","v":0.65813531347435827},{"$f":"IF(S4=0,0,N4*S4*(0.5*(1+$D$21)*MIN($D$21,S4)+$D$21*MAX(0,(S4-$D$21)))/S4)","v":0.5220311398034706},{"$f":"IF(T4=0,0,O4*T4*(0.5*(1+$D$22)*MIN($D$22,T4)+$D$22*MAX(0,(T4-$D$22)))/T4)","v":0},{"$f":"IF(U4=0,0,P4*U4*(0.5*(1+$D$23)*MIN($D$23,U4)+$D$23*MAX(0,(U4-$D$23)))/U4)","v":0}]
[null,"Lane 2",{"$f":"IF(E5=1,D5,0)","v":0.2},0.2,{"$f":"IF(Input!$C$40>=2,1,0)","v":1},null,null,1,{"$f":"IF($J$29=\"No\",IF(UserInput!$C$38=0.08,UserInput!F42,IF(UserInput!$C$38=0.09,UserInput!H42,IF(UserInput!$C$38=0.1,UserInput!J42,IF(UserInput!$C$38=0.11,UserInput!L42,UserInput!N42)))),IF(UserInput!$C$38=0.08,UserInput!G42,IF(UserInput!$C$38=0.09,UserInput!I42,IF(UserInput!$C$38=0.1,UserInput!K42,IF(UserInput!$C$38=0.11,UserInput!M42,UserInput!O42)))))","v":7.3000000000000001E-3},{"$f":"$I$1*I5","v":365},{"$f":"$L$1*I5","v":3.2042068749918733E-4},{"$f":"IF(Input!$C$40>0,$K5*Input!$C$43,0)","v":8.0105171874796831E-5},{"$f":"IF(Input!$C$40>1,$K5*Input!$C$44,0)","v":8.0105171874796831E-5},{"$f":"IF(Input!$C$40>2,$K5*Input!$C$45,0)","v":8.0105171874796831E-5},{"$f":"IF(Input!$C$40>3,$K5*Input!$C$46,0)","v":8.0105171874796831E-5},{"$f":"IF(Input!$C$40>4,$K5*Input!$C$47,0)","v":0},{"$f":"$J5*Input!$C$43","v":91.25},{"$f":"$J5*Input!$C$44","v":91.25},{"$f":"$J5*Input!$C$45","v":91.25},{"$f":"$J5*Input!$C$46","v":91.25},{"$f":"$J5*Input!$C$47","v":0},{"$f":"L5*Q5*(0.5*(1+$D$19)*MIN($D$19,Q5)+$D$19*MAX(0,(Q5-$D$19)))/Q5","v":0.3215421599054345},{"$f":"IF(R5=0,0,M5*R5*(0.5*(1+$D$20)*MIN($D$20,R5)+$D$20*MAX(0,(R5-$D$20)))/R5)","v":0.29678966179612226},{"$f":"IF(S5=0,0,N5*S5*(0.5*(1+$D$21)*MIN($D$21,S5)+$D$21*MAX(0,(S5-$D$21)))/S5)","v":0.24584277248375147},{"$f":"IF(T5=0,0,O5*T5*(0.5*(1+$D$22)*MIN($D$22,T5)+$D$22*MAX(0,(T5-$D$22)))/T5)","v":0},{"$f":"IF(U5=0,0,P5*U5*(0.5*(1+$D$23)*MIN($D$23,U5)+$D$23*MAX(0,(U5-$D$23)))/U5)","v":0}]
[null,"Lane 3",0.2,0.2,{"$f":"IF(Input!$C$40>=3,1,0)","v":1},null,null,2,{"$f":"IF($J$29=\"No\",IF(UserInput!$C$38=0.08,UserInput!F43,IF(UserInput!$C$38=0.09,UserInput!H43,IF(UserInput!$C$38=0.1,UserInput!J43,IF(UserInput!$C$38=0.11,UserInput!L43,UserInput!N43)))),IF(UserInput!$C$38=0.08,UserInput!G43,IF(UserInput!$C$38=0.09,UserInput!I43,IF(UserInput!$C$38=0.1,UserInput!K43,IF(UserInput!$C$38=0.11,UserInput!M43,UserInput!O43)))))","v":6.7000000000000002E-3},335,2.940847405814459E-4,{"$f":"IF(Input!$C$40>0,$K6*Input!$C$43,0)","v":7.3521185145361475E-5},{"$f":"IF(Input!$C$40>1,$K6*Input!$C$44,0)","v":7.3521185145361475E-5},{"$f":"IF(Input!$C$40>2,$K6*Input!$C$45,0)","v":7.3521185145361475E-5},{"$f":"IF(Input!$C$40>3,$K6*Input!$C$46,0)","v":7.3521185145361475E-5},{"$f":"IF(Input!$C$40>4,$K6*Input!$C$47,0)","v":0},{"$f":"$J6*Input!$C$43","v":83.75},{"$f":"$J6*Input!$C$44","v":83.75},{"$f":"$J6*Input!$C$45","v":83.75},{"$f":"$J6*Input!$C$46","v":83.75},{"$f":"$J6*Input!$C$47","v":0},0.25541259719498577,0.23931145764815162,0.20137452611314507,0,0]
[null,"Lane 4",0.2,0.2,{"$f":"IF(Input!$C$40>=4,1,0)","v":1},null,null,3,{"$f":"IF($J$29=\"No\",IF(UserInput!$C$38=0.08,UserInput!F44,IF(UserInput!$C$38=0.09,UserInput!H44,IF(UserInput!$C$38=0.1,UserInput!J44,IF(UserInput!$C$38=0.11,UserInput!L44,UserInput!N44)))),IF(UserInput!$C$38=0.08,UserInput!G44,IF(UserInput!$C$38=0.09,UserInput!I44,IF(UserInput!$C$38=0.1,UserInput!K44,IF(UserInput!$C$38=0.11,UserInput!M44,UserInput!O44)))))","v":7.7999999999999996E-3},390,3.423673099306385E-4,{"$f":"IF(Input!$C$40>0,$K7*Input!$C$43,0)","v":8.5591827482659624E-5},{"$f":"IF(Input!$C$40>1,$K7*Input!$C$44,0)","v":8.5591827482659624E-5},{"$f":"IF(Input!$C$40>2,$K7*Input!$C$45,0)","v":8.5591827482659624E-5},{"$f":"IF(Input!$C$40>3,$K7*Input!$C$46,0)","v":8.5591827482659624E-5},{"$f":"IF(Input!$C$40>4,$K7*Input!$C$47,0)","v":0},{"$f":"$J7*Input!$C$43","v":97.5},{"$f":"$J7*Input!$C$44","v":97.5},{"$f":"$J7*Input!$C$45","v":97.5},{"$f":"$J7*Input!$C$46","v":97.5},{"$f":"$J7*Input!$C$47","v":0},0.38208191788259255,0.34921465612925123,0.28621907110201372,0,0]
[null,"Lane 5",0,0.2,{"$f":"IF(Input!$C$40>=5,1,0)","v":0},null,null,4,{"$f":"IF($J$29=\"No\",IF(UserInput!$C$38=0.08,UserInput!F45,IF(UserInput!$C$38=0.09,UserInput!H45,IF(UserInput!$C$38=0.1,UserInput!J45,IF(UserInput!$C$38=0.11,UserInput!L45,UserInput!N45)))),IF(UserInput!$C$38=0.08,UserInput!G45,IF(UserInput!$C$38=0.09,UserInput!I45,IF(UserInput!$C$38=0.1,UserInput!K45,IF(UserInput!$C$38=0.11,UserInput!M45,UserInput!O45)))))","v":1.21E-2},605,5.3110826284111874E-4,{"$f":"IF(Input!$C$40>0,$K8*Input!$C$43,0)","v":1.3277706571027969E-4},{"$f":"IF(Input!$C$40>1,$K8*Input!$C$44,0)","v":1.3277706571027969E-4},{"$f":"IF(Input!$C$40>2,$K8*Input!$C$45,0)","v":1.3277706571027969E-4},{"$f":"IF(Input!$C$40>3,$K8*Input!$C$46,0)","v":1.3277706571027969E-4},{"$f":"IF(Input!$C$40>4,$K8*Input!$C$47,0)","v":0},{"$f":"$J8*Input!$C$43","v":151.25},{"$f":"$J8*Input!$C$44","v":151.25},{"$f":"$J8*Input!$C$45","v":151.25},{"$f":"$J8*Input!$C$46","v":151.25},{"$f":"$J8*Input!$C$47","v":0},1.1065640656294708,0.9699364650135931,0.75802426813998669,0,0]
[null,null,null,null,null,null,null,5,{"$f":"IF($J$29=\"No\",IF(UserInput!$C$38=0.08,UserInput!F46,IF(UserInput!$C$38=0.09,UserInput!H46,IF(UserInput!$C$38=0.1,UserInput!J46,IF(UserInput!$C$38=0.11,UserInput!L46,UserInput!N46)))),IF(UserInput!$C$38=0.08,UserInput!G46,IF(UserInput!$C$38=0.09,UserInput!I46,IF(UserInput!$C$38=0.1,UserInput!K46,IF(UserInput!$C$38=0.11,UserInput!M46,UserInput!O46)))))","v":2.5700000000000001E-2},1285,1.128056392976591E-3,{"$f":"IF(Input!$C$40>0,$K9*Input!$C$43,0)","v":2.8201409824414776E-4},{"$f":"IF(Input!$C$40>1,$K9*Input!$C$44,0)","v":2.8201409824414776E-4},{"$f":"IF(Input!$C$40>2,$K9*Input!$C$45,0)","v":2.8201409824414776E-4},{"$f":"IF(Input!$C$40>3,$K9*Input!$C$46,0)","v":2.8201409824414776E-4},{"$f":"IF(Input!$C$40>4,$K9*Input!$C$47,0)","v":0},{"$f":"$J9*Input!$C$43","v":321.25},{"$f":"$J9*Input!$C$44","v":321.25},{"$f":"$J9*Input!$C$45","v":321.25},{"$f":"$J9*Input!$C$46","v":321.25},{"$f":"$J9*Input!$C$47","v":0},5.8021580572750961,4.9366567897638065,3.7194839417420651,0,0]
[null,"No. of Analysis Segments (X)",null,null,null,null,null,6,{"$f":"IF($J$29=\"No\",IF(UserInput!$C$38=0.08,UserInput!F47,IF(UserInput!$C$38=0.09,UserInput!H47,IF(UserInput!$C$38=0.1,UserInput!J47,IF(UserInput!$C$38=0.11,UserInput!L47,UserInput!N47)))),IF(UserInput!$C$38=0.08,UserInput!G47,IF(UserInput!$C$38=0.09,UserInput!I47,IF(UserInput!$C$38=0.1,UserInput!K47,IF(UserInput!$C$38=0.11,UserInput!M47,UserInput!O47)))))","v":5.1299999999999998E-2},2565,2.2517234614668918E-3,{"$f":"IF(Input!$C$40>0,$K10*Input!$C$43,0)","v":5.6293086536672295E-4},{"$f":"IF(Input!$C$40>1,$K10*Input!$C$44,0)","v":5.6293086536672295E-4},{"$f":"IF(Input!$C$40>2,$K10*Input!$C$45,0)","v":5.6293086536672295E-4},{"$f":"IF(Input!$C$40>3,$K10*Input!$C$46,0)","v":5.6293086536672295E-4},{"$f":"IF(Input!$C$40>4,$K10*Input!$C$47,0)","v":0},{"$f":"$J10*Input!$C$43","v":641.25},{"$f":"$J10*Input!$C$44","v":641.25},{"$f":"$J10*Input!$C$45","v":641.25},{"$f":"$J10*Input!$C$46","v":641.25},{"$f":"$J10*Input!$C$47","v":0},24.551666762104254,20.662377413285565,15.350561767685168,0,0]
[null,"Lane 1 (closest to obstruction)",{"$f":"Input!C43","v":0.25},null,null,null,null,7,{"$f":"IF($J$29=\"No\",IF(UserInput!$C$38=0.08,UserInput!F48,IF(UserInput!$C$38=0.09,UserInput!H48,IF(UserInput!$C$38=0.1,UserInput!J48,IF(UserInput!$C$38=0.11,UserInput!L48,UserInput!N48)))),IF(UserInput!$C$38=0.08,UserInput!G48,IF(UserInput!$C$38=0.09,UserInput!I48,IF(UserInput!$C$38=0.1,UserInput!K48,IF(UserInput!$C$38=0.11,UserInput!M48,UserInput!O48)))))","v":6.8199999999999997E-2},3410,2.9935192996499416E-3,{"$f":"IF(Input!$C$40>0,$K11*Input!$C$43,0)","v":7.483798249124854E-4},{"$f":"IF(Input!$C$40>1,$K11*Input!$C$44,0)","v":7.483798249124854E-4},{"$f":"IF(Input!$C$40>2,$K11*Input!$C$45,0)","v":7.483798249124854E-4},{"$f":"IF(Input!$C$40>3,$K11*Input!$C$46,0)","v":7.483798249124854E-4},{"$f":"IF(Input!$C$40>4,$K11*Input!$C$47,0)","v":0},{"$f":"$J11*Input!$C$43","v":852.5},{"$f":"$J11*Input!$C$44","v":852.5},{"$f":"$J11*Input!$C$45","v":852.5},{"$f":"$J11*Input!$C$46","v":852.5},{"$f":"$J11*Input!$C$47","v":0},44.022694820652042,36.954995754178526,27.363759918100115,0,0]
[null,"Lane 2",{"$f":"Input!C44","v":0.25},null,null,null,null,8,{"$f":"IF($J$29=\"No\",IF(UserInput!$C$38=0.08,UserInput!F49,IF(UserInput!$C$38=0.09,UserInput!H49,IF(UserInput!$C$38=0.1,UserInput!J49,IF(UserInput!$C$38=0.11,UserInput!L49,UserInput!N49)))),IF(UserInput!$C$38=0.08,UserInput!G49,IF(UserInput!$C$38=0.09,UserInput!I49,IF(UserInput!$C$38=0.1,UserInput!K49,IF(UserInput!$C$38=0.11,UserInput!M49,UserInput!O49)))))","v":6.13E-2},3065,2.6906559100959154E-3,{"$f":"IF(Input!$C$40>0,$K12*Input!$C$43,0)","v":6.7266397752397886E-4},{"$f":"IF(Input!$C$40>1,$K12*Input!$C$44,0)","v":6.7266397752397886E-4},{"$f":"IF(Input!$C$40>2,$K12*Input!$C$45,0)","v":6.7266397752397886E-4},{"$f":"IF(Input!$C$40>3,$K12*Input!$C$46,0)","v":6.7266397752397886E-4},{"$f":"IF(Input!$C$40>4,$K12*Input!$C$47,0)","v":0},{"$f":"$J12*Input!$C$43","v":766.25},{"$f":"$J12*Input!$C$44","v":766.25},{"$f":"$J12*Input!$C$45","v":766.25},{"$f":"$J12*Input!$C$46","v":766.25},{"$f":"$J12*Input!$C$47","v":0},35.391542513446623,29.735111126447482,22.042525879483264,0,0]
[null,"Lane 3",{"$f":"Input!C45","v":0.25},null,null,null,null,9,{"$f":"IF($J$29=\"No\",IF(UserInput!$C$38=0.08,UserInput!F50,IF(UserInput!$C$38=0.09,UserInput!H50,IF(UserInput!$C$38=0.1,UserInput!J50,IF(UserInput!$C$38=0.11,UserInput!L50,UserInput!N50)))),IF(UserInput!$C$38=0.08,UserInput!G50,IF(UserInput!$C$38=0.09,UserInput!I50,IF(UserInput!$C$38=0.1,UserInput!K50,IF(UserInput!$C$38=0.11,UserInput!M50,UserInput!O50)))))","v":5.2200000000000003E-2},2610,2.2912273818435041E-3,{"$f":"IF(Input!$C$40>0,$K13*Input!$C$43,0)","v":5.7280684546087604E-4},{"$f":"IF(Input!$C$40>1,$K13*Input!$C$44,0)","v":5.7280684546087604E-4},{"$f":"IF(Input!$C$40>2,$K13*Input!$C$45,0)","v":5.7280684546087604E-4},{"$f":"IF(Input!$C$40>3,$K13*Input!$C$46,0)","v":5.7280684546087604E-4},{"$f":"IF(Input!$C$40>4,$K13*Input!$C$47,0)","v":0},{"$f":"$J13*Input!$C$43","v":652.5},{"$f":"$J13*Input!$C$44","v":652.5},{"$f":"$J13*Input!$C$45","v":652.5},{"$f":"$J13*Input!$C$46","v":652.5},{"$f":"$J13*Input!$C$47","v":0},25.446371302753956,21.411519883327546,15.903409257375761,0,0]
[null,"Lane 4",{"$f":"Input!C46","v":0.25},null,null,null,null,10,{"$f":"IF($J$29=\"No\",IF(UserInput!$C$38=0.08,UserInput!F51,IF(UserInput!$C$38=0.09,UserInput!H51,IF(UserInput!$C$38=0.1,UserInput!J51,IF(UserInput!$C$38=0.11,UserInput!L51,UserInput!N51)))),IF(UserInput!$C$38=0.08,UserInput!G51,IF(UserInput!$C$38=0.09,UserInput!I51,IF(UserInput!$C$38=0.1,UserInput!K51,IF(UserInput!$C$38=0.11,UserInput!M51,UserInput!O51)))))","v":4.99E-2},2495,2.1902729186588283E-3,{"$f":"IF(Input!$C$40>0,$K14*Input!$C$43,0)","v":5.4756822966470708E-4},{"$f":"IF(Input!$C$40>1,$K14*Input!$C$44,0)","v":5.4756822966470708E-4},{"$f":"IF(Input!$C$40>2,$K14*Input!$C$45,0)","v":5.4756822966470708E-4},{"$f":"IF(Input!$C$40>3,$K14*Input!$C$46,0)","v":5.4756822966470708E-4},{"$f":"IF(Input!$C$40>4,$K14*Input!$C$47,0)","v":0},{"$f":"$J14*Input!$C$43","v":623.75},{"$f":"$J14*Input!$C$44","v":623.75},{"$f":"$J14*Input!$C$45","v":623.75},{"$f":"$J14*Input!$C$46","v":623.75},{"$f":"$J14*Input!$C$47","v":0},23.191704799219004,19.523545228695131,14.510010517885073,0,0]
[null,"Lane 5",{"$f":"Input!C47","v":0},null,null,null,null,11,{"$f":"IF($J$29=\"No\",IF(UserInput!$C$38=0.08,UserInput!F52,IF(UserInput!$C$38=0.09,UserInput!H52,IF(UserInput!$C$38=0.1,UserInput!J52,IF(UserInput!$C$38=0.11,UserInput!L52,UserInput!N52)))),IF(UserInput!$C$38=0.08,UserInput!G52,IF(UserInput!$C$38=0.09,UserInput!I52,IF(UserInput!$C$38=0.1,UserInput!K52,IF(UserInput!$C$38=0.11,UserInput!M52,UserInput!O52)))))","v":5.1299999999999998E-2},2565,2.2517234614668918E-3,{"$f":"IF(Input!$C$40>0,$K15*Input!$C$43,0)","v":5.6293086536672295E-4},{"$f":"IF(Input!$C$40>1,$K15*Input!$C$44,0)","v":5.6293086536672295E-4},{"$f":"IF(Input!$C$40>2,$K15*Input!$C$45,0)","v":5.6293086536672295E-4},{"$f":"IF(Input!$C$40>3,$K15*Input!$C$46,0)","v":5.6293086536672295E-4},{"$f":"IF(Input!$C$40>4,$K15*Input!$C$47,0)","v":0},{"$f":"$J15*Input!$C$43","v":641.25},{"$f":"$J15*Input!$C$44","v":641.25},{"$f":"$J15*Input!$C$45","v":641.25},{"$f":"$J15*Input!$C$46","v":641.25},{"$f":"$J15*Input!$C$47","v":0},24.551666762104254,20.662377413285565,15.350561767685168,0,0]
[null,null,null,null,null,null,null,12,{"$f":"IF($J$29=\"No\",IF(UserInput!$C$38=0.08,UserInput!F53,IF(UserInput!$C$38=0.09,UserInput!H53,IF(UserInput!$C$38=0.1,UserInput!J53,IF(UserInput!$C$38=0.11,UserInput!L53,UserInput!N53)))),IF(UserInput!$C$38=0.08,UserInput!G53,IF(UserInput!$C$38=0.09,UserInput!I53,IF(UserInput!$C$38=0.1,UserInput!K53,IF(UserInput!$C$38=0.11,UserInput!M53,UserInput!O53)))))","v":5.3199999999999997E-2},2660,2.3351206267064059E-3,{"$f":"IF(Input!$C$40>0,$K16*Input!$C$43,0)","v":5.8378015667660149E-4},{"$f":"IF(Input!$C$40>1,$K16*Input!$C$44,0)","v":5.8378015667660149E-4},{"$f":"IF(Input!$C$40>2,$K16*Input!$C$45,0)","v":5.8378015667660149E-4},{"$f":"IF(Input!$C$40>3,$K16*Input!$C$46,0)","v":5.8378015667660149E-4},{"$f":"IF(Input!$C$40>4,$K16*Input!$C$47,0)","v":0},{"$f":"$J16*Input!$C$43","v":665},{"$f":"$J16*Input!$C$44","v":665},{"$f":"$J16*Input!$C$45","v":665},{"$f":"$J16*Input!$C$46","v":665},{"$f":"$J16*Input!$C$47","v":0},26.459251821210287,22.259537374078818,16.529151356141295,0,0]
[null,"No. of Segments in Restricted Zone",null,null,null,null,null,13,{"$f":"IF($J$29=\"No\",IF(UserInput!$C$38=0.08,UserInput!F54,IF(UserInput!$C$38=0.09,UserInput!H54,IF(UserInput!$C$38=0.1,UserInput!J54,IF(UserInput!$C$38=0.11,UserInput!L54,UserInput!N54)))),IF(UserInput!$C$38=0.08,UserInput!G54,IF(UserInput!$C$38=0.09,UserInput!I54,IF(UserInput!$C$38=0.1,UserInput!K54,IF(UserInput!$C$38=0.11,UserInput!M54,UserInput!O54)))))","v":5.4800000000000001E-2},2740,2.40534981848705E-3,{"$f":"IF(Input!$C$40>0,$K17*Input!$C$43,0)","v":6.0133745462176251E-4},{"$f":"IF(Input!$C$40>1,$K17*Input!$C$44,0)","v":6.0133745462176251E-4},{"$f":"IF(Input!$C$40>2,$K17*Input!$C$45,0)","v":6.0133745462176251E-4},{"$f":"IF(Input!$C$40>3,$K17*Input!$C$46,0)","v":6.0133745462176251E-4},{"$f":"IF(Input!$C$40>4,$K17*Input!$C$47,0)","v":0},{"$f":"$J17*Input!$C$43","v":685},{"$f":"$J17*Input!$C$44","v":685},{"$f":"$J17*Input!$C$45","v":685},{"$f":"$J17*Input!$C$46","v":685},{"$f":"$J17*Input!$C$47","v":0},28.120944727932102,23.650602090273921,17.555445650227735,0,0]
[null,null,"L","No.",null,null,null,14,{"$f":"IF($J$29=\"No\",IF(UserInput!$C$38=0.08,UserInput!F55,IF(UserInput!$C$38=0.09,UserInput!H55,IF(UserInput!$C$38=0.1,UserInput!J55,IF(UserInput!$C$38=0.11,UserInput!L55,UserInput!N55)))),IF(UserInput!$C$38=0.08,UserInput!G55,IF(UserInput!$C$38=0.09,UserInput!I55,IF(UserInput!$C$38=0.1,UserInput!K55,IF(UserInput!$C$38=0.11,UserInput!M55,UserInput!O55)))))","v":6.08E-2},3040,2.6687092876644643E-3,{"$f":"IF(Input!$C$40>0,$K18*Input!$C$43,0)","v":6.6717732191611608E-4},{"$f":"IF(Input!$C$40>1,$K18*Input!$C$44,0)","v":6.6717732191611608E-4},{"$f":"IF(Input!$C$40>2,$K18*Input!$C$45,0)","v":6.6717732191611608E-4},{"$f":"IF(Input!$C$40>3,$K18*Input!$C$46,0)","v":6.6717732191611608E-4},{"$f":"IF(Input!$C$40>4,$K18*Input!$C$47,0)","v":0},{"$f":"$J18*Input!$C$43","v":760},{"$f":"$J18*Input!$C$44","v":760},{"$f":"$J18*Input!$C$45","v":760},{"$f":"$J18*Input!$C$46","v":760},{"$f":"$J18*Input!$C$47","v":0},34.802637820432274,29.242382019583367,21.679259898342274,0,0]
[null,"Lane 1 (closest to obstruction)",0.34090909090909088,{"$f":"ROUNDUP(C19*5280/25,0)","v":72},null,null,null,15,{"$f":"IF($J$29=\"No\",IF(UserInput!$C$38=0.08,UserInput!F56,IF(UserInput!$C$38=0.09,UserInput!H56,IF(UserInput!$C$38=0.1,UserInput!J56,IF(UserInput!$C$38=0.11,UserInput!L56,UserInput!N56)))),IF(UserInput!$C$38=0.08,UserInput!G56,IF(UserInput!$C$38=0.09,UserInput!I56,IF(UserInput!$C$38=0.1,UserInput!K56,IF(UserInput!$C$38=0.11,UserInput!M56,UserInput!O56)))))","v":7.0599999999999996E-2},3530,3.0988630873209073E-3,{"$f":"IF(Input!$C$40>0,$K19*Input!$C$43,0)","v":7.7471577183022683E-4},{"$f":"IF(Input!$C$40>1,$K19*Input!$C$44,0)","v":7.7471577183022683E-4},{"$f":"IF(Input!$C$40>2,$K19*Input!$C$45,0)","v":7.7471577183022683E-4},{"$f":"IF(Input!$C$40>3,$K19*Input!$C$46,0)","v":7.7471577183022683E-4},{"$f":"IF(Input!$C$40>4,$K19*Input!$C$47,0)","v":0},{"$f":"$J19*Input!$C$43","v":882.5},{"$f":"$J19*Input!$C$44","v":882.5},{"$f":"$J19*Input!$C$45","v":882.5},{"$f":"$J19*Input!$C$46","v":882.5},{"$f":"$J19*Input!$C$47","v":0},47.245266629294555,39.649953202271007,29.349332300016311,0,0]
[null,"Lane 2",0.28409090909090912,{"$f":"ROUNDUP(C20*5280/25,0)","v":60},null,null,null,16,{"$f":"IF($J$29=\"No\",IF(UserInput!$C$38=0.08,UserInput!F57,IF(UserInput!$C$38=0.09,UserInput!H57,IF(UserInput!$C$38=0.1,UserInput!J57,IF(UserInput!$C$38=0.11,UserInput!L57,UserInput!N57)))),IF(UserInput!$C$38=0.08,UserInput!G57,IF(UserInput!$C$38=0.09,UserInput!I57,IF(UserInput!$C$38=0.1,UserInput!K57,IF(UserInput!$C$38=0.11,UserInput!M57,UserInput!O57)))))","v":0.08},4000,3.51145958903219E-3,{"$f":"IF(Input!$C$40>0,$K20*Input!$C$43,0)","v":8.7786489725804749E-4},{"$f":"IF(Input!$C$40>1,$K20*Input!$C$44,0)","v":8.7786489725804749E-4},{"$f":"IF(Input!$C$40>2,$K20*Input!$C$45,0)","v":8.7786489725804749E-4},{"$f":"IF(Input!$C$40>3,$K20*Input!$C$46,0)","v":8.7786489725804749E-4},{"$f":"IF(Input!$C$40>4,$K20*Input!$C$47,0)","v":0},{"$f":"$J20*Input!$C$43","v":1000},{"$f":"$J20*Input!$C$44","v":1000},{"$f":"$J20*Input!$C$45","v":1000},{"$f":"$J20*Input!$C$46","v":1000},{"$f":"$J20*Input!$C$47","v":0},60.962449925187855,51.118072967336104,37.795595286547979,0,0]
[null,"Lane 3",0.20833333333333331,44,null,null,null,17,{"$f":"IF($J$29=\"No\",IF(UserInput!$C$38=0.08,UserInput!F58,IF(UserInput!$C$38=0.09,UserInput!H58,IF(UserInput!$C$38=0.1,UserInput!J58,IF(UserInput!$C$38=0.11,UserInput!L58,UserInput!N58)))),IF(UserInput!$C$38=0.08,UserInput!G58,IF(UserInput!$C$38=0.09,UserInput!I58,IF(UserInput!$C$38=0.1,UserInput!K58,IF(UserInput!$C$38=0.11,UserInput!M58,UserInput!O58)))))","v":7.2999999999999995E-2},3649.9999999999995,3.204206874991873E-3,{"$f":"IF(Input!$C$40>0,$K21*Input!$C$43,0)","v":8.0105171874796826E-4},{"$f":"IF(Input!$C$40>1,$K21*Input!$C$44,0)","v":8.0105171874796826E-4},{"$f":"IF(Input!$C$40>2,$K21*Input!$C$45,0)","v":8.0105171874796826E-4},{"$f":"IF(Input!$C$40>3,$K21*Input!$C$46,0)","v":8.0105171874796826E-4},{"$f":"IF(Input!$C$40>4,$K21*Input!$C$47,0)","v":0},{"$f":"$J21*Input!$C$43","v":912.49999999999989},{"$f":"$J21*Input!$C$44","v":912.49999999999989},{"$f":"$J21*Input!$C$45","v":912.49999999999989},{"$f":"$J21*Input!$C$46","v":912.49999999999989},{"$f":"$J21*Input!$C$47","v":0},50.5816097286217,42.439720059267358,31.404431581795343,0,0]
[null,"Lane 4",0,0,null,null,null,18,{"$f":"IF($J$29=\"No\",IF(UserInput!$C$38=0.08,UserInput!F59,IF(UserInput!$C$38=0.09,UserInput!H59,IF(UserInput!$C$38=0.1,UserInput!J59,IF(UserInput!$C$38=0.11,UserInput!L59,UserInput!N59)))),IF(UserInput!$C$38=0.08,UserInput!G59,IF(UserInput!$C$38=0.09,UserInput!I59,IF(UserInput!$C$38=0.1,UserInput!K59,IF(UserInput!$C$38=0.11,UserInput!M59,UserInput!O59)))))","v":5.6800000000000003E-2},2840,2.4931363082128549E-3,{"$f":"IF(Input!$C$40>0,$K22*Input!$C$43,0)","v":6.2328407705321374E-4},{"$f":"IF(Input!$C$40>1,$K22*Input!$C$44,0)","v":6.2328407705321374E-4},{"$f":"IF(Input!$C$40>2,$K22*Input!$C$45,0)","v":6.2328407705321374E-4},{"$f":"IF(Input!$C$40>3,$K22*Input!$C$46,0)","v":6.2328407705321374E-4},{"$f":"IF(Input!$C$40>4,$K22*Input!$C$47,0)","v":0},{"$f":"$J22*Input!$C$43","v":710},{"$f":"$J22*Input!$C$44","v":710},{"$f":"$J22*Input!$C$45","v":710},{"$f":"$J22*Input!$C$46","v":710},{"$f":"$J22*Input!$C$47","v":0},30.269167918012272,25.448688866082719,18.881767830250059,0,0]
[null,"Lane 5",null,0,null,null,null,19,{"$f":"IF($J$29=\"No\",IF(UserInput!$C$38=0.08,UserInput!F60,IF(UserInput!$C$38=0.09,UserInput!H60,IF(UserInput!$C$38=0.1,UserInput!J60,IF(UserInput!$C$38=0.11,UserInput!L60,UserInput!N60)))),IF(UserInput!$C$38=0.08,UserInput!G60,IF(UserInput!$C$38=0.09,UserInput!I60,IF(UserInput!$C$38=0.1,UserInput!K60,IF(UserInput!$C$38=0.11,UserInput!M60,UserInput!O60)))))","v":4.2900000000000001E-2},2145,1.8830202046185118E-3,{"$f":"IF(Input!$C$40>0,$K23*Input!$C$43,0)","v":4.7075505115462795E-4},{"$f":"IF(Input!$C$40>1,$K23*Input!$C$44,0)","v":4.7075505115462795E-4},{"$f":"IF(Input!$C$40>2,$K23*Input!$C$45,0)","v":4.7075505115462795E-4},{"$f":"IF(Input!$C$40>3,$K23*Input!$C$46,0)","v":4.7075505115462795E-4},{"$f":"IF(Input!$C$40>4,$K23*Input!$C$47,0)","v":0},{"$f":"$J23*Input!$C$43","v":536.25},{"$f":"$J23*Input!$C$44","v":536.25},{"$f":"$J23*Input!$C$45","v":536.25},{"$f":"$J23*Input!$C$46","v":536.25},{"$f":"$J23*Input!$C$47","v":0},16.972602614328956,14.313307330356464,10.662131153601168,0,0]
[null,null,null,null,null,null,null,20,{"$f":"IF($J$29=\"No\",IF(UserInput!$C$38=0.08,UserInput!F61,IF(UserInput!$C$38=0.09,UserInput!H61,IF(UserInput!$C$38=0.1,UserInput!J61,IF(UserInput!$C$38=0.11,UserInput!L61,UserInput!N61)))),IF(UserInput!$C$38=0.08,UserInput!G61,IF(UserInput!$C$38=0.09,UserInput!I61,IF(UserInput!$C$38=0.1,UserInput!K61,IF(UserInput!$C$38=0.11,UserInput!M61,UserInput!O61)))))","v":3.5099999999999999E-2},1755,1.5406528946878733E-3,{"$f":"IF(Input!$C$40>0,$K24*Input!$C$43,0)","v":3.8516322367196832E-4},{"$f":"IF(Input!$C$40>1,$K24*Input!$C$44,0)","v":3.8516322367196832E-4},{"$f":"IF(Input!$C$40>2,$K24*Input!$C$45,0)","v":3.8516322367196832E-4},{"$f":"IF(Input!$C$40>3,$K24*Input!$C$46,0)","v":3.8516322367196832E-4},{"$f":"IF(Input!$C$40>4,$K24*Input!$C$47,0)","v":0},{"$f":"$J24*Input!$C$43","v":438.75},{"$f":"$J24*Input!$C$44","v":438.75},{"$f":"$J24*Input!$C$45","v":438.75},{"$f":"$J24*Input!$C$46","v":438.75},{"$f":"$J24*Input!$C$47","v":0},11.182829036091928,9.457682957265181,7.0712116233936664,0,0]
[null,"No. Vehicles at Risk per Year",null,null,null,null,null,21,{"$f":"IF($J$29=\"No\",IF(UserInput!$C$38=0.08,UserInput!F62,IF(UserInput!$C$38=0.09,UserInput!H62,IF(UserInput!$C$38=0.1,UserInput!J62,IF(UserInput!$C$38=0.11,UserInput!L62,UserInput!N62)))),IF(UserInput!$C$38=0.08,UserInput!G62,IF(UserInput!$C$38=0.09,UserInput!I62,IF(UserInput!$C$38=0.1,UserInput!K62,IF(UserInput!$C$38=0.11,UserInput!M62,UserInput!O62)))))","v":2.9700000000000001E-2},1485,1.3036293724282004E-3,{"$f":"IF(Input!$C$40>0,$K25*Input!$C$43,0)","v":3.259073431070501E-4},{"$f":"IF(Input!$C$40>1,$K25*Input!$C$44,0)","v":3.259073431070501E-4},{"$f":"IF(Input!$C$40>2,$K25*Input!$C$45,0)","v":3.259073431070501E-4},{"$f":"IF(Input!$C$40>3,$K25*Input!$C$46,0)","v":3.259073431070501E-4},{"$f":"IF(Input!$C$40>4,$K25*Input!$C$47,0)","v":0},{"$f":"$J25*Input!$C$43","v":371.25},{"$f":"$J25*Input!$C$44","v":371.25},{"$f":"$J25*Input!$C$45","v":371.25},{"$f":"$J25*Input!$C$46","v":371.25},{"$f":"$J25*Input!$C$47","v":0},7.8784841122698293,6.6827300704100612,5.0153881030743941,0,0]
[null,"Lane 1 (closest to obstruction)",{"$f":"SUM($V$4:$V$27)","v":506.90126997896255},null,null,null,null,22,{"$f":"IF($J$29=\"No\",IF(UserInput!$C$38=0.08,UserInput!F63,IF(UserInput!$C$38=0.09,UserInput!H63,IF(UserInput!$C$38=0.1,UserInput!J63,IF(UserInput!$C$38=0.11,UserInput!L63,UserInput!N63)))),IF(UserInput!$C$38=0.08,UserInput!G63,IF(UserInput!$C$38=0.09,UserInput!I63,IF(UserInput!$C$38=0.1,UserInput!K63,IF(UserInput!$C$38=0.11,UserInput!M63,UserInput!O63)))))","v":2.2800000000000001E-2},1140,1.0007659828741742E-3,{"$f":"IF(Input!$C$40>0,$K26*Input!$C$43,0)","v":2.5019149571854356E-4},{"$f":"IF(Input!$C$40>1,$K26*Input!$C$44,0)","v":2.5019149571854356E-4},{"$f":"IF(Input!$C$40>2,$K26*Input!$C$45,0)","v":2.5019149571854356E-4},{"$f":"IF(Input!$C$40>3,$K26*Input!$C$46,0)","v":2.5019149571854356E-4},{"$f":"IF(Input!$C$40>4,$K26*Input!$C$47,0)","v":0},{"$f":"$J26*Input!$C$43","v":285},{"$f":"$J26*Input!$C$44","v":285},{"$f":"$J26*Input!$C$45","v":285},{"$f":"$J26*Input!$C$46","v":285},{"$f":"$J26*Input!$C$47","v":0},4.4944400290879161,3.8354356293652727,2.900720201360794,0,0]
[null,"Lane 2",{"$f":"SUM($W$4:$W$27)","v":426.36811702013006},null,null,null,null,23,{"$f":"IF($J$29=\"No\",IF(UserInput!$C$38=0.08,UserInput!F64,IF(UserInput!$C$38=0.09,UserInput!H64,IF(UserInput!$C$38=0.1,UserInput!J64,IF(UserInput!$C$38=0.11,UserInput!L64,UserInput!N64)))),IF(UserInput!$C$38=0.08,UserInput!G64,IF(UserInput!$C$38=0.09,UserInput!I64,IF(UserInput!$C$38=0.1,UserInput!K64,IF(UserInput!$C$38=0.11,UserInput!M64,UserInput!O64)))))","v":1.6299999999999999E-2},814.99999999999989,7.1545989126530862E-4,{"$f":"IF(Input!$C$40>0,$K27*Input!$C$43,0)","v":1.7886497281632716E-4},{"$f":"IF(Input!$C$40>1,$K27*Input!$C$44,0)","v":1.7886497281632716E-4},{"$f":"IF(Input!$C$40>2,$K27*Input!$C$45,0)","v":1.7886497281632716E-4},{"$f":"IF(Input!$C$40>3,$K27*Input!$C$46,0)","v":1.7886497281632716E-4},{"$f":"IF(Input!$C$40>4,$K27*Input!$C$47,0)","v":0},{"$f":"$J27*Input!$C$43","v":203.74999999999997},{"$f":"$J27*Input!$C$44","v":203.74999999999997},{"$f":"$J27*Input!$C$45","v":203.74999999999997},{"$f":"$J27*Input!$C$46","v":203.74999999999997},{"$f":"$J27*Input!$C$47","v":0},2.1667702806969871,1.8700332907947002,1.4343182170141273,0,0]
[null,"Lane 3",{"$f":"SUM($X$4:$X$27)","v":316.53255802936411}]
[null,"Lane 4",{"$f":"SUM($Y$4:$Y$27)","v":0},null,null,null,null,"Use custom k?",null,"No"]
[null,"Lane 5",{"$f":"SUM($Z$4:$Z$27)","v":0}]
[]
[null,"Facility","Total crash or MV - FI coefficients",null,null,null,null,"MV - PDO Coefficients",null,null,null,null,"SV - FI Coefficients",null,null,null,null,"SV - PDO Coefficients"]
[null,"Type","x1","a1","b1","c1","d1","x2","a2","b2","c2","d2","x3","a3","b3","c3","d3","x4","a4","b4","c4","d4"]
[1,"Rural two-lane highway",1,-8.2279999999999998,1,1,0,0,1,0,1,0,0,1,0,1,0,0,1,0,1,0]
[2,"Rural four-lane undivided highway",1,-9.6530000000000005,1.1759999999999999,1,0,0,1,0,1,0,0,1,0,1,0,0,1,0,1,0]
[3,"Rural four-lane divided hifghway",1,-9.0250000000000004,1.0489999999999999,1,0,0,1,0,1,0,0,1,0,1,0,0,1,0,1,0]
[4,"Rural freeway (4 lanes)",1,-5.9749999999999996,1.492,1E-3,0,1,-6.88,1.9359999999999999,1E-3,0,1,-2.1259999999999999,0.64600000000000002,1E-3,0,1,-2.2349999999999999,0.876,1E-3,0]
[5,"Rural freeway (6 lanes)",1,6.0919999999999996,1.492,1E-3,0,1,-7.141,1.9359999999999999,1E-3,0,1,-2.0550000000000002,0.64600000000000002,1E-3,0,1,-2.274,0.876,1E-3,0]
[6,"Urban freeway (4 lanes)",1,-5.47,1.492,1E-3,0,1,-6.548,1.9359999999999999,1E-3,0,1,-2.1259999999999999,0.64600000000000002,1E-3,0,1,-2.2349999999999999,0.876,1E-3,0]
[7,"Urban freeway (6 lanes)",1,-5.5869999999999997,1.492,1E-3,0,1,-6.8090000000000002,1.9359999999999999,1E-3,0,1,-2.0550000000000002,0.64600000000000002,1E-3,0,1,-2.274,0.876,1E-3,0]
[8,"Urban freeway (8 lanes)",1,-5.6349999999999998,1.492,1E-3,0,1,-6.9969999999999999,1.9359999999999999,1E-3,0,1,-1.9850000000000001,0.64600000000000002,1E-3,0,1,-2.3119999999999998,0.876,1E-3,0]
[9,"Rural one-lane entrance ramp",1,-5.226,0.52400000000000002,1E-3,6.9900000000000004E-2,1,-3.819,1.256,1E-3,0,1,-2.12,0.71799999999999997,1E-3,0,1,-1.946,0.68899999999999995,1E-3,0]
[10,"Rural one-lane exit ramp",1,-6.6920000000000002,0.52400000000000002,1E-3,6.9900000000000004E-2,1,-4.851,1.256,1E-3,0,1,-1.7989999999999999,0.71799999999999997,1E-3,0,1,-1.7390000000000001,0.68899999999999995,1E-3,0]
[11,"Urban one-lane entrance ramp",1,-3505,0.52400000000000002,1E-3,6.9900000000000004E-2,1,-3.819,1.256,1E-3,0,1,-1.966,0.71799999999999997,1E-3,0,1,-1.7150000000000001,0.68899999999999995,1E-3,0]
[12,"Urban one-lane exit ramp",1,-4.9710000000000001,0.52400000000000002,1E-3,6.9900000000000004E-2,1,-4.851,1.256,1E-3,0,1,-1.645,0.71799999999999997,1E-3,0,1,-1.508,0.68899999999999995,1E-3,0]
[13,"Urban two-lane entrance ramp",1,-3.0230000000000001,0.52400000000000002,1E-3,6.9900000000000004E-2,1,-2.9830000000000001,1.256,1E-3,0,1,1.9990000000000001,0.71799999999999997,1E-3,0,1,-1.4,0.68899999999999995,1E-3,0]
[14,"Urban two-lane entrance ramp",1,-4.4889999999999999,0.52400000000000002,1E-3,6.9900000000000004E-2,1,-4.0149999999999997,1.256,1E-3,0,1,-1.6779999999999999,0.71799999999999997,1E-3,0,1,-1.1930000000000001,0.68899999999999995,1E-3,0]
[]
[null,"Default (crashes/yr)",{"$f":"UserInput!C76*25/5280*EXP(UserInput!D76+UserInput!E76*LN(UserInput!F76*IF(UserInput!$C$7>8,UserInput!$C$10,UserInput!$C$10*2))+UserInput!G76*UserInput!F76*IF(UserInput!$C$7>8,UserInput!$C$10,UserInput!$C$10*2))+UserInput!C81*25/5280*EXP(UserInput!D81+UserInput!E81*LN(UserInput!F81*IF(UserInput!$C$7>8,UserInput!$C$10,UserInput!$C$10*2))+UserInput!G81*UserInput!F81*IF(UserInput!$C$7>8,UserInput!$C$10,UserInput!$C$10*2))+UserInput!C86*25/5280*EXP(UserInput!D86+UserInput!E86*LN(UserInput!F86*IF(UserInput!$C$7>8,UserInput!$C$10,UserInput!$C$10*2))+UserInput!G86*UserInput!F86*IF(UserInput!$C$7>8,UserInput!$C$10,UserInput!$C$10*2))+UserInput!C91*25/5280*EXP(UserInput!D91+UserInput!E91*LN(UserInput!F91*IF(UserInput!$C$7>8,UserInput!$C$10,UserInput!$C$10*2))+UserInput!G91*UserInput!F91*IF(UserInput!$C$7>8,UserInput!$C$10,UserInput!$C$10*2))","v":8.7786489725804745E-2},null,"User Custom?",null,"No"]
[null,"Custom (crashes/yr)",{"$f":"UserInput!C77*25/5280*EXP(UserInput!D77+UserInput!E77*LN(UserInput!F77*IF(UserInput!$C$7>8,UserInput!$C$10,UserInput!$C$10*2))+UserInput!G77*UserInput!F77*IF(UserInput!$C$7>8,UserInput!$C$10,UserInput!$C$10*2))+UserInput!C82*25/5280*EXP(UserInput!D82+UserInput!E82*LN(UserInput!F82*IF(UserInput!$C$7>8,UserInput!$C$10,UserInput!$C$10*2))+UserInput!G82*UserInput!F82*IF(UserInput!$C$7>8,UserInput!$C$10,UserInput!$C$10*2))+UserInput!C87*25/5280*EXP(UserInput!D87+UserInput!E87*LN(UserInput!F87*IF(UserInput!$C$7>8,UserInput!$C$10,UserInput!$C$10*2))+UserInput!G87*UserInput!F87*IF(UserInput!$C$7>8,UserInput!$C$10,UserInput!$C$10*2))+UserInput!C92*25/5280*EXP(UserInput!D92+UserInput!E92*LN(UserInput!F92*IF(UserInput!$C$7>8,UserInput!$C$10,UserInput!$C$10*2))+UserInput!G92*UserInput!F92*IF(UserInput!$C$7>8,UserInput!$C$10,UserInput!$C$10*2))","v":{"$error":"#NUM!"}}]
[null,"Calibration Factor",{"$f":"UserInput!C72","v":1}]
[]
[null,"Directional Crashes",{"$f":"C51*IF(G49=\"No\",IF(UserInput!C7>8,Crash!C49,Crash!C49/2),IF(UserInput!C7>8,Crash!C50,Crash!C50/2))","v":4.3893244862902372E-2}]

{"sheet":"Capacity","index":7,"n_rows":37,"n_cols":25,"rows_kept":37,"cut":false,"hidden":false,"merged":[[1,20,1,24],[16,1,16,2],[23,1,23,3],[31,1,31,2],[9,1,9,2],[1,1,1,4],[1,10,1,14],[1,15,1,19]]}
[null,null,null,null,null,null,null,"Dir AADT",{"$f":"UserInput!C10","v":50000}]
[null,"Probability of Event per 25'",null,null,null,null,null,null,null,null,"P(queue formation)",null,null,null,null,"Flow Rate (veh/hr/ln)",null,null,null,null,"Number of Vehicles at Risk per hour per lane per yr"]
[null,null,"Final","Prob","Exists?",null,null,"Hr of Day","k","Hourly Volume","Lane 1","Lane 2","Lane 3","Lane 4","Lane 5","Lane 1","Lane 2","Lane 3","Lane 4","Lane 5","Lane 1","Lane 2","Lane 3","Lane 4","Lane 5"]
[null,"Lane 1 (closest to obstruction)",{"$f":"IF(E4=1,D4,0)","v":0},{"$f":"Input!$C$52*25/5280/365/24","v":0},{"$f":"IF(Input!$C$40>=1,1,0)","v":1},null,null,0,{"$f":"IF(Crash!$J$29=\"No\",IF(UserInput!$C$38=0.08,UserInput!F41,IF(UserInput!$C$38=0.09,UserInput!H41,IF(UserInput!$C$38=0.1,UserInput!J41,IF(UserInput!$C$38=0.11,UserInput!L41,UserInput!N41)))),IF(UserInput!$C$38=0.08,UserInput!G41,IF(UserInput!$C$38=0.09,UserInput!I41,IF(UserInput!$C$38=0.1,UserInput!K41,IF(UserInput!$C$38=0.11,UserInput!M41,UserInput!O41)))))","v":1.0200000000000001E-2},{"$f":"$I$1*I4","v":510.00000000000006},{"$f":"IF(P4>=$I$33,1,IF(P4>0,1-_xlfn.LOGNORM.DIST(3600/P4-$I$32,$I$30,$I$31,TRUE),0))","v":0},0,{"$f":"IF(R4>=$I$33,1,IF(R4>0,1-_xlfn.LOGNORM.DIST(3600/R4-$I$32,$I$30,$I$31,TRUE),0))","v":0},{"$f":"IF(S4>=$I$33,1,IF(S4>0,1-_xlfn.LOGNORM.DIST(3600/S4-$I$32,$I$30,$I$31,TRUE),0))","v":0},{"$f":"IF(T4>=$I$33,1,IF(T4>0,1-_xlfn.LOGNORM.DIST(3600/T4-$I$32,$I$30,$I$31,TRUE),0))","v":0},{"$f":"$J4*Input!$C$43","v":127.50000000000001},{"$f":"$J4*Input!$C$44","v":127.50000000000001},{"$f":"$J4*Input!$C$45","v":127.50000000000001},{"$f":"$J4*Input!$C$46","v":127.50000000000001},{"$f":"$J4*Input!$C$47","v":0},{"$f":"K4*(365-Crash!L4*Crash!Q4)*(0.5*(1+$D$26)*MIN(P4,$D$26)+$D$26*MAX(0,(P4-$D$26)))/P4","v":0},{"$f":"IF(Q4=0,0,L4*(365-Crash!M4*Crash!R4)*(0.5*(1+$D$27)*MIN(Q4,$D$27)+$D$27*MAX(0,(Q4-$D$27)))/Q4)","v":0},{"$f":"IF(R4=0,0,M4*(365-Crash!N4*Crash!S4)*(0.5*(1+$D$28)*MIN(R4,$D$28)+$D$28*MAX(0,(R4-$D$28)))/R4)","v":0},{"$f":"IF(S4=0,0,N4*(365-Crash!O4*Crash!T4)*(0.5*(1+$D$29)*MIN(S4,$D$29)+$D$29*MAX(0,(S4-$D$29)))/S4)","v":0},{"$f":"IF(T4=0,0,O4*(365-Crash!P4*Crash!U4)*(0.5*(1+$D$30)*MIN(T4,$D$30)+$D$30*MAX(0,(T4-$D$30)))/T4)","v":0}]
[null,"Lane 2",{"$f":"IF(E5=1,D5,0)","v":0},{"$f":"Input!$C$52*25/5280/365/24","v":0},{"$f":"IF(Input!$C$40>=2,1,0)","v":1},null,null,1,{"$f":"IF(Crash!$J$29=\"No\",IF(UserInput!$C$38=0.08,UserInput!F42,IF(UserInput!$C$38=0.09,UserInput!H42,IF(UserInput!$C$38=0.1,UserInput!J42,IF(UserInput!$C$38=0.11,UserInput!L42,UserInput!N42)))),IF(UserInput!$C$38=0.08,UserInput!G42,IF(UserInput!$C$38=0.09,UserInput!I42,IF(UserInput!$C$38=0.1,UserInput!K42,IF(UserInput!$C$38=0.11,UserInput!M42,UserInput!O42)))))","v":7.3000000000000001E-3},{"$f":"$I$1*I5","v":365},0,{"$f":"IF(Q5>=$I$33,1,IF(Q5>0,1-_xlfn.LOGNORM.DIST(3600/Q5-$I$32,$I$30,$I$31,TRUE),0))","v":0},{"$f":"IF(R5>=$I$33,1,IF(R5>0,1-_xlfn.LOGNORM.DIST(3600/R5-$I$32,$I$30,$I$31,TRUE),0))","v":0},{"$f":"IF(S5>=$I$33,1,IF(S5>0,1-_xlfn.LOGNORM.DIST(3600/S5-$I$32,$I$30,$I$31,TRUE),0))","v":0},{"$f":"IF(T5>=$I$33,1,IF(T5>0,1-_xlfn.LOGNORM.DIST(3600/T5-$I$32,$I$30,$I$31,TRUE),0))","v":0},{"$f":"$J5*Input!$C$43","v":91.25},{"$f":"$J5*Input!$C$44","v":91.25},{"$f":"$J5*Input!$C$45","v":91.25},{"$f":"$J5*Input!$C$46","v":91.25},{"$f":"$J5*Input!$C$47","v":0},{"$f":"K5*(365-Crash!L5*Crash!Q5)*(0.5*(1+$D$26)*MIN(P5,$D$26)+$D$26*MAX(0,(P5-$D$26)))/P5","v":0},{"$f":"IF(Q5=0,0,L5*(365-Crash!M5*Crash!R5)*(0.5*(1+$D$27)*MIN(Q5,$D$27)+$D$27*MAX(0,(Q5-$D$27)))/Q5)","v":0},{"$f":"IF(R5=0,0,M5*(365-Crash!N5*Crash!S5)*(0.5*(1+$D$28)*MIN(R5,$D$28)+$D$28*MAX(0,(R5-$D$28)))/R5)","v":0},{"$f":"IF(S5=0,0,N5*(365-Crash!O5*Crash!T5)*(0.5*(1+$D$29)*MIN(S5,$D$29)+$D$29*MAX(0,(S5-$D$29)))/S5)","v":0},{"$f":"IF(T5=0,0,O5*(365-Crash!P5*Crash!U5)*(0.5*(1+$D$30)*MIN(T5,$D$30)+$D$30*MAX(0,(T5-$D$30)))/T5)","v":0}]
[null,"Lane 3",0,{"$f":"Input!$C$52*25/5280/365/24","v":0},{"$f":"IF(Input!$C$40>=3,1,0)","v":1},null,null,2,{"$f":"IF(Crash!$J$29=\"No\",IF(UserInput!$C$38=0.08,UserInput!F43,IF(UserInput!$C$38=0.09,UserInput!H43,IF(UserInput!$C$38=0.1,UserInput!J43,IF(UserInput!$C$38=0.11,UserInput!L43,UserInput!N43)))),IF(UserInput!$C$38=0.08,UserInput!G43,IF(UserInput!$C$38=0.09,UserInput!I43,IF(UserInput!$C$38=0.1,UserInput!K43,IF(UserInput!$C$38=0.11,UserInput!M43,UserInput!O43)))))","v":6.7000000000000002E-3},335,0,0,0,0,0,{"$f":"$J6*Input!$C$43","v":83.75},{"$f":"$J6*Input!$C$44","v":83.75},{"$f":"$J6*Input!$C$45","v":83.75},{"$f":"$J6*Input!$C$46","v":83.75},{"$f":"$J6*Input!$C$47","v":0},{"$f":"K6*(365-Crash!L6*Crash!Q6)*(0.5*(1+$D$26)*MIN(P6,$D$26)+$D$26*MAX(0,(P6-$D$26)))/P6","v":0},{"$f":"IF(Q6=0,0,L6*(365-Crash!M6*Crash!R6)*(0.5*(1+$D$27)*MIN(Q6,$D$27)+$D$27*MAX(0,(Q6-$D$27)))/Q6)","v":0},{"$f":"IF(R6=0,0,M6*(365-Crash!N6*Crash!S6)*(0.5*(1+$D$28)*MIN(R6,$D$28)+$D$28*MAX(0,(R6-$D$28)))/R6)","v":0},{"$f":"IF(S6=0,0,N6*(365-Crash!O6*Crash!T6)*(0.5*(1+$D$29)*MIN(S6,$D$29)+$D$29*MAX(0,(S6-$D$29)))/S6)","v":0},{"$f":"IF(T6=0,0,O6*(365-Crash!P6*Crash!U6)*(0.5*(1+$D$30)*MIN(T6,$D$30)+$D$30*MAX(0,(T6-$D$30)))/T6)","v":0}]
[null,"Lane 4",0,{"$f":"Input!$C$52*25/5280/365/24","v":0},{"$f":"IF(Input!$C$40>=4,1,0)","v":1},null,null,3,{"$f":"IF(Crash!$J$29=\"No\",IF(UserInput!$C$38=0.08,UserInput!F44,IF(UserInput!$C$38=0.09,UserInput!H44,IF(UserInput!$C$38=0.1,UserInput!J44,IF(UserInput!$C$38=0.11,UserInput!L44,UserInput!N44)))),IF(UserInput!$C$38=0.08,UserInput!G44,IF(UserInput!$C$38=0.09,UserInput!I44,IF(UserInput!$C$38=0.1,UserInput!K44,IF(UserInput!$C$38=0.11,UserInput!M44,UserInput!O44)))))","v":7.7999999999999996E-3},390,0,0,0,0,0,{"$f":"$J7*Input!$C$43","v":97.5},{"$f":"$J7*Input!$C$44","v":97.5},{"$f":"$J7*Input!$C$45","v":97.5},{"$f":"$J7*Input!$C$46","v":97.5},{"$f":"$J7*Input!$C$47","v":0},{"$f":"K7*(365-Crash!L7*Crash!Q7)*(0.5*(1+$D$26)*MIN(P7,$D$26)+$D$26*MAX(0,(P7-$D$26)))/P7","v":0},{"$f":"IF(Q7=0,0,L7*(365-Crash!M7*Crash!R7)*(0.5*(1+$D$27)*MIN(Q7,$D$27)+$D$27*MAX(0,(Q7-$D$27)))/Q7)","v":0},{"$f":"IF(R7=0,0,M7*(365-Crash!N7*Crash!S7)*(0.5*(1+$D$28)*MIN(R7,$D$28)+$D$28*MAX(0,(R7-$D$28)))/R7)","v":0},{"$f":"IF(S7=0,0,N7*(365-Crash!O7*Crash!T7)*(0.5*(1+$D$29)*MIN(S7,$D$29)+$D$29*MAX(0,(S7-$D$29)))/S7)","v":0},{"$f":"IF(T7=0,0,O7*(365-Crash!P7*Crash!U7)*(0.5*(1+$D$30)*MIN(T7,$D$30)+$D$30*MAX(0,(T7-$D$30)))/T7)","v":0}]
[null,"Lane 5",0,{"$f":"Input!$C$52*25/5280/365/24","v":0},{"$f":"IF(Input!$C$40>=5,1,0)","v":0},null,null,4,{"$f":"IF(Crash!$J$29=\"No\",IF(UserInput!$C$38=0.08,UserInput!F45,IF(UserInput!$C$38=0.09,UserInput!H45,IF(UserInput!$C$38=0.1,UserInput!J45,IF(UserInput!$C$38=0.11,UserInput!L45,UserInput!N45)))),IF(UserInput!$C$38=0.08,UserInput!G45,IF(UserInput!$C$38=0.09,UserInput!I45,IF(UserInput!$C$38=0.1,UserInput!K45,IF(UserInput!$C$38=0.11,UserInput!M45,UserInput!O45)))))","v":1.21E-2},605,0,0,0,0,0,{"$f":"$J8*Input!$C$43","v":151.25},{"$f":"$J8*Input!$C$44","v":151.25},{"$f":"$J8*Input!$C$45","v":151.25},{"$f":"$J8*Input!$C$46","v":151.25},{"$f":"$J8*Input!$C$47","v":0},{"$f":"K8*(365-Crash!L8*Crash!Q8)*(0.5*(1+$D$26)*MIN(P8,$D$26)+$D$26*MAX(0,(P8-$D$26)))/P8","v":0},{"$f":"IF(Q8=0,0,L8*(365-Crash!M8*Crash!R8)*(0.5*(1+$D$27)*MIN(Q8,$D$27)+$D$27*MAX(0,(Q8-$D$27)))/Q8)","v":0},{"$f":"IF(R8=0,0,M8*(365-Crash!N8*Crash!S8)*(0.5*(1+$D$28)*MIN(R8,$D$28)+$D$28*MAX(0,(R8-$D$28)))/R8)","v":0},{"$f":"IF(S8=0,0,N8*(365-Crash!O8*Crash!T8)*(0.5*(1+$D$29)*MIN(S8,$D$29)+$D$29*MAX(0,(S8-$D$29)))/S8)","v":0},{"$f":"IF(T8=0,0,O8*(365-Crash!P8*Crash!U8)*(0.5*(1+$D$30)*MIN(T8,$D$30)+$D$30*MAX(0,(T8-$D$30)))/T8)","v":0}]
[null,null,null,null,null,null,null,5,{"$f":"IF(Crash!$J$29=\"No\",IF(UserInput!$C$38=0.08,UserInput!F46,IF(UserInput!$C$38=0.09,UserInput!H46,IF(UserInput!$C$38=0.1,UserInput!J46,IF(UserInput!$C$38=0.11,UserInput!L46,UserInput!N46)))),IF(UserInput!$C$38=0.08,UserInput!G46,IF(UserInput!$C$38=0.09,UserInput!I46,IF(UserInput!$C$38=0.1,UserInput!K46,IF(UserInput!$C$38=0.11,UserInput!M46,UserInput!O46)))))","v":2.5700000000000001E-2},1285,1.2897460877070444E-12,1.2897460877070444E-12,1.2897460877070444E-12,1.2897460877070444E-12,0,{"$f":"$J9*Input!$C$43","v":321.25},{"$f":"$J9*Input!$C$44","v":321.25},{"$f":"$J9*Input!$C$45","v":321.25},{"$f":"$J9*Input!$C$46","v":321.25},{"$f":"$J9*Input!$C$47","v":0},{"$f":"K9*(365-Crash!L9*Crash!Q9)*(0.5*(1+$D$26)*MIN(P9,$D$26)+$D$26*MAX(0,(P9-$D$26)))/P9","v":3.0141500792370826E-8},{"$f":"IF(Q9=0,0,L9*(365-Crash!M9*Crash!R9)*(0.5*(1+$D$27)*MIN(Q9,$D$27)+$D$27*MAX(0,(Q9-$D$27)))/Q9)","v":2.564532766454998E-8},{"$f":"IF(R9=0,0,M9*(365-Crash!N9*Crash!S9)*(0.5*(1+$D$28)*MIN(R9,$D$28)+$D$28*MAX(0,(R9-$D$28)))/R9)","v":1.9322263728520406E-8},{"$f":"IF(S9=0,0,N9*(365-Crash!O9*Crash!T9)*(0.5*(1+$D$29)*MIN(S9,$D$29)+$D$29*MAX(0,(S9-$D$29)))/S9)","v":0},{"$f":"IF(T9=0,0,O9*(365-Crash!P9*Crash!U9)*(0.5*(1+$D$30)*MIN(T9,$D$30)+$D$30*MAX(0,(T9-$D$30)))/T9)","v":0}]
[null,"P(Event per 25' causing Q>C)",null,null,null,null,null,6,{"$f":"IF(Crash!$J$29=\"No\",IF(UserInput!$C$38=0.08,UserInput!F47,IF(UserInput!$C$38=0.09,UserInput!H47,IF(UserInput!$C$38=0.1,UserInput!J47,IF(UserInput!$C$38=0.11,UserInput!L47,UserInput!N47)))),IF(UserInput!$C$38=0.08,UserInput!G47,IF(UserInput!$C$38=0.09,UserInput!I47,IF(UserInput!$C$38=0.1,UserInput!K47,IF(UserInput!$C$38=0.11,UserInput!M47,UserInput!O47)))))","v":5.1299999999999998E-2},2565,7.6341038601768219E-8,7.6341038601768219E-8,7.6341038601768219E-8,7.6341038601768219E-8,0,{"$f":"$J10*Input!$C$43","v":641.25},{"$f":"$J10*Input!$C$44","v":641.25},{"$f":"$J10*Input!$C$45","v":641.25},{"$f":"$J10*Input!$C$46","v":641.25},{"$f":"$J10*Input!$C$47","v":0},{"$f":"K10*(365-Crash!L10*Crash!Q10)*(0.5*(1+$D$26)*MIN(P10,$D$26)+$D$26*MAX(0,(P10-$D$26)))/P10","v":1.8933013587641393E-3},{"$f":"IF(Q10=0,0,L10*(365-Crash!M10*Crash!R10)*(0.5*(1+$D$27)*MIN(Q10,$D$27)+$D$27*MAX(0,(Q10-$D$27)))/Q10)","v":1.5933788777327863E-3},{"$f":"IF(R10=0,0,M10*(365-Crash!N10*Crash!S10)*(0.5*(1+$D$28)*MIN(R10,$D$28)+$D$28*MAX(0,(R10-$D$28)))/R10)","v":1.1837583058682836E-3},{"$f":"IF(S10=0,0,N10*(365-Crash!O10*Crash!T10)*(0.5*(1+$D$29)*MIN(S10,$D$29)+$D$29*MAX(0,(S10-$D$29)))/S10)","v":0},{"$f":"IF(T10=0,0,O10*(365-Crash!P10*Crash!U10)*(0.5*(1+$D$30)*MIN(T10,$D$30)+$D$30*MAX(0,(T10-$D$30)))/T10)","v":0}]
[null,"Lane 1 (closest to obstruction)",{"$f":"IF(Input!$C$50*(1-Input!$C$51)<Input!C43,Capacity!C4,0)","v":0},null,null,null,null,7,{"$f":"IF(Crash!$J$29=\"No\",IF(UserInput!$C$38=0.08,UserInput!F48,IF(UserInput!$C$38=0.09,UserInput!H48,IF(UserInput!$C$38=0.1,UserInput!J48,IF(UserInput!$C$38=0.11,UserInput!L48,UserInput!N48)))),IF(UserInput!$C$38=0.08,UserInput!G48,IF(UserInput!$C$38=0.09,UserInput!I48,IF(UserInput!$C$38=0.1,UserInput!K48,IF(UserInput!$C$38=0.11,UserInput!M48,UserInput!O48)))))","v":6.8199999999999997E-2},3410,5.2153434451085445E-6,5.2153434451085445E-6,5.2153434451085445E-6,5.2153434451085445E-6,0,{"$f":"$J11*Input!$C$43","v":852.5},{"$f":"$J11*Input!$C$44","v":852.5},{"$f":"$J11*Input!$C$45","v":852.5},{"$f":"$J11*Input!$C$46","v":852.5},{"$f":"$J11*Input!$C$47","v":0},{"$f":"K11*(365-Crash!L11*Crash!Q11)*(0.5*(1+$D$26)*MIN(P11,$D$26)+$D$26*MAX(0,(P11-$D$26)))/P11","v":0.13112218063563399},{"$f":"IF(Q11=0,0,L11*(365-Crash!M11*Crash!R11)*(0.5*(1+$D$27)*MIN(Q11,$D$27)+$D$27*MAX(0,(Q11-$D$27)))/Q11)","v":0.11007094518882782},{"$f":"IF(R11=0,0,M11*(365-Crash!N11*Crash!S11)*(0.5*(1+$D$28)*MIN(R11,$D$28)+$D$28*MAX(0,(R11-$D$28)))/R11)","v":8.1503321990366542E-2},{"$f":"IF(S11=0,0,N11*(365-Crash!O11*Crash!T11)*(0.5*(1+$D$29)*MIN(S11,$D$29)+$D$29*MAX(0,(S11-$D$29)))/S11)","v":0},{"$f":"IF(T11=0,0,O11*(365-Crash!P11*Crash!U11)*(0.5*(1+$D$30)*MIN(T11,$D$30)+$D$30*MAX(0,(T11-$D$30)))/T11)","v":0}]
[null,"Lane 2",{"$f":"IF(Input!$C$50*(1-Input!$C$51)<Input!C44,Capacity!C5,0)","v":0},null,null,null,null,8,{"$f":"IF(Crash!$J$29=\"No\",IF(UserInput!$C$38=0.08,UserInput!F49,IF(UserInput!$C$38=0.09,UserInput!H49,IF(UserInput!$C$38=0.1,UserInput!J49,IF(UserInput!$C$38=0.11,UserInput!L49,UserInput!N49)))),IF(UserInput!$C$38=0.08,UserInput!G49,IF(UserInput!$C$38=0.09,UserInput!I49,IF(UserInput!$C$38=0.1,UserInput!K49,IF(UserInput!$C$38=0.11,UserInput!M49,UserInput!O49)))))","v":6.13E-2},3065,1.0897971619572289E-6,1.0897971619572289E-6,1.0897971619572289E-6,1.0897971619572289E-6,0,{"$f":"$J12*Input!$C$43","v":766.25},{"$f":"$J12*Input!$C$44","v":766.25},{"$f":"$J12*Input!$C$45","v":766.25},{"$f":"$J12*Input!$C$46","v":766.25},{"$f":"$J12*Input!$C$47","v":0},{"$f":"K12*(365-Crash!L12*Crash!Q12)*(0.5*(1+$D$26)*MIN(P12,$D$26)+$D$26*MAX(0,(P12-$D$26)))/P12","v":2.7274428212634313E-2},{"$f":"IF(Q12=0,0,L12*(365-Crash!M12*Crash!R12)*(0.5*(1+$D$27)*MIN(Q12,$D$27)+$D$27*MAX(0,(Q12-$D$27)))/Q12)","v":2.2915309597055913E-2},{"$f":"IF(R12=0,0,M12*(365-Crash!N12*Crash!S12)*(0.5*(1+$D$28)*MIN(R12,$D$28)+$D$28*MAX(0,(R12-$D$28)))/R12)","v":1.6987032692815863E-2},{"$f":"IF(S12=0,0,N12*(365-Crash!O12*Crash!T12)*(0.5*(1+$D$29)*MIN(S12,$D$29)+$D$29*MAX(0,(S12-$D$29)))/S12)","v":0},{"$f":"IF(T12=0,0,O12*(365-Crash!P12*Crash!U12)*(0.5*(1+$D$30)*MIN(T12,$D$30)+$D$30*MAX(0,(T12-$D$30)))/T12)","v":0}]
[null,"Lane 3",{"$f":"IF(Input!$C$50*(1-Input!$C$51)<Input!C45,Capacity!C6,0)","v":0},null,null,null,null,9,{"$f":"IF(Crash!$J$29=\"No\",IF(UserInput!$C$38=0.08,UserInput!F50,IF(UserInput!$C$38=0.09,UserInput!H50,IF(UserInput!$C$38=0.1,UserInput!J50,IF(UserInput!$C$38=0.11,UserInput!L50,UserInput!N50)))),IF(UserInput!$C$38=0.08,UserInput!G50,IF(UserInput!$C$38=0.09,UserInput!I50,IF(UserInput!$C$38=0.1,UserInput!K50,IF(UserInput!$C$38=0.11,UserInput!M50,UserInput!O50)))))","v":5.2200000000000003E-2},2610,9.9234812811488382E-8,9.9234812811488382E-8,9.9234812811488382E-8,9.9234812811488382E-8,0,{"$f":"$J13*Input!$C$43","v":652.5},{"$f":"$J13*Input!$C$44","v":652.5},{"$f":"$J13*Input!$C$45","v":652.5},{"$f":"$J13*Input!$C$46","v":652.5},{"$f":"$J13*Input!$C$47","v":0},{"$f":"K13*(365-Crash!L13*Crash!Q13)*(0.5*(1+$D$26)*MIN(P13,$D$26)+$D$26*MAX(0,(P13-$D$26)))/P13","v":2.4634804638131074E-3},{"$f":"IF(Q13=0,0,L13*(365-Crash!M13*Crash!R13)*(0.5*(1+$D$27)*MIN(Q13,$D$27)+$D$27*MAX(0,(Q13-$D$27)))/Q13)","v":2.0728637614202674E-3},{"$f":"IF(R13=0,0,M13*(365-Crash!N13*Crash!S13)*(0.5*(1+$D$28)*MIN(R13,$D$28)+$D$28*MAX(0,(R13-$D$28)))/R13)","v":1.5396198360639998E-3},{"$f":"IF(S13=0,0,N13*(365-Crash!O13*Crash!T13)*(0.5*(1+$D$29)*MIN(S13,$D$29)+$D$29*MAX(0,(S13-$D$29)))/S13)","v":0},{"$f":"IF(T13=0,0,O13*(365-Crash!P13*Crash!U13)*(0.5*(1+$D$30)*MIN(T13,$D$30)+$D$30*MAX(0,(T13-$D$30)))/T13)","v":0}]
[null,"Lane 4",{"$f":"IF(Input!$C$50*(1-Input!$C$51)<Input!C46,Capacity!C7,0)","v":0},null,null,null,null,10,{"$f":"IF(Crash!$J$29=\"No\",IF(UserInput!$C$38=0.08,UserInput!F51,IF(UserInput!$C$38=0.09,UserInput!H51,IF(UserInput!$C$38=0.1,UserInput!J51,IF(UserInput!$C$38=0.11,UserInput!L51,UserInput!N51)))),IF(UserInput!$C$38=0.08,UserInput!G51,IF(UserInput!$C$38=0.09,UserInput!I51,IF(UserInput!$C$38=0.1,UserInput!K51,IF(UserInput!$C$38=0.11,UserInput!M51,UserInput!O51)))))","v":4.99E-2},2495,5.0233616377681756E-8,5.0233616377681756E-8,5.0233616377681756E-8,5.0233616377681756E-8,0,{"$f":"$J14*Input!$C$43","v":623.75},{"$f":"$J14*Input!$C$44","v":623.75},{"$f":"$J14*Input!$C$45","v":623.75},{"$f":"$J14*Input!$C$46","v":623.75},{"$f":"$J14*Input!$C$47","v":0},{"$f":"K14*(365-Crash!L14*Crash!Q14)*(0.5*(1+$D$26)*MIN(P14,$D$26)+$D$26*MAX(0,(P14-$D$26)))/P14","v":1.2438402467250603E-3},{"$f":"IF(Q14=0,0,L14*(365-Crash!M14*Crash!R14)*(0.5*(1+$D$27)*MIN(Q14,$D$27)+$D$27*MAX(0,(Q14-$D$27)))/Q14)","v":1.0471059167252686E-3},{"$f":"IF(R14=0,0,M14*(365-Crash!N14*Crash!S14)*(0.5*(1+$D$28)*MIN(R14,$D$28)+$D$28*MAX(0,(R14-$D$28)))/R14)","v":7.7821510832429936E-4},{"$f":"IF(S14=0,0,N14*(365-Crash!O14*Crash!T14)*(0.5*(1+$D$29)*MIN(S14,$D$29)+$D$29*MAX(0,(S14-$D$29)))/S14)","v":0},{"$f":"IF(T14=0,0,O14*(365-Crash!P14*Crash!U14)*(0.5*(1+$D$30)*MIN(T14,$D$30)+$D$30*MAX(0,(T14-$D$30)))/T14)","v":0}]
[null,"Lane 5",{"$f":"IF(Input!$C$50*(1-Input!$C$51)<Input!C47,Capacity!C8,0)","v":0},null,null,null,null,11,{"$f":"IF(Crash!$J$29=\"No\",IF(UserInput!$C$38=0.08,UserInput!F52,IF(UserInput!$C$38=0.09,UserInput!H52,IF(UserInput!$C$38=0.1,UserInput!J52,IF(UserInput!$C$38=0.11,UserInput!L52,UserInput!N52)))),IF(UserInput!$C$38=0.08,UserInput!G52,IF(UserInput!$C$38=0.09,UserInput!I52,IF(UserInput!$C$38=0.1,UserInput!K52,IF(UserInput!$C$38=0.11,UserInput!M52,UserInput!O52)))))","v":5.1299999999999998E-2},2565,7.6341038601768219E-8,7.6341038601768219E-8,7.6341038601768219E-8,7.6341038601768219E-8,0,{"$f":"$J15*Input!$C$43","v":641.25},{"$f":"$J15*Input!$C$44","v":641.25},{"$f":"$J15*Input!$C$45","v":641.25},{"$f":"$J15*Input!$C$46","v":641.25},{"$f":"$J15*Input!$C$47","v":0},{"$f":"K15*(365-Crash!L15*Crash!Q15)*(0.5*(1+$D$26)*MIN(P15,$D$26)+$D$26*MAX(0,(P15-$D$26)))/P15","v":1.8933013587641393E-3},{"$f":"IF(Q15=0,0,L15*(365-Crash!M15*Crash!R15)*(0.5*(1+$D$27)*MIN(Q15,$D$27)+$D$27*MAX(0,(Q15-$D$27)))/Q15)","v":1.5933788777327863E-3},{"$f":"IF(R15=0,0,M15*(365-Crash!N15*Crash!S15)*(0.5*(1+$D$28)*MIN(R15,$D$28)+$D$28*MAX(0,(R15-$D$28)))/R15)","v":1.1837583058682836E-3},{"$f":"IF(S15=0,0,N15*(365-Crash!O15*Crash!T15)*(0.5*(1+$D$29)*MIN(S15,$D$29)+$D$29*MAX(0,(S15-$D$29)))/S15)","v":0},{"$f":"IF(T15=0,0,O15*(365-Crash!P15*Crash!U15)*(0.5*(1+$D$30)*MIN(T15,$D$30)+$D$30*MAX(0,(T15-$D$30)))/T15)","v":0}]
[null,null,null,null,null,null,null,12,{"$f":"IF(Crash!$J$29=\"No\",IF(UserInput!$C$38=0.08,UserInput!F53,IF(UserInput!$C$38=0.09,UserInput!H53,IF(UserInput!$C$38=0.1,UserInput!J53,IF(UserInput!$C$38=0.11,UserInput!L53,UserInput!N53)))),IF(UserInput!$C$38=0.08,UserInput!G53,IF(UserInput!$C$38=0.09,UserInput!I53,IF(UserInput!$C$38=0.1,UserInput!K53,IF(UserInput!$C$38=0.11,UserInput!M53,UserInput!O53)))))","v":5.3199999999999997E-2},2660,1.3202311066606853E-7,1.3202311066606853E-7,1.3202311066606853E-7,1.3202311066606853E-7,0,{"$f":"$J16*Input!$C$43","v":665},{"$f":"$J16*Input!$C$44","v":665},{"$f":"$J16*Input!$C$45","v":665},{"$f":"$J16*Input!$C$46","v":665},{"$f":"$J16*Input!$C$47","v":0},{"$f":"K16*(365-Crash!L16*Crash!Q16)*(0.5*(1+$D$26)*MIN(P16,$D$26)+$D$26*MAX(0,(P16-$D$26)))/P16","v":3.2808566105130958E-3},{"$f":"IF(Q16=0,0,L16*(365-Crash!M16*Crash!R16)*(0.5*(1+$D$27)*MIN(Q16,$D$27)+$D$27*MAX(0,(Q16-$D$27)))/Q16)","v":2.760106401881218E-3},{"$f":"IF(R16=0,0,M16*(365-Crash!N16*Crash!S16)*(0.5*(1+$D$28)*MIN(R16,$D$28)+$D$28*MAX(0,(R16-$D$28)))/R16)","v":2.0495581605786731E-3},{"$f":"IF(S16=0,0,N16*(365-Crash!O16*Crash!T16)*(0.5*(1+$D$29)*MIN(S16,$D$29)+$D$29*MAX(0,(S16-$D$29)))/S16)","v":0},{"$f":"IF(T16=0,0,O16*(365-Crash!P16*Crash!U16)*(0.5*(1+$D$30)*MIN(T16,$D$30)+$D$30*MAX(0,(T16-$D$30)))/T16)","v":0}]
[null,"No. of Analysis Segments (X)",null,null,null,null,null,13,{"$f":"IF(Crash!$J$29=\"No\",IF(UserInput!$C$38=0.08,UserInput!F54,IF(UserInput!$C$38=0.09,UserInput!H54,IF(UserInput!$C$38=0.1,UserInput!J54,IF(UserInput!$C$38=0.11,UserInput!L54,UserInput!N54)))),IF(UserInput!$C$38=0.08,UserInput!G54,IF(UserInput!$C$38=0.09,UserInput!I54,IF(UserInput!$C$38=0.1,UserInput!K54,IF(UserInput!$C$38=0.11,UserInput!M54,UserInput!O54)))))","v":5.4800000000000001E-2},2740,2.0589890470379402E-7,2.0589890470379402E-7,2.0589890470379402E-7,2.0589890470379402E-7,0,{"$f":"$J17*Input!$C$43","v":685},{"$f":"$J17*Input!$C$44","v":685},{"$f":"$J17*Input!$C$45","v":685},{"$f":"$J17*Input!$C$46","v":685},{"$f":"$J17*Input!$C$47","v":0},{"$f":"K17*(365-Crash!L17*Crash!Q17)*(0.5*(1+$D$26)*MIN(P17,$D$26)+$D$26*MAX(0,(P17-$D$26)))/P17","v":5.1248078531607021E-3},{"$f":"IF(Q17=0,0,L17*(365-Crash!M17*Crash!R17)*(0.5*(1+$D$27)*MIN(Q17,$D$27)+$D$27*MAX(0,(Q17-$D$27)))/Q17)","v":4.3101251574888888E-3},{"$f":"IF(R17=0,0,M17*(365-Crash!N17*Crash!S17)*(0.5*(1+$D$28)*MIN(R17,$D$28)+$D$28*MAX(0,(R17-$D$28)))/R17)","v":3.1993336854241198E-3},{"$f":"IF(S17=0,0,N17*(365-Crash!O17*Crash!T17)*(0.5*(1+$D$29)*MIN(S17,$D$29)+$D$29*MAX(0,(S17-$D$29)))/S17)","v":0},{"$f":"IF(T17=0,0,O17*(365-Crash!P17*Crash!U17)*(0.5*(1+$D$30)*MIN(T17,$D$30)+$D$30*MAX(0,(T17-$D$30)))/T17)","v":0}]
[null,"Lane 1 (closest to obstruction)",{"$f":"Input!C43","v":0.25},null,null,null,null,14,{"$f":"IF(Crash!$J$29=\"No\",IF(UserInput!$C$38=0.08,UserInput!F55,IF(UserInput!$C$38=0.09,UserInput!H55,IF(UserInput!$C$38=0.1,UserInput!J55,IF(UserInput!$C$38=0.11,UserInput!L55,UserInput!N55)))),IF(UserInput!$C$38=0.08,UserInput!G55,IF(UserInput!$C$38=0.09,UserInput!I55,IF(UserInput!$C$38=0.1,UserInput!K55,IF(UserInput!$C$38=0.11,UserInput!M55,UserInput!O55)))))","v":6.08E-2},3040,9.655999474444954E-7,9.655999474444954E-7,9.655999474444954E-7,9.655999474444954E-7,0,{"$f":"$J18*Input!$C$43","v":760},{"$f":"$J18*Input!$C$44","v":760},{"$f":"$J18*Input!$C$45","v":760},{"$f":"$J18*Input!$C$46","v":760},{"$f":"$J18*Input!$C$47","v":0},{"$f":"K18*(365-Crash!L18*Crash!Q18)*(0.5*(1+$D$26)*MIN(P18,$D$26)+$D$26*MAX(0,(P18-$D$26)))/P18","v":2.4157036437053019E-2},{"$f":"IF(Q18=0,0,L18*(365-Crash!M18*Crash!R18)*(0.5*(1+$D$27)*MIN(Q18,$D$27)+$D$27*MAX(0,(Q18-$D$27)))/Q18)","v":2.0297578924853038E-2},{"$f":"IF(R18=0,0,M18*(365-Crash!N18*Crash!S18)*(0.5*(1+$D$28)*MIN(R18,$D$28)+$D$28*MAX(0,(R18-$D$28)))/R18)","v":1.5047901656038662E-2},{"$f":"IF(S18=0,0,N18*(365-Crash!O18*Crash!T18)*(0.5*(1+$D$29)*MIN(S18,$D$29)+$D$29*MAX(0,(S18-$D$29)))/S18)","v":0},{"$f":"IF(T18=0,0,O18*(365-Crash!P18*Crash!U18)*(0.5*(1+$D$30)*MIN(T18,$D$30)+$D$30*MAX(0,(T18-$D$30)))/T18)","v":0}]
[null,"Lane 2",{"$f":"Input!C44","v":0.25},null,null,null,null,15,{"$f":"IF(Crash!$J$29=\"No\",IF(UserInput!$C$38=0.08,UserInput!F56,IF(UserInput!$C$38=0.09,UserInput!H56,IF(UserInput!$C$38=0.1,UserInput!J56,IF(UserInput!$C$38=0.11,UserInput!L56,UserInput!N56)))),IF(UserInput!$C$38=0.08,UserInput!G56,IF(UserInput!$C$38=0.09,UserInput!I56,IF(UserInput!$C$38=0.1,UserInput!K56,IF(UserInput!$C$38=0.11,UserInput!M56,UserInput!O56)))))","v":7.0599999999999996E-2},3530,8.6310211913076529E-6,8.6310211913076529E-6,8.6310211913076529E-6,8.6310211913076529E-6,0,{"$f":"$J19*Input!$C$43","v":882.5},{"$f":"$J19*Input!$C$44","v":882.5},{"$f":"$J19*Input!$C$45","v":882.5},{"$f":"$J19*Input!$C$46","v":882.5},{"$f":"$J19*Input!$C$47","v":0},{"$f":"K19*(365-Crash!L19*Crash!Q19)*(0.5*(1+$D$26)*MIN(P19,$D$26)+$D$26*MAX(0,(P19-$D$26)))/P19","v":0.21729112783421364},{"$f":"IF(Q19=0,0,L19*(365-Crash!M19*Crash!R19)*(0.5*(1+$D$27)*MIN(Q19,$D$27)+$D$27*MAX(0,(Q19-$D$27)))/Q19)","v":0.18235865017963818},{"$f":"IF(R19=0,0,M19*(365-Crash!N19*Crash!S19)*(0.5*(1+$D$28)*MIN(R19,$D$28)+$D$28*MAX(0,(R19-$D$28)))/R19)","v":0.13498388244246606},{"$f":"IF(S19=0,0,N19*(365-Crash!O19*Crash!T19)*(0.5*(1+$D$29)*MIN(S19,$D$29)+$D$29*MAX(0,(S19-$D$29)))/S19)","v":0},{"$f":"IF(T19=0,0,O19*(365-Crash!P19*Crash!U19)*(0.5*(1+$D$30)*MIN(T19,$D$30)+$D$30*MAX(0,(T19-$D$30)))/T19)","v":0}]
[null,"Lane 3",{"$f":"Input!C45","v":0.25},null,null,null,null,16,{"$f":"IF(Crash!$J$29=\"No\",IF(UserInput!$C$38=0.08,UserInput!F57,IF(UserInput!$C$38=0.09,UserInput!H57,IF(UserInput!$C$38=0.1,UserInput!J57,IF(UserInput!$C$38=0.11,UserInput!L57,UserInput!N57)))),IF(UserInput!$C$38=0.08,UserInput!G57,IF(UserInput!$C$38=0.09,UserInput!I57,IF(UserInput!$C$38=0.1,UserInput!K57,IF(UserInput!$C$38=0.11,UserInput!M57,UserInput!O57)))))","v":0.08},4000,{"$f":"IF(P20>=$I$33,1,IF(P20>0,1-_xlfn.LOGNORM.DIST(3600/P20-$I$32,$I$30,$I$31,TRUE),0))","v":5.2531348443074499E-5},5.2531348443074499E-5,5.2531348443074499E-5,5.2531348443074499E-5,0,{"$f":"$J20*Input!$C$43","v":1000},{"$f":"$J20*Input!$C$44","v":1000},{"$f":"$J20*Input!$C$45","v":1000},{"$f":"$J20*Input!$C$46","v":1000},{"$f":"$J20*Input!$C$47","v":0},{"$f":"K20*(365-Crash!L20*Crash!Q20)*(0.5*(1+$D$26)*MIN(P20,$D$26)+$D$26*MAX(0,(P20-$D$26)))/P20","v":1.3283128011685523},{"$f":"IF(Q20=0,0,L20*(365-Crash!M20*Crash!R20)*(0.5*(1+$D$27)*MIN(Q20,$D$27)+$D$27*MAX(0,(Q20-$D$27)))/Q20)","v":1.1138133519388975},{"$f":"IF(R20=0,0,M20*(365-Crash!N20*Crash!S20)*(0.5*(1+$D$28)*MIN(R20,$D$28)+$D$28*MAX(0,(R20-$D$28)))/R20)","v":0.82352945310625614},{"$f":"IF(S20=0,0,N20*(365-Crash!O20*Crash!T20)*(0.5*(1+$D$29)*MIN(S20,$D$29)+$D$29*MAX(0,(S20-$D$29)))/S20)","v":0},{"$f":"IF(T20=0,0,O20*(365-Crash!P20*Crash!U20)*(0.5*(1+$D$30)*MIN(T20,$D$30)+$D$30*MAX(0,(T20-$D$30)))/T20)","v":0}]
[null,"Lane 4",{"$f":"Input!C46","v":0.25},null,null,null,null,17,{"$f":"IF(Crash!$J$29=\"No\",IF(UserInput!$C$38=0.08,UserInput!F58,IF(UserInput!$C$38=0.09,UserInput!H58,IF(UserInput!$C$38=0.1,UserInput!J58,IF(UserInput!$C$38=0.11,UserInput!L58,UserInput!N58)))),IF(UserInput!$C$38=0.08,UserInput!G58,IF(UserInput!$C$38=0.09,UserInput!I58,IF(UserInput!$C$38=0.1,UserInput!K58,IF(UserInput!$C$38=0.11,UserInput!M58,UserInput!O58)))))","v":7.2999999999999995E-2},3649.9999999999995,{"$f":"IF(P21>=$I$33,1,IF(P21>0,1-_xlfn.LOGNORM.DIST(3600/P21-$I$32,$I$30,$I$31,TRUE),0))","v":1.4021181865220278E-5},1.4021181865220278E-5,1.4021181865220278E-5,1.4021181865220278E-5,0,{"$f":"$J21*Input!$C$43","v":912.49999999999989},{"$f":"$J21*Input!$C$44","v":912.49999999999989},{"$f":"$J21*Input!$C$45","v":912.49999999999989},{"$f":"$J21*Input!$C$46","v":912.49999999999989},{"$f":"$J21*Input!$C$47","v":0},{"$f":"K21*(365-Crash!L21*Crash!Q21)*(0.5*(1+$D$26)*MIN(P21,$D$26)+$D$26*MAX(0,(P21-$D$26)))/P21","v":0.35343218912994706},{"$f":"IF(Q21=0,0,L21*(365-Crash!M21*Crash!R21)*(0.5*(1+$D$27)*MIN(Q21,$D$27)+$D$27*MAX(0,(Q21-$D$27)))/Q21)","v":0.29654183105448811},{"$f":"IF(R21=0,0,M21*(365-Crash!N21*Crash!S21)*(0.5*(1+$D$28)*MIN(R21,$D$28)+$D$28*MAX(0,(R21-$D$28)))/R21)","v":0.2194342382910561},{"$f":"IF(S21=0,0,N21*(365-Crash!O21*Crash!T21)*(0.5*(1+$D$29)*MIN(S21,$D$29)+$D$29*MAX(0,(S21-$D$29)))/S21)","v":0},{"$f":"IF(T21=0,0,O21*(365-Crash!P21*Crash!U21)*(0.5*(1+$D$30)*MIN(T21,$D$30)+$D$30*MAX(0,(T21-$D$30)))/T21)","v":0}]
[null,"Lane 5",{"$f":"Input!C47","v":0},null,null,null,null,18,{"$f":"IF(Crash!$J$29=\"No\",IF(UserInput!$C$38=0.08,UserInput!F59,IF(UserInput!$C$38=0.09,UserInput!H59,IF(UserInput!$C$38=0.1,UserInput!J59,IF(UserInput!$C$38=0.11,UserInput!L59,UserInput!N59)))),IF(UserInput!$C$38=0.08,UserInput!G59,IF(UserInput!$C$38=0.09,UserInput!I59,IF(UserInput!$C$38=0.1,UserInput!K59,IF(UserInput!$C$38=0.11,UserInput!M59,UserInput!O59)))))","v":5.6800000000000003E-2},2840,3.5169764023290639E-7,3.5169764023290639E-7,3.5169764023290639E-7,3.5169764023290639E-7,0,{"$f":"$J22*Input!$C$43","v":710},{"$f":"$J22*Input!$C$44","v":710},{"$f":"$J22*Input!$C$45","v":710},{"$f":"$J22*Input!$C$46","v":710},{"$f":"$J22*Input!$C$47","v":0},{"$f":"K22*(365-Crash!L22*Crash!Q22)*(0.5*(1+$D$26)*MIN(P22,$D$26)+$D$26*MAX(0,(P22-$D$26)))/P22","v":8.7698376911261623E-3},{"$f":"IF(Q22=0,0,L22*(365-Crash!M22*Crash!R22)*(0.5*(1+$D$27)*MIN(Q22,$D$27)+$D$27*MAX(0,(Q22-$D$27)))/Q22)","v":7.3732079921069345E-3},{"$f":"IF(R22=0,0,M22*(365-Crash!N22*Crash!S22)*(0.5*(1+$D$28)*MIN(R22,$D$28)+$D$28*MAX(0,(R22-$D$28)))/R22)","v":5.4705844455764756E-3},{"$f":"IF(S22=0,0,N22*(365-Crash!O22*Crash!T22)*(0.5*(1+$D$29)*MIN(S22,$D$29)+$D$29*MAX(0,(S22-$D$29)))/S22)","v":0},{"$f":"IF(T22=0,0,O22*(365-Crash!P22*Crash!U22)*(0.5*(1+$D$30)*MIN(T22,$D$30)+$D$30*MAX(0,(T22-$D$30)))/T22)","v":0}]
[null,null,null,null,null,null,null,19,{"$f":"IF(Crash!$J$29=\"No\",IF(UserInput!$C$38=0.08,UserInput!F60,IF(UserInput!$C$38=0.09,UserInput!H60,IF(UserInput!$C$38=0.1,UserInput!J60,IF(UserInput!$C$38=0.11,UserInput!L60,UserInput!N60)))),IF(UserInput!$C$38=0.08,UserInput!G60,IF(UserInput!$C$38=0.09,UserInput!I60,IF(UserInput!$C$38=0.1,UserInput!K60,IF(UserInput!$C$38=0.11,UserInput!M60,UserInput!O60)))))","v":4.2900000000000001E-2},2145,4.9631824206031183E-9,4.9631824206031183E-9,4.9631824206031183E-9,4.9631824206031183E-9,0,{"$f":"$J23*Input!$C$43","v":536.25},{"$f":"$J23*Input!$C$44","v":536.25},{"$f":"$J23*Input!$C$45","v":536.25},{"$f":"$J23*Input!$C$46","v":536.25},{"$f":"$J23*Input!$C$47","v":0},{"$f":"K23*(365-Crash!L23*Crash!Q23)*(0.5*(1+$D$26)*MIN(P23,$D$26)+$D$26*MAX(0,(P23-$D$26)))/P23","v":1.217135079511707E-4},{"$f":"IF(Q23=0,0,L23*(365-Crash!M23*Crash!R23)*(0.5*(1+$D$27)*MIN(Q23,$D$27)+$D$27*MAX(0,(Q23-$D$27)))/Q23)","v":1.0264323540398694E-4},{"$f":"IF(R23=0,0,M23*(365-Crash!N23*Crash!S23)*(0.5*(1+$D$28)*MIN(R23,$D$28)+$D$28*MAX(0,(R23-$D$28)))/R23)","v":7.6460011138460783E-5},{"$f":"IF(S23=0,0,N23*(365-Crash!O23*Crash!T23)*(0.5*(1+$D$29)*MIN(S23,$D$29)+$D$29*MAX(0,(S23-$D$29)))/S23)","v":0},{"$f":"IF(T23=0,0,O23*(365-Crash!P23*Crash!U23)*(0.5*(1+$D$30)*MIN(T23,$D$30)+$D$30*MAX(0,(T23-$D$30)))/T23)","v":0}]
[null,"No. of Segments in Restricted Zone",null,null,null,null,null,20,{"$f":"IF(Crash!$J$29=\"No\",IF(UserInput!$C$38=0.08,UserInput!F61,IF(UserInput!$C$38=0.09,UserInput!H61,IF(UserInput!$C$38=0.1,UserInput!J61,IF(UserInput!$C$38=0.11,UserInput!L61,UserInput!N61)))),IF(UserInput!$C$38=0.08,UserInput!G61,IF(UserInput!$C$38=0.09,UserInput!I61,IF(UserInput!$C$38=0.1,UserInput!K61,IF(UserInput!$C$38=0.11,UserInput!M61,UserInput!O61)))))","v":3.5099999999999999E-2},1755,2.1196744359741615E-10,2.1196744359741615E-10,2.1196744359741615E-10,2.1196744359741615E-10,0,{"$f":"$J24*Input!$C$43","v":438.75},{"$f":"$J24*Input!$C$44","v":438.75},{"$f":"$J24*Input!$C$45","v":438.75},{"$f":"$J24*Input!$C$46","v":438.75},{"$f":"$J24*Input!$C$47","v":0},{"$f":"K24*(365-Crash!L24*Crash!Q24)*(0.5*(1+$D$26)*MIN(P24,$D$26)+$D$26*MAX(0,(P24-$D$26)))/P24","v":5.1174151460918328E-6},{"$f":"IF(Q24=0,0,L24*(365-Crash!M24*Crash!R24)*(0.5*(1+$D$27)*MIN(Q24,$D$27)+$D$27*MAX(0,(Q24-$D$27)))/Q24)","v":4.3279647624262911E-6},{"$f":"IF(R24=0,0,M24*(365-Crash!N24*Crash!S24)*(0.5*(1+$D$28)*MIN(R24,$D$28)+$D$28*MAX(0,(R24-$D$28)))/R24)","v":3.2358829188916431E-6},{"$f":"IF(S24=0,0,N24*(365-Crash!O24*Crash!T24)*(0.5*(1+$D$29)*MIN(S24,$D$29)+$D$29*MAX(0,(S24-$D$29)))/S24)","v":0},{"$f":"IF(T24=0,0,O24*(365-Crash!P24*Crash!U24)*(0.5*(1+$D$30)*MIN(T24,$D$30)+$D$30*MAX(0,(T24-$D$30)))/T24)","v":0}]
[null,null,"L","No.",null,null,null,21,{"$f":"IF(Crash!$J$29=\"No\",IF(UserInput!$C$38=0.08,UserInput!F62,IF(UserInput!$C$38=0.09,UserInput!H62,IF(UserInput!$C$38=0.1,UserInput!J62,IF(UserInput!$C$38=0.11,UserInput!L62,UserInput!N62)))),IF(UserInput!$C$38=0.08,UserInput!G62,IF(UserInput!$C$38=0.09,UserInput!I62,IF(UserInput!$C$38=0.1,UserInput!K62,IF(UserInput!$C$38=0.11,UserInput!M62,UserInput!O62)))))","v":2.9700000000000001E-2},1485,1.4219736499399005E-11,1.4219736499399005E-11,1.4219736499399005E-11,1.4219736499399005E-11,0,{"$f":"$J25*Input!$C$43","v":371.25},{"$f":"$J25*Input!$C$44","v":371.25},{"$f":"$J25*Input!$C$45","v":371.25},{"$f":"$J25*Input!$C$46","v":371.25},{"$f":"$J25*Input!$C$47","v":0},{"$f":"K25*(365-Crash!L25*Crash!Q25)*(0.5*(1+$D$26)*MIN(P25,$D$26)+$D$26*MAX(0,(P25-$D$26)))/P25","v":3.3784887831423104E-7},{"$f":"IF(Q25=0,0,L25*(365-Crash!M25*Crash!R25)*(0.5*(1+$D$27)*MIN(Q25,$D$27)+$D$27*MAX(0,(Q25-$D$27)))/Q25)","v":2.8657198849314583E-7},{"$f":"IF(R25=0,0,M25*(365-Crash!N25*Crash!S25)*(0.5*(1+$D$28)*MIN(R25,$D$28)+$D$28*MAX(0,(R25-$D$28)))/R25)","v":2.1507224242482423E-7},{"$f":"IF(S25=0,0,N25*(365-Crash!O25*Crash!T25)*(0.5*(1+$D$29)*MIN(S25,$D$29)+$D$29*MAX(0,(S25-$D$29)))/S25)","v":0},{"$f":"IF(T25=0,0,O25*(365-Crash!P25*Crash!U25)*(0.5*(1+$D$30)*MIN(T25,$D$30)+$D$30*MAX(0,(T25-$D$30)))/T25)","v":0}]
[null,"Lane 1 (closest to obstruction)",0.34090909090909088,{"$f":"ROUNDUP(C26*5280/25,0)","v":72},null,null,null,22,{"$f":"IF(Crash!$J$29=\"No\",IF(UserInput!$C$38=0.08,UserInput!F63,IF(UserInput!$C$38=0.09,UserInput!H63,IF(UserInput!$C$38=0.1,UserInput!J63,IF(UserInput!$C$38=0.11,UserInput!L63,UserInput!N63)))),IF(UserInput!$C$38=0.08,UserInput!G63,IF(UserInput!$C$38=0.09,UserInput!I63,IF(UserInput!$C$38=0.1,UserInput!K63,IF(UserInput!$C$38=0.11,UserInput!M63,UserInput!O63)))))","v":2.2800000000000001E-2},1140,1.6919798895287386E-13,1.6919798895287386E-13,1.6919798895287386E-13,1.6919798895287386E-13,0,{"$f":"$J26*Input!$C$43","v":285},{"$f":"$J26*Input!$C$44","v":285},{"$f":"$J26*Input!$C$45","v":285},{"$f":"$J26*Input!$C$46","v":285},{"$f":"$J26*Input!$C$47","v":0},{"$f":"K26*(365-Crash!L26*Crash!Q26)*(0.5*(1+$D$26)*MIN(P26,$D$26)+$D$26*MAX(0,(P26-$D$26)))/P26","v":3.8918975352085579E-9},{"$f":"IF(Q26=0,0,L26*(365-Crash!M26*Crash!R26)*(0.5*(1+$D$27)*MIN(Q26,$D$27)+$D$27*MAX(0,(Q26-$D$27)))/Q26)","v":3.3212418845884657E-9},{"$f":"IF(R26=0,0,M26*(365-Crash!N26*Crash!S26)*(0.5*(1+$D$28)*MIN(R26,$D$28)+$D$28*MAX(0,(R26-$D$28)))/R26)","v":2.5118381219777344E-9},{"$f":"IF(S26=0,0,N26*(365-Crash!O26*Crash!T26)*(0.5*(1+$D$29)*MIN(S26,$D$29)+$D$29*MAX(0,(S26-$D$29)))/S26)","v":0},{"$f":"IF(T26=0,0,O26*(365-Crash!P26*Crash!U26)*(0.5*(1+$D$30)*MIN(T26,$D$30)+$D$30*MAX(0,(T26-$D$30)))/T26)","v":0}]
[null,"Lane 2",0.28409090909090912,{"$f":"ROUNDUP(C27*5280/25,0)","v":60},null,null,null,23,{"$f":"IF(Crash!$J$29=\"No\",IF(UserInput!$C$38=0.08,UserInput!F64,IF(UserInput!$C$38=0.09,UserInput!H64,IF(UserInput!$C$38=0.1,UserInput!J64,IF(UserInput!$C$38=0.11,UserInput!L64,UserInput!N64)))),IF(UserInput!$C$38=0.08,UserInput!G64,IF(UserInput!$C$38=0.09,UserInput!I64,IF(UserInput!$C$38=0.1,UserInput!K64,IF(UserInput!$C$38=0.11,UserInput!M64,UserInput!O64)))))","v":1.6299999999999999E-2},814.99999999999989,4.4408920985006262E-16,4.4408920985006262E-16,4.4408920985006262E-16,4.4408920985006262E-16,0,{"$f":"$J27*Input!$C$43","v":203.74999999999997},{"$f":"$J27*Input!$C$44","v":203.74999999999997},{"$f":"$J27*Input!$C$45","v":203.74999999999997},{"$f":"$J27*Input!$C$46","v":203.74999999999997},{"$f":"$J27*Input!$C$47","v":0},{"$f":"K27*(365-Crash!L27*Crash!Q27)*(0.5*(1+$D$26)*MIN(P27,$D$26)+$D$26*MAX(0,(P27-$D$26)))/P27","v":9.6362858154963288E-12},{"$f":"IF(Q27=0,0,L27*(365-Crash!M27*Crash!R27)*(0.5*(1+$D$27)*MIN(Q27,$D$27)+$D$27*MAX(0,(Q27-$D$27)))/Q27)","v":8.3166062573067617E-12},{"$f":"IF(R27=0,0,M27*(365-Crash!N27*Crash!S27)*(0.5*(1+$D$28)*MIN(R27,$D$28)+$D$28*MAX(0,(R27-$D$28)))/R27)","v":6.3788489313575254E-12},{"$f":"IF(S27=0,0,N27*(365-Crash!O27*Crash!T27)*(0.5*(1+$D$29)*MIN(S27,$D$29)+$D$29*MAX(0,(S27-$D$29)))/S27)","v":0},{"$f":"IF(T27=0,0,O27*(365-Crash!P27*Crash!U27)*(0.5*(1+$D$30)*MIN(T27,$D$30)+$D$30*MAX(0,(T27-$D$30)))/T27)","v":0}]
[null,"Lane 3",0.20833333333333331,44]
[null,"Lane 4",0,0]
[null,"Lane 5",null,0,null,null,null,"Mean",-1.1609]
[null,null,null,null,null,null,null,"Std Dev",0.49059999999999998]
[null,"No. Vehicles at Risk per Year",null,null,null,null,null,"Shift",{"$f":"3600/VLOOKUP(UserInput!$C$7,Ref!D102:F115,3)","v":1.5}]
[null,"Lane 1 (closest to obstruction)",{"$f":"SUM(U4:U27)","v":2.1063863918159109},null,null,null,null,"Capacity",{"$f":"VLOOKUP(UserInput!$C$7,Ref!D102:F115,3)","v":2400}]
[null,"Lane 2",{"$f":"SUM(V4:V27)","v":1.7668551206158898}]
[null,"Lane 3",{"$f":"SUM(W4:W27)","v":1.3069705908334841}]
[null,"Lane 4",{"$f":"SUM(X4:X27)","v":0}]
[null,"Lane 5",{"$f":"SUM(Y4:Y27)","v":0}]

{"sheet":"Tables","index":8,"n_rows":358,"n_cols":19,"rows_kept":358,"cut":false,"hidden":true,"merged":[]}
[]
[null,109.76474972005059,126.83082550792486,148.87323738811014,179.85345702302595,206.40135684355093,230.05907579361494,0.55282674474766946,0.54391018434851357,0.53499362394935757,0.52607706355020167,0.50824394275188978,0.49932738235273383,3.0291876424529835E-6,2.9803297772521291E-6,2.9314719120512743E-6,2.8826140468504203E-6,2.7848983164487111E-6,2.7360404512478567E-6]
[null,109.76474972005059,126.83082550792486,148.87323738811014,179.85345702302595,206.40135684355093,230.05907579361494,2.3867358878999623,2.3617729102670295,2.3363479977489368,2.3110914771251294,2.2697607416118819,2.2501211557176442,6.5390024326026368E-6,6.4706107130603551E-6,6.4009534184902377E-6,6.3317574715756966E-6,6.2185225797585804E-6,6.1647154951168334E-6]
[null,109.76474972005059,126.83082550792486,148.87323738811014,179.85345702302595,206.40135684355093,230.05907579361494,6.5493641672178482,6.4902943338763626,6.4296173389080158,6.367333182312807,6.2379433842418086,6.1708377427660182,1.1962308981219814E-5,1.1854418874660023E-5,1.1743593313074002E-5,1.1629832296461748E-5,1.1393503898158555E-5,1.1270936516467614E-5]
[null,109.76474972005059,126.83082550792486,148.87323738811014,179.85345702302595,206.40135684355093,230.05907579361494,12.981783113384578,12.836091379676928,12.688165211416651,12.538004608603742,12.230980099320041,12.074493125645768,1.7783264538882982E-5,1.7583686821475243E-5,1.738104823481733E-5,1.7175348778909238E-5,1.6754767259342522E-5,1.6540401541980504E-5]
[null,109.76474972005059,126.83082550792486,148.87323738811014,179.85345702302595,206.40135684355093,230.05907579361494,21.597354423444354,21.332287748725758,21.06425637009735,20.793260287559121,20.242374010753235,19.96248381648557,2.366833361473354E-5,2.3377849587644665E-5,2.3084116569969699E-5,2.2787134561708625E-5,2.2183423573428201E-5,2.1876694593408844E-5]
[null,109.76474972005059,126.83082550792486,148.87323738811014,179.85345702302595,206.40135684355093,230.05907579361494,60.539491569819511,59.692276231399518,58.840221767820353,57.983328179082029,56.255023626127887,55.383612661912096,4.1465405184807883E-5,4.0885120706438028E-5,4.0301521758781063E-5,3.9714608341837008E-5,3.8530838100087593E-5,3.793398127528226E-5]
[null,109.76474972005059,126.83082550792486,148.87323738811014,179.85345702302595,206.40135684355093,230.05907579361494,97.362686797737126,95.950452802504472,94.532091499406604,93.107602888443424,90.240243742921351,88.797373208362387,5.3349417423417602E-5,5.2575590576714781E-5,5.1798406301044717E-5,5.1017864596407357E-5,4.9446708900230876E-5,4.8656094908691721E-5]
[null,109.76474972005059,126.83082550792486,148.87323738811014,179.85345702302595,206.40135684355093,230.05907579361494,227.52990178042754,224.07865846170125,220.61812543437301,217.14830269844285,210.18078810077634,206.68309623904008,8.3115945855863935E-5,8.1855217702904567E-5,8.0591096049086031E-5,7.9323580894408339E-5,7.6778370082475369E-5,7.5500674425220117E-5]
[null,109.76474972005059,126.83082550792486,148.87323738811014,179.85345702302595,206.40135684355093,230.05907579361494,412.45784471098187,406.07072812183168,399.67113080251329,393.25905275302665,380.39745446354874,373.94793422355752,1.1300214923588545E-4,1.1125225427995389E-4,1.0949893994589406E-4,1.0774220623370593E-4,1.0421848067494486E-4,1.0245148882837193E-4]
[]
[]
[]
[null,155.07458700146137,179.1247288286259,210.1481628907357,253.66164985863884,290.85155263825595,323.90428950027336,0.53499362394935757,0.52607706355020167,0.50824394275188978,0.49041082195357782,0.47257770115526593,0.45474458035695386,2.9314719120512743E-6,2.8826140468504203E-6,2.7848983164487111E-6,2.6871825860470019E-6,2.5894668556452927E-6,2.491751125243583E-6]
[null,155.07458700146137,179.1247288286259,210.1481628907357,253.66164985863884,290.85155263825595,323.90428950027336,2.3363479977489368,2.3110914771251294,2.2697607416118819,2.229909828982175,2.1903476414623877,2.1535478194977062,6.4009534184902377E-6,6.3317574715756966E-6,6.2185225797585804E-6,6.1093419972114388E-6,6.0009524423627062E-6,5.9001310123224831E-6]
[null,155.07458700146137,179.1247288286259,210.1481628907357,253.66164985863884,290.85155263825595,323.90428950027336,6.4296173389080158,6.367333182312807,6.2379433842418086,6.1026708207498688,5.9639050090458339,5.8184358936839145,1.1743593313074002E-5,1.1629832296461748E-5,1.1393503898158555E-5,1.1146430722830811E-5,1.0892977185471843E-5,1.0627280171112173E-5]
[null,155.07458700146137,179.1247288286259,210.1481628907357,253.66164985863884,290.85155263825595,323.90428950027336,12.688165211416651,12.538004608603742,12.230980099320041,11.917237567183101,11.598224425026888,11.270797897026659,1.738104823481733E-5,1.7175348778909238E-5,1.6754767259342522E-5,1.6324982968743973E-5,1.5887978664420397E-5,1.5439449174009123E-5]
[null,155.07458700146137,179.1247288286259,210.1481628907357,253.66164985863884,290.85155263825595,323.90428950027336,21.06425637009735,20.793260287559121,20.242374010753235,19.679628918308094,19.105025010223695,18.518562286500032,2.3084116569969699E-5,2.2787134561708625E-5,2.2183423573428201E-5,2.1566716622803389E-5,2.0937013709834188E-5,2.0294314834520581E-5]
[null,155.07458700146137,179.1247288286259,210.1481628907357,253.66164985863884,290.85155263825595,323.90428950027336,58.840221767820353,57.983328179082029,56.255023626127887,54.507362572537133,52.740345018309696,50.953970963445649,4.0301521758781063E-5,3.9714608341837008E-5,3.8530838100087593E-5,3.7333809981189816E-5,3.6123523985143624E-5,3.4899980111949072E-5]
[null,155.07458700146137,179.1247288286259,210.1481628907357,253.66164985863884,290.85155263825595,323.90428950027336,94.532091499406604,93.107602888443424,90.240243742921351,87.348375365938224,84.431997757494074,81.494332954510327,5.1798406301044717E-5,5.1017864596407357E-5,4.9446708900230876E-5,4.7862123488185332E-5,4.6264108360270724E-5,4.4654429016170045E-5]
[null,155.07458700146137,179.1247288286259,210.1481628907357,253.66164985863884,290.85155263825595,323.90428950027336,220.61812543437301,217.14830269844285,210.18078810077634,203.17611466870196,196.13428240221967,189.05687133866573,8.0591096049086031E-5,7.9323580894408339E-5,7.6778370082475369E-5,7.4219585267105737E-5,7.1647226448299416E-5,6.9061870808645009E-5]
[null,155.07458700146137,179.1247288286259,210.1481628907357,253.66164985863884,290.85155263825595,323.90428950027336,399.67113080251329,393.25905275302665,380.39745446354874,367.48593325339806,354.52448912257461,341.51634410799988,1.0949893994589406E-4,1.0774220623370593E-4,1.0421848067494486E-4,1.006810776036707E-4,9.7129997019883453E-5,9.3566121673424623E-5]
[]
[]
[]
[null,189.86324956413722,219.28410822833914,257.21955735638238,310.39202327493928,355.79817041172225,396.11823606795463,0.51716050315104567,0.50824394275188978,0.49041082195357782,0.46366114075610998,0.43691145955864202,0.41016177836117418,2.8337561816495655E-6,2.7848983164487111E-6,2.6871825860470019E-6,2.5406089904444383E-6,2.3940353948418742E-6,2.2474617992393106E-6]
[null,189.86324956413722,219.28410822833914,257.21955735638238,310.39202327493928,355.79817041172225,396.11823606795463,2.2892495695619424,2.2697607416118819,2.229909828982175,2.1709650028963439,2.1163080529234004,2.052828943301408,6.2719166289368284E-6,6.2185225797585804E-6,6.1093419972114388E-6,5.9478493230036815E-6,5.7981042545846586E-6,5.6241888857572819E-6]
[null,189.86324956413722,219.28410822833914,257.21955735638238,310.39202327493928,355.79817041172225,396.11823606795463,6.3034418640907388,6.2379433842418086,6.1026708207498688,5.8920083643221091,5.6662634746641087,5.4254361517758616,1.1513135824823268E-5,1.1393503898158555E-5,1.1146430722830811E-5,1.0761659112917095E-5,1.0349339679751797E-5,9.9094724233349077E-6]
[null,189.86324956413722,219.28410822833914,257.21955735638238,310.39202327493928,355.79817041172225,396.11823606795463,12.385609571238206,12.230980099320041,11.917237567183101,11.435697042590698,10.933884316515028,10.410725722288712,1.6966588453750967E-5,1.6754767259342522E-5,1.6324982968743973E-5,1.5665338414507805E-5,1.4977923721253463E-5,1.4261268112724262E-5]
[null,189.86324956413722,219.28410822833914,257.21955735638238,310.39202327493928,355.79817041172225,396.11823606795463,20.519299501111085,20.242374010753235,19.679628918308094,18.813276000316772,17.920240747137125,17.003480749665755,2.2486903562861462E-5,2.2183423573428201E-5,2.1566716622803389E-5,2.0617288767470435E-5,1.9638619996862604E-5,1.863395150648302E-5]
[null,189.86324956413722,219.28410822833914,257.21955735638238,310.39202327493928,355.79817041172225,396.11823606795463,57.121595465184548,56.255023626127887,54.507362572537133,51.849577553457259,49.150598716413093,46.409698498153851,3.9124380455605856E-5,3.8530838100087593E-5,3.7333809981189816E-5,3.5513409283189903E-5,3.3664793641378834E-5,3.178746472476291E-5]
[null,189.86324956413722,219.28410822833914,257.21955735638238,310.39202327493928,355.79817041172225,396.11823606795463,91.676986969615015,90.240243742921351,87.348375365938224,82.966261887862615,78.531895896643363,74.041792331936946,5.0233965462802747E-5,4.9446708900230876E-5,4.7862123488185332E-5,4.5460965418006912E-5,4.3031175833777187E-5,4.057084511339011E-5]
[null,189.86324956413722,219.28410822833914,257.21955735638238,310.39202327493928,355.79817041172225,396.11823606795463,213.66919025391056,210.18078810077634,203.17611466870196,192.59943170607542,181.9436880040808,171.20375650278953,7.8052672238871439E-5,7.6778370082475369E-5,7.4219585267105737E-5,7.0355956787607462E-5,6.6463447672723575E-5,6.2540185023850063E-5]
[null,189.86324956413722,219.28410822833914,257.21955735638238,310.39202327493928,355.79817041172225,396.11823606795463,386.83449397337171,380.39745446354874,367.48593325339806,348.02668985829922,328.45801314933027,308.77641806614781,1.0598205314338951E-4,1.0421848067494486E-4,1.006810776036707E-4,9.5349778043369652E-5,8.9988496753241168E-5,8.4596278922232276E-5]
[]
[]
[]
[null,219.19854291255373,253.15099911325288,296.9203691225282,358.24945682881901,410.59855474089335,457.06397490511051,0.50824394275188978,0.49041082195357782,0.47257770115526593,0.43691145955864202,0.40124521796201823,0.36557897636539433,2.7848983164487111E-6,2.6871825860470019E-6,2.5894668556452927E-6,2.3940353948418742E-6,2.1986039340384562E-6,2.0031724732350374E-6]
[null,219.19854291255373,253.15099911325288,296.9203691225282,358.24945682881901,410.59855474089335,457.06397490511051,2.2697607416118819,2.229909828982175,2.1903476414623877,2.1163080529234004,2.0296373841579354,1.9309336404133666,6.2185225797585804E-6,6.1093419972114388E-6,6.0009524423627062E-6,5.7981042545846586E-6,5.5606503675559874E-6,5.2902291518174429E-6]
[null,219.19854291255373,253.15099911325288,296.9203691225282,358.24945682881901,410.59855474089335,457.06397490511051,6.2379433842418086,6.1026708207498688,5.9639050090458339,5.6662634746641087,5.3418087256508375,4.9920193440639249,1.1393503898158555E-5,1.1146430722830811E-5,1.0892977185471843E-5,1.0349339679751797E-5,9.7567282660289278E-6,9.1178435508016887E-6]
[null,219.19854291255373,253.15099911325288,296.9203691225282,358.24945682881901,410.59855474089335,457.06397490511051,12.230980099320041,11.917237567183101,11.598224425026888,10.933884316515028,10.231595997957578,9.4913594693545296,1.6754767259342522E-5,1.6324982968743973E-5,1.5887978664420397E-5,1.4977923721253463E-5,1.4015884928709011E-5,1.3001862286787027E-5]
[null,219.19854291255373,253.15099911325288,296.9203691225282,358.24945682881901,410.59855474089335,457.06397490511051,20.242374010753235,19.679628918308094,19.105025010223695,17.920240747137125,16.69219620460262,15.416813492141536,2.2183423573428201E-5,2.1566716622803389E-5,2.0937013709834188E-5,1.9638619996862604E-5,1.8292817758468624E-5,1.6895138073579764E-5]
[null,219.19854291255373,253.15099911325288,296.9203691225282,358.24945682881901,410.59855474089335,457.06397490511051,56.255023626127887,54.507362572537133,52.740345018309696,49.150598716413093,45.486261399809322,41.74513581129483,3.8530838100087593E-5,3.7333809981189816E-5,3.6123523985143624E-5,3.3664793641378834E-5,3.1154973561513233E-5,2.8592558774859472E-5]
[null,219.19854291255373,253.15099911325288,296.9203691225282,358.24945682881901,410.59855474089335,457.06397490511051,90.240243742921351,87.348375365938224,84.431997757494074,78.531895896643363,72.532705016259925,66.434425116343718,4.9446708900230876E-5,4.7862123488185332E-5,4.6264108360270724E-5,4.3031175833777187E-5,3.9743947954115028E-5,3.6402424721284226E-5]
[null,219.19854291255373,253.15099911325288,296.9203691225282,358.24945682881901,410.59855474089335,457.06397490511051,210.18078810077634,203.17611466870196,196.13428240221967,181.9436880040808,167.6050709358488,153.11678666886726,7.6778370082475369E-5,7.4219585267105737E-5,7.1647226448299416E-5,6.6463447672723575E-5,6.122559668889454E-5,5.5933072755750597E-5]
[null,219.19854291255373,253.15099911325288,296.9203691225282,358.24945682881901,410.59855474089335,457.06397490511051,380.39745446354874,367.48593325339806,354.52448912257461,328.45801314933027,302.19079339970614,275.72818075644693,1.0421848067494486E-4,1.006810776036707E-4,9.7129997019883453E-5,8.9988496753241168E-5,8.2791998191700318E-5,7.5541967330533411E-5]
[]
[]
[]
[null,268.41742117738761,309.97627979498839,363.54017779765974,438.56821577751344,502.58327088745233,559.37932781549853,0.48149426155442188,0.46366114075610998,0.42799489915948613,0.38341209716370622,0.33826712686182048,0.27751635097835353,2.6383247208461471E-6,2.5406089904444383E-6,2.3451775296410198E-6,2.1008882036367466E-6,1.8535185033524409E-6,1.5206375396074167E-6]
[null,268.41742117738761,309.97627979498839,363.54017779765974,438.56821577751344,502.58327088745233,559.37932781549853,2.2105394564122611,2.1709650028963439,2.0961642776841414,1.9823687178545588,1.8153664091871868,1.4577166121459306,6.0562724833212637E-6,5.9478493230036815E-6,5.74291582927162E-6,5.4311471722042705E-6,4.9736066005128407E-6,3.9937441428655633E-6]
[null,268.41742117738761,309.97627979498839,363.54017779765974,438.56821577751344,502.58327088745233,559.37932781549853,6.0341258278550871,5.8920083643221091,5.587663526282495,5.1695263956573738,4.6209962665448332,3.5699740901421264,1.1021234388776415E-5,1.0761659112917095E-5,1.0205778130196338E-5,9.4420573436664368E-6,8.4401758293056311E-6,6.5205006212641575E-6]
[null,268.41742117738761,309.97627979498839,363.54017779765974,438.56821577751344,502.58327088745233,559.37932781549853,11.758380044335228,11.435697042590698,10.761869881567442,9.8662212599117538,8.7146804133441567,6.6087398838378171,1.6107369923746888E-5,1.5665338414507805E-5,1.4742287508996496E-5,1.3515371588920211E-5,1.1937918374444051E-5,9.0530683340244076E-6]
[null,268.41742117738761,309.97627979498839,363.54017779765974,438.56821577751344,502.58327088745233,559.37932781549853,19.3938093162208,18.813276000316772,17.616976480129441,16.060553754813789,14.093039528146758,10.574342930586536,2.1253489661611837E-5,2.0617288767470435E-5,1.9306275594662401E-5,1.7600606854590455E-5,1.5444426880160831E-5,1.158832101982086E-5]
[null,268.41742117738761,309.97627979498839,363.54017779765974,438.56821577751344,502.58327088745233,559.37932781549853,53.626273358002976,51.849577553457259,48.241867156455747,43.624681664733068,37.927453411481125,28.036951785561325,3.6730324217810255E-5,3.5513409283189903E-5,3.3042374764695717E-5,2.9879918948447305E-5,2.5977707816082963E-5,1.9203391633946114E-5]
[null,268.41742117738761,309.97627979498839,363.54017779765974,438.56821577751344,502.58327088745233,559.37932781549853,85.893250215648806,82.966261887862615,77.041387772128701,69.495951193743451,60.237056196894819,44.314418859140552,4.7064794638711673E-5,4.5460965418006912E-5,4.2214459053221203E-5,3.8079973256845727E-5,3.3006606135284836E-5,2.4281873347474275E-5]
[null,268.41742117738761,309.97627979498839,363.54017779765974,438.56821577751344,502.58327088745233,559.37932781549853,199.65984338976182,192.59943170607542,178.37306503690559,160.37963720220174,138.48142433994803,101.24313665149978,7.2935102608132174E-5,7.0355956787607462E-5,6.5159110515764594E-5,5.8586168840986932E-5,5.0586821676693347E-5,3.6983794210593526E-5]
[null,268.41742117738761,309.97627979498839,363.54017779765974,438.56821577751344,502.58327088745233,559.37932781549853,361.01145155307051,348.02668985829922,321.91002794095976,288.98418583112465,249.0664486328933,181.52634031503183,9.8907247000841242E-5,9.5349778043369652E-5,8.8194528203002675E-5,7.9173749542773872E-5,6.8237383187094052E-5,4.9733243921926528E-5]
[]
[]
[]
[null,309.91583360733841,357.88989468644019,419.71571305613611,506.30199763714336,580.16312380833665,645.68105433703545,0.46366114075610998,0.43691145955864202,0.39232865756286223,0.33163992928404229,0,0,2.5406089904444383E-6,2.3940353948418742E-6,2.1497460688376014E-6,1.8172050919673549E-6,0,0]
[null,309.91583360733841,357.88989468644019,419.71571305613611,506.30199763714336,580.16312380833665,645.68105433703545,2.1709650028963439,2.1163080529234004,2.0064790949482925,1.7845295621418458,0,0,5.9478493230036815E-6,5.7981042545846586E-6,5.4972029998583358E-6,4.8891220880598513E-6,0,0]
[null,309.91583360733841,357.88989468644019,419.71571305613611,506.30199763714336,580.16312380833665,645.68105433703545,5.8920083643221091,5.6662634746641087,5.256505473611341,4.5237934413003416,0,0,1.0761659112917095E-5,1.0349339679751797E-5,9.6009232394727697E-6,8.2626364224663777E-6,0,0]
[null,309.91583360733841,357.88989468644019,419.71571305613611,506.30199763714336,580.16312380833665,645.68105433703545,11.435697042590698,10.933884316515028,10.050094510498589,8.5149743919885967,0,0,1.5665338414507805E-5,1.4977923721253463E-5,1.3767252754107656E-5,1.1664348482176161E-5,0,0]
[null,309.91583360733841,357.88989468644019,419.71571305613611,506.30199763714336,580.16312380833665,645.68105433703545,18.813276000316772,17.920240747137125,16.377887206318636,13.754534904095918,0,0,2.0617288767470435E-5,1.9638619996862604E-5,1.7948369541171109E-5,1.5073462908598266E-5,0,0]
[null,309.91583360733841,357.88989468644019,419.71571305613611,506.30199763714336,580.16312380833665,645.68105433703545,51.849577553457259,49.150598716413093,44.557922455335735,36.960646684493959,0,0,3.5513409283189903E-5,3.3664793641378834E-5,3.0519124969408035E-5,2.5315511427735587E-5,0,0]
[null,309.91583360733841,357.88989468644019,419.71571305613611,506.30199763714336,580.16312380833665,645.68105433703545,82.966261887862615,78.531895896643363,71.01742463686206,58.672231307730598,0,0,4.5460965418006912E-5,4.3031175833777187E-5,3.8913657335266885E-5,3.2149167839852381E-5,0,0]
[null,309.91583360733841,357.88989468644019,419.71571305613611,506.30199763714336,580.16312380833665,645.68105433703545,192.59943170607542,181.9436880040808,163.99703116898615,134.79931538553123,0,0,7.0355956787607462E-5,6.6463447672723575E-5,5.9907591294606811E-5,4.9241759044942912E-5,0,0]
[null,309.91583360733841,357.88989468644019,419.71571305613611,506.30199763714336,580.16312380833665,645.68105433703545,348.02668985829922,328.45801314933027,295.59379067821226,242.3693806731128,0,0,9.5349778043369652E-5,8.9988496753241168E-5,8.0984600185811582E-5,6.6402570047428158E-5,0,0]
[]
[]
[]
[null,195.3665174016605,206.06903044567991,221.20195753445324,244.46710591330134,265.83982551408434,285.74715118473046,0.51716050315104567,0.50824394275188978,0.50824394275188978,0.49041082195357782,0.48149426155442188,0.47257770115526593,2.8337561816495655E-6,2.7848983164487111E-6,2.7848983164487111E-6,2.6871825860470019E-6,2.6383247208461471E-6,2.5894668556452927E-6]
[null,195.3665174016605,206.06903044567991,221.20195753445324,244.46710591330134,265.83982551408434,285.74715118473046,2.2892495695619424,2.2697607416118819,2.2697607416118819,2.229909828982175,2.2105394564122611,2.1903476414623877,6.2719166289368284E-6,6.2185225797585804E-6,6.2185225797585804E-6,6.1093419972114388E-6,6.0562724833212637E-6,6.0009524423627062E-6]
[null,195.3665174016605,206.06903044567991,221.20195753445324,244.46710591330134,265.83982551408434,285.74715118473046,6.3034418640907388,6.2379433842418086,6.2379433842418086,6.1026708207498688,6.0341258278550871,5.9639050090458339,1.1513135824823268E-5,1.1393503898158555E-5,1.1393503898158555E-5,1.1146430722830811E-5,1.1021234388776415E-5,1.0892977185471843E-5]
[null,195.3665174016605,206.06903044567991,221.20195753445324,244.46710591330134,265.83982551408434,285.74715118473046,12.385609571238206,12.230980099320041,12.230980099320041,11.917237567183101,11.758380044335228,11.598224425026888,1.6966588453750967E-5,1.6754767259342522E-5,1.6754767259342522E-5,1.6324982968743973E-5,1.6107369923746888E-5,1.5887978664420397E-5]
[null,195.3665174016605,206.06903044567991,221.20195753445324,244.46710591330134,265.83982551408434,285.74715118473046,20.519299501111085,20.242374010753235,20.242374010753235,19.679628918308094,19.3938093162208,19.105025010223695,2.2486903562861462E-5,2.2183423573428201E-5,2.2183423573428201E-5,2.1566716622803389E-5,2.1253489661611837E-5,2.0937013709834188E-5]
[null,195.3665174016605,206.06903044567991,221.20195753445324,244.46710591330134,265.83982551408434,285.74715118473046,57.121595465184548,56.255023626127887,56.255023626127887,54.507362572537133,53.626273358002976,52.740345018309696,3.9124380455605856E-5,3.8530838100087593E-5,3.8530838100087593E-5,3.7333809981189816E-5,3.6730324217810255E-5,3.6123523985143624E-5]
[null,195.3665174016605,206.06903044567991,221.20195753445324,244.46710591330134,265.83982551408434,285.74715118473046,91.676986969615015,90.240243742921351,90.240243742921351,87.348375365938224,85.893250215648806,84.431997757494074,5.0233965462802747E-5,4.9446708900230876E-5,4.9446708900230876E-5,4.7862123488185332E-5,4.7064794638711673E-5,4.6264108360270724E-5]
[null,195.3665174016605,206.06903044567991,221.20195753445324,244.46710591330134,265.83982551408434,285.74715118473046,213.66919025391056,210.18078810077634,210.18078810077634,203.17611466870196,199.65984338976182,196.13428240221967,7.8052672238871439E-5,7.6778370082475369E-5,7.6778370082475369E-5,7.4219585267105737E-5,7.2935102608132174E-5,7.1647226448299416E-5]
[null,195.3665174016605,206.06903044567991,221.20195753445324,244.46710591330134,265.83982551408434,285.74715118473046,386.83449397337171,380.39745446354874,380.39745446354874,367.48593325339806,361.01145155307051,354.52448912257461,1.0598205314338951E-4,1.0421848067494486E-4,1.0421848067494486E-4,1.006810776036707E-4,9.8907247000841242E-5,9.7129997019883453E-5]
[]
[]
[]
[null,272.3307699100888,287.1565929780698,308.09390154956077,340.21873981021304,369.65581294506899,397.00415916715019,0.48149426155442188,0.47257770115526593,0.46366114075610998,0.44582801995779803,0.42799489915948613,0.41016177836117418,2.6383247208461471E-6,2.5894668556452927E-6,2.5406089904444383E-6,2.4428932600427291E-6,2.3451775296410198E-6,2.2474617992393106E-6]
[null,272.3307699100888,287.1565929780698,308.09390154956077,340.21873981021304,369.65581294506899,397.00415916715019,2.2105394564122611,2.1903476414623877,2.1709650028963439,2.1354359001945884,2.0961642776841414,2.052828943301408,6.0562724833212637E-6,6.0009524423627062E-6,5.9478493230036815E-6,5.8505093156016121E-6,5.74291582927162E-6,5.6241888857572819E-6]
[null,272.3307699100888,287.1565929780698,308.09390154956077,340.21873981021304,369.65581294506899,397.00415916715019,6.0341258278550871,5.9639050090458339,5.8920083643221091,5.7431875971312456,5.587663526282495,5.4254361517758616,1.1021234388776415E-5,1.0892977185471843E-5,1.0761659112917095E-5,1.048984036005707E-5,1.0205778130196338E-5,9.9094724233349077E-6]
[null,272.3307699100888,287.1565929780698,308.09390154956077,340.21873981021304,369.65581294506899,397.00415916715019,11.758380044335228,11.598224425026888,11.435697042590698,11.103526988334769,10.761869881567442,10.410725722288712,1.6107369923746888E-5,1.5887978664420397E-5,1.5665338414507805E-5,1.5210310942924341E-5,1.4742287508996496E-5,1.4261268112724262E-5]
[null,272.3307699100888,287.1565929780698,308.09390154956077,340.21873981021304,369.65581294506899,397.00415916715019,19.3938093162208,19.105025010223695,18.813276000316772,18.220883868773491,17.616976480129441,17.003480749665755,2.1253489661611837E-5,2.0937013709834188E-5,2.0617288767470435E-5,1.9968091910984648E-5,1.9306275594662401E-5,1.863395150648302E-5]
[null,272.3307699100888,287.1565929780698,308.09390154956077,340.21873981021304,369.65581294506899,397.00415916715019,53.626273358002976,52.740345018309696,51.849577553457259,50.054428430241394,48.241867156455747,46.409698498153851,3.6730324217810255E-5,3.6123523985143624E-5,3.5513409283189903E-5,3.4283855089206436E-5,3.3042374764695717E-5,3.178746472476291E-5]
[null,272.3307699100888,287.1565929780698,308.09390154956077,340.21873981021304,369.65581294506899,397.00415916715019,85.893250215648806,84.431997757494074,82.966261887862615,80.016210957437238,77.041387772128701,74.041792331936946,4.7064794638711673E-5,4.6264108360270724E-5,4.5460965418006912E-5,4.384449915476013E-5,4.2214459053221203E-5,4.057084511339011E-5]
[null,272.3307699100888,287.1565929780698,308.09390154956077,340.21873981021304,369.65581294506899,397.00415916715019,199.65984338976182,196.13428240221967,192.59943170607542,185.50495677133421,178.37306503690559,171.20375650278953,7.2935102608132174E-5,7.1647226448299416E-5,7.0355956787607462E-5,6.7764367770350398E-5,6.5159110515764594E-5,6.2540185023850063E-5]
[null,272.3307699100888,287.1565929780698,308.09390154956077,340.21873981021304,369.65581294506899,397.00415916715019,361.01145155307051,354.52448912257461,348.02668985829922,334.993451871677,321.91002794095976,308.77641806614781,9.8907247000841242E-5,9.7129997019883453E-5,9.5349778043369652E-5,9.1779027910048489E-5,8.8194528203002675E-5,8.4596278922232276E-5]
[]
[]
[]
[null,331.90759961455291,349.93857434426195,375.39175182826477,414.41958171116039,450.15207091372042,483.32103979194829,0.44582801995779803,0.43691145955864202,0.41907833876033013,0.40124521796201823,0.37449553676455039,0.35107539382826131,2.4428932600427291E-6,2.3940353948418742E-6,2.296319664440165E-6,2.1986039340384562E-6,2.0520303384358926E-6,1.9237007881000619E-6]
[null,331.90759961455291,349.93857434426195,375.39175182826477,414.41958171116039,450.15207091372042,483.32103979194829,2.1354359001945884,2.1163080529234004,2.0750045744768104,2.0296373841579354,1.9571868996762494,1.8752127986338794,5.8505093156016121E-6,5.7981042545846586E-6,5.6849440396624939E-6,5.5606503675559874E-6,5.3621558895239708E-6,5.1375693113256968E-6]
[null,331.90759961455291,349.93857434426195,375.39175182826477,414.41958171116039,450.15207091372042,483.32103979194829,5.7431875971312456,5.6662634746641087,5.5073877519864141,5.3418087256508375,5.0812903060072871,4.8100654499961522,1.048984036005707E-5,1.0349339679751797E-5,1.0059155711390711E-5,9.7567282660289278E-6,9.2808955360863688E-6,8.7855076712258482E-6]
[null,331.90759961455291,349.93857434426195,375.39175182826477,414.41958171116039,450.15207091372042,483.32103979194829,11.103526988334769,10.933884316515028,10.587483683492003,10.231595997957578,9.6799762461970662,9.1070106262859092,1.5210310942924341E-5,1.4977923721253463E-5,1.4503402306153429E-5,1.4015884928709011E-5,1.3260241433146667E-5,1.2475357022309465E-5]
[null,331.90759961455291,349.93857434426195,375.39175182826477,414.41958171116039,450.15207091372042,483.32103979194829,18.220883868773491,17.920240747137125,17.311740841508023,16.69219620460262,15.740195850088089,14.760975416585861,1.9968091910984648E-5,1.9638619996862604E-5,1.8971770785214272E-5,1.8292817758468624E-5,1.7249529698726671E-5,1.6176411415436558E-5]
[null,331.90759961455291,349.93857434426195,375.39175182826477,414.41958171116039,450.15207091372042,483.32103979194829,50.054428430241394,49.150598716413093,47.328233750369321,45.486261399809322,42.687170284214531,39.846203513014956,3.4283855089206436E-5,3.3664793641378834E-5,3.2416598459157071E-5,3.1154973561513233E-5,2.9237787865900363E-5,2.7291920214393807E-5]
[null,331.90759961455291,349.93857434426195,375.39175182826477,414.41958171116039,450.15207091372042,483.32103979194829,80.016210957437238,78.531895896643363,75.544686583893224,72.532705016259925,67.968284686903971,63.348126784060881,4.384449915476013E-5,4.3031175833777187E-5,4.1394348813092177E-5,3.9743947954115028E-5,3.7242895718851494E-5,3.4711302347430621E-5]
[null,331.90759961455291,349.93857434426195,375.39175182826477,414.41958171116039,450.15207091372042,483.32103979194829,185.50495677133421,181.9436880040808,174.79308786980852,167.6050709358488,156.7528890354954,145.81743169834104,6.7764367770350398E-5,6.6463447672723575E-5,6.3851356299473428E-5,6.122559668889454E-5,5.7261329328034847E-5,5.3266641716288961E-5]
[null,331.90759961455291,349.93857434426195,375.39175182826477,414.41958171116039,450.15207091372042,483.32103979194829,334.993451871677,328.45801314933027,315.34949624656576,302.19079339970614,282.36197885844325,262.42262263778366,9.1779027910048489E-5,8.9988496753241168E-5,8.6397122259333089E-5,8.2791998191700318E-5,7.7359446262587189E-5,7.1896608941858544E-5]
[]
[]
[]
[null,382.31129589992406,403.05833439905706,432.33955196823223,477.22211611341089,518.2977700864426,556.41050763243379,0.41907833876033013,0.40124521796201823,0.38341209716370622,0.35107539382826131,0.32486402230989214,0.28256430471582189,2.296319664440165E-6,2.1986039340384562E-6,2.1008882036367466E-6,1.9237007881000619E-6,1.7800768345747514E-6,1.5482975600866952E-6]
[null,382.31129589992406,403.05833439905706,432.33955196823223,477.22211611341089,518.2977700864426,556.41050763243379,2.0750045744768104,2.0296373841579354,1.9823687178545588,1.8752127986338794,1.7525754978201904,1.4978871930737323,5.6849440396624939E-6,5.5606503675559874E-6,5.4311471722042705E-6,5.1375693113256968E-6,4.8015767063566863E-6,4.10380052896913E-6]
[null,382.31129589992406,403.05833439905706,432.33955196823223,477.22211611341089,518.2977700864426,556.41050763243379,5.5073877519864141,5.3418087256508375,5.1695263956573738,4.8100654499961522,4.4248117937099654,3.6827623951377553,1.0059155711390711E-5,9.7567282660289278E-6,9.4420573436664368E-6,8.7855076712258482E-6,8.0818480250410323E-6,6.7265066577858541E-6]
[null,382.31129589992406,403.05833439905706,432.33955196823223,477.22211611341089,518.2977700864426,556.41050763243379,10.587483683492003,10.231595997957578,9.8662212599117538,9.1070106262859092,8.312848808056355,6.8302219683835252,1.4503402306153429E-5,1.4015884928709011E-5,1.3515371588920211E-5,1.2475357022309465E-5,1.1387464120625144E-5,9.3564684498404451E-6]
[null,382.31129589992406,403.05833439905706,432.33955196823223,477.22211611341089,518.2977700864426,556.41050763243379,17.311740841508023,16.69219620460262,16.060553754813789,14.760975416585861,13.413005826824227,10.939656027260117,1.8971770785214272E-5,1.8292817758468624E-5,1.7600606854590455E-5,1.6176411415436558E-5,1.4699184467752577E-5,1.1988664139463142E-5]
[null,382.31129589992406,403.05833439905706,432.33955196823223,477.22211611341089,518.2977700864426,556.41050763243379,47.328233750369321,45.486261399809322,43.624681664733068,39.846203513014956,35.988885506693315,29.047922067274591,3.2416598459157071E-5,3.1154973561513233E-5,2.9879918948447305E-5,2.7291920214393807E-5,2.4649921579926928E-5,1.9895837032379859E-5]
[null,382.31129589992406,403.05833439905706,432.33955196823223,477.22211611341089,518.2977700864426,556.41050763243379,75.544686583893224,72.532705016259925,69.495951193743451,63.348126784060881,57.101213354845598,45.934594373872791,4.1394348813092177E-5,3.9743947954115028E-5,3.8079973256845727E-5,3.4711302347430621E-5,3.1288336084846906E-5,2.516964075280701E-5]
[null,382.31129589992406,403.05833439905706,432.33955196823223,477.22211611341089,518.2977700864426,556.41050763243379,174.79308786980852,167.6050709358488,160.37963720220174,145.81743169834104,131.107802914301,105.00906767778343,6.3851356299473428E-5,6.122559668889454E-5,5.8586168840986932E-5,5.3266641716288961E-5,4.7893261338557447E-5,3.8359476777272485E-5]
[null,382.31129589992406,403.05833439905706,432.33955196823223,477.22211611341089,518.2977700864426,556.41050763243379,315.34949624656576,302.19079339970614,288.98418583112465,262.42262263778366,235.65965874177553,188.33729401882374,8.6397122259333089E-5,8.2791998191700318E-5,7.9173749542773872E-5,7.1896608941858544E-5,6.4564290066239868E-5,5.1599258635294176E-5]
[]
[]
[]
[null,467.07722301023932,492.3971617608716,528.12492094208733,582.87067288550122,632.9519564838979,679.4011968819085,0.357764556815867,0.34474561504322682,0.31153606753296065,0,0,0,1.9603537359773535E-6,1.88901706873001E-6,1.7070469453860857E-6,0,0,0]
[null,467.07722301023932,492.3971617608716,528.12492094208733,582.87067288550122,632.9519564838979,679.4011968819085,1.9036089400659102,1.8457452161172747,1.6853157173479365,0,0,0,5.2153669590846857E-6,5.0568362085404787E-6,4.6173033351998258E-6,0,0,0]
[null,467.07722301023932,492.3971617608716,528.12492094208733,582.87067288550122,632.9519564838979,679.4011968819085,4.9019318082029812,4.7164202694434367,4.2215120314915495,0,0,0,8.9533001063068153E-6,8.614466245558789E-6,7.7105242584320535E-6,0,0,0]
[null,467.07722301023932,492.3971617608716,528.12492094208733,582.87067288550122,632.9519564838979,679.4011968819085,9.3003709293841474,8.9119668721230312,7.9013389524618214,0,0,0,1.2740234149841297E-5,1.220817379742881E-5,1.0823751989673728E-5,0,0,0]
[null,467.07722301023932,492.3971617608716,528.12492094208733,582.87067288550122,632.9519564838979,679.4011968819085,15.090406680974123,14.428519698976734,12.720874312618276,0,0,0,1.6537431979149724E-5,1.5812076382440256E-5,1.394068417821181E-5,0,0,0]
[null,467.07722301023932,492.3971617608716,528.12492094208733,582.87067288550122,632.9519564838979,679.4011968819085,40.798146887561643,38.889305687654776,34.030499798651547,0,0,0,2.794393622435729E-5,2.6636510744969023E-5,2.3308561505925718E-5,0,0,0]
[null,467.07722301023932,492.3971617608716,528.12492094208733,582.87067288550122,632.9519564838979,679.4011968819085,64.894372482062693,61.79568802233824,53.941931078523517,0,0,0,3.5558560264143944E-5,3.3860650971144242E-5,2.9557222508780009E-5,0,0,0]
[null,467.07722301023932,492.3971617608716,528.12492094208733,582.87067288550122,632.9519564838979,679.4011968819085,149.47133010231727,142.15412977755125,123.69721423140209,0,0,0,5.4601399124134162E-5,5.1928449233808676E-5,4.5186196979507613E-5,0,0,0]
[null,467.07722301023932,492.3971617608716,528.12492094208733,582.87067288550122,632.9519564838979,679.4011968819085,269.08172868289375,255.75086262111691,222.20225296443056,0,0,0,7.3721021556957196E-5,7.006872948523751E-5,6.0877329579296045E-5,0,0,0]
[]
[]
[]
[null,538.66562759317935,567.85064587946215,609.02796906800779,672.11365246094533,729.81221962082964,783.31509859310927,0.29928554615907316,0.26272637639963631,0,0,0,0,1.6399208008716338E-6,1.4395965830117057E-6,0,0,0,0]
[null,538.66562759317935,567.85064587946215,609.02796906800779,672.11365246094533,729.81221962082964,783.31509859310927,1.6135870677704256,1.3304846082811264,0,0,0,0,4.4207864870422617E-6,3.6451633103592503E-6,0,0,0,0]
[null,538.66562759317935,567.85064587946215,609.02796906800779,672.11365246094533,729.81221962082964,783.31509859310927,4.011096979889583,3.2207211435601626,0,0,0,0,7.3262045294786906E-6,5.8825956960002972E-6,0,0,0,0]
[null,538.66562759317935,567.85064587946215,609.02796906800779,672.11365246094533,729.81221962082964,783.31509859310927,7.4801508465605542,5.930397192342582,0,0,0,0,1.0246781981589801E-5,8.1238317703323045E-6,0,0,0,0]
[null,538.66562759317935,567.85064587946215,609.02796906800779,672.11365246094533,729.81221962082964,783.31509859310927,12.01721339431861,9.4611066892199194,0,0,0,0,1.3169548925280668E-5,1.0368336097775255E-5,0,0,0,0]
[null,538.66562759317935,567.85064587946215,609.02796906800779,672.11365246094533,729.81221962082964,783.31509859310927,32.05229628735583,24.974107863317062,0,0,0,0,2.1953627594079334E-5,1.7105553331039082E-5,0,0,0,0]
[null,538.66562759317935,567.85064587946215,609.02796906800779,672.11365246094533,729.81221962082964,783.31509859310927,50.757704570465314,39.417560938956008,0,0,0,0,2.7812440860528941E-5,2.1598663528195074E-5,0,0,0,0]
[null,538.66562759317935,567.85064587946215,609.02796906800779,672.11365246094533,729.81221962082964,783.31509859310927,116.2499559708545,89.888438786868889,0,0,0,0,4.2465737340951419E-5,3.2835959374198681E-5,0,0,0,0]
[null,538.66562759317935,567.85064587946215,609.02796906800779,672.11365246094533,729.81221962082964,783.31509859310927,208.69423130085829,161.01755537431544,0,0,0,0,5.7176501726262542E-5,4.4114398732689158E-5,0,0,0,0]
[]
[]
[]
[null,189.86324956413722,219.28410822833914,257.21955735638238,310.39202327493928,355.79817041172225,396.11823606795463,98.523023484925503,96.933670495923664,93.740063845308626,88.914422047378082,84.046157874507472,79.134181018916934,3.969501349110616E-5,3.9054661763063512E-5,3.7767954812775427E-5,3.5823699455027425E-5,3.3862271504636362E-5,3.1883231675631315E-5]
[null,189.86324956413722,219.28410822833914,257.21955735638238,310.39202327493928,355.79817041172225,396.11823606795463,162.7481795278193,160.07776836522828,154.71726123894194,146.62697887873253,138.4772705135874,130.2681361435065,5.2457108631045703E-5,5.1596379811515963E-5,4.9868577353405947E-5,4.7260911806199044E-5,4.4634092026941948E-5,4.1988118015634651E-5]
[null,189.86324956413722,219.28410822833914,257.21955735638238,310.39202327493928,355.79817041172225,396.11823606795463,247.04828594132022,242.94545799727354,234.71501434013754,222.30737943182709,209.82538121638891,197.26901969382288,6.6357315589932905E-5,6.5255293579713543E-5,6.3044591549862359E-5,5.9711893481554413E-5,5.6359221385009107E-5,5.2986575260226401E-5]
[null,189.86324956413722,219.28410822833914,257.21955735638238,310.39202327493928,355.79817041172225,396.11823606795463,354.09204795504945,348.16181538033499,336.27114573617604,318.35963003311269,300.35750084585976,282.26475817441695,8.1522285703936796E-5,8.0156973726334748E-5,7.7419395818159552E-5,7.3295644073469019E-5,6.9151030469865267E-5,6.4985555007348214E-5]
[null,189.86324956413722,219.28410822833914,257.21955735638238,310.39202327493928,355.79817041172225,396.11823606795463,489.41698786510284,481.16882211093082,464.63626590356927,439.74686984498322,414.74879968934488,389.64205543665383,9.8593269110616992E-5,9.6931672463926419E-5,9.3601181688873731E-5,8.8587201822115861E-5,8.3551329510343436E-5,7.8493564753556361E-5]
[null,189.86324956413722,219.28410822833914,257.21955735638238,310.39202327493928,355.79817041172225,396.11823606795463,959.60257636364599,943.27397770223126,910.56250885183943,861.35962675734663,811.99393008016807,762.46541882030328,1.5464989143652635E-4,1.520183686869027E-4,1.4674657676903133E-4,1.3881702284566425E-4,1.3086122966642514E-4,1.2287919723131399E-4]
[null,189.86324956413722,219.28410822833914,257.21955735638238,310.39202327493928,355.79817041172225,396.11823606795463,2938.2776878487844,2887.8528640327786,2786.882797734721,2635.1266516225201,2483.0092495121808,2330.5305914037035,3.9461156162352731E-4,3.8783949288648652E-4,3.7427918314997596E-4,3.5389828788913777E-4,3.3346887584101274E-4,3.1299094700560081E-4]
[null,189.86324956413722,219.28410822833914,257.21955735638238,310.39202327493928,355.79817041172225,396.11823606795463,27579.281942346715,27102.920847820853,26149.396591937588,24717.105041033887,23282.407289635597,21845.303337742735,2.9631245707597864E-3,2.9119442221671606E-3,2.8094973507319454E-3,2.6556116079542178E-3,2.5014673424266012E-3,2.347064554149098E-3]
[null,189.86324956413722,219.28410822833914,257.21955735638238,310.39202327493928,355.79817041172225,396.11823606795463,94588.461989874457,92951.379736140094,89674.81903783101,84753.987513266853,79825.967416181942,74890.758746576277,8.468838928272401E-3,8.322265174692459E-3,8.0289031281073498E-3,7.5883237096666519E-3,7.1471006729503022E-3,6.7052340179583007E-3]
[]
[]
[]
[null,219.19854291255373,253.15099911325288,296.9203691225282,358.24945682881901,410.59855474089335,457.06397490511051,96.933670495923664,93.740063845308626,90.527639958162368,84.046157874507472,77.487350467284628,70.849252440599358,3.9054661763063512E-5,3.7767954812775427E-5,3.6473666381209648E-5,3.3862271504636362E-5,3.121972218665778E-5,2.8545226607816013E-5]
[null,219.19854291255373,253.15099911325288,296.9203691225282,358.24945682881901,410.59855474089335,457.06397490511051,160.07776836522828,154.71726123894194,149.33034255490634,138.4772705135874,127.51855224127154,116.45418773795878,5.1596379811515963E-5,4.9868577353405947E-5,4.8132261903273597E-5,4.4634092026941948E-5,4.1101870182521043E-5,3.7535596370010889E-5]
[null,219.19854291255373,253.15099911325288,296.9203691225282,358.24945682881901,410.59855474089335,457.06397490511051,242.94545799727354,234.71501434013754,226.45152032427811,209.82538121638891,193.06704067360582,176.17649869592893,6.5255293579713543E-5,6.3044591549862359E-5,6.0825012174127884E-5,5.6359221385009107E-5,5.1857921212357192E-5,4.7321111656172152E-5]
[null,219.19854291255373,253.15099911325288,296.9203691225282,358.24945682881901,410.59855474089335,457.06397490511051,348.16181538033499,336.27114573617604,324.34020343237711,300.35750084585976,276.21370762078271,251.90882375714611,8.0156973726334748E-5,7.7419395818159552E-5,7.4672545972689563E-5,6.9151030469865267E-5,6.3592427217861792E-5,5.7996736216679198E-5]
[null,219.19854291255373,253.15099911325288,296.9203691225282,358.24945682881901,410.59855474089335,457.06397490511051,481.16882211093082,464.63626590356927,448.05541009751784,414.74879968934488,381.24899088641195,347.55598368871932,9.6931672463926419E-5,9.3601181688873731E-5,9.0260960938259011E-5,8.3551329510343436E-5,7.6802778180179665E-5,7.0015306947767781E-5]
[null,219.19854291255373,253.15099911325288,296.9203691225282,358.24945682881901,410.59855474089335,457.06397490511051,943.27397770223126,910.56250885183943,877.77867796469843,811.99393008016807,745.91973404864041,679.55608987011499,1.520183686869027E-4,1.4674657676903133E-4,1.4146312295966132E-4,1.3086122966642514E-4,1.2021268880719426E-4,1.0951750038196857E-4]
[null,219.19854291255373,253.15099911325288,296.9203691225282,358.24945682881901,410.59855474089335,457.06397490511051,2887.8528640327786,2786.882797734721,2685.7521732152686,2483.0092495121808,2279.6240929235141,2075.5967034492687,3.8783949288648652E-4,3.7427918314997596E-4,3.6069731039689346E-4,3.3346887584101274E-4,3.061541892188442E-4,2.7875325053038796E-4]
[null,219.19854291255373,253.15099911325288,296.9203691225282,358.24945682881901,410.59855474089335,457.06397490511051,27102.920847820853,26149.396591937588,25194.802913612293,23282.407289635597,21365.733975890758,19444.782972377772,2.9119442221671606E-3,2.8094973507319454E-3,2.7069355802967808E-3,2.5014673424266012E-3,2.2955395085566214E-3,2.0891520786868404E-3]
[null,219.19854291255373,253.15099911325288,296.9203691225282,358.24945682881901,410.59855474089335,457.06397490511051,92951.379736140094,89674.81903783101,86395.063418401696,79825.967416181942,73244.091729480875,66649.436358298452,8.322265174692459E-3,8.0289031281073498E-3,7.7352550289552947E-3,7.1471006729503022E-3,6.5578021066774878E-3,5.9673593301368469E-3]
[]
[]
[]
[null,245.04684373780108,282.99356340461156,331.90596481894551,400.42768390951011,458.90135109625987,510.78972720804586,93.740063845308626,90.527639958162368,85.673536076314093,79.134181018916934,70.849252440599358,62.437384311891272,3.7767954812775427E-5,3.6473666381209648E-5,3.4517943624622913E-5,3.1883231675631315E-5,2.8545226607816013E-5,2.515607748263145E-5]
[null,245.04684373780108,282.99356340461156,331.90596481894551,400.42768390951011,458.90135109625987,510.78972720804586,154.71726123894194,149.33034255490634,141.20044285807313,130.2681361435065,116.45418773795878,102.47516709647842,4.9868577353405947E-5,4.8132261903273597E-5,4.5511826868033243E-5,4.1988118015634651E-5,3.7535596370010889E-5,3.3029868524247678E-5]
[null,245.04684373780108,282.99356340461156,331.90596481894551,400.42768390951011,458.90135109625987,510.78972720804586,234.71501434013754,226.45152032427811,213.99430987788247,197.26901969382288,176.17649869592893,154.87741295601333,6.3044591549862359E-5,6.0825012174127884E-5,5.7478998086995025E-5,5.2986575260226401E-5,4.7321111656172152E-5,4.1600164640347391E-5]
[null,245.04684373780108,282.99356340461156,331.90596481894551,400.42768390951011,458.90135109625987,510.78972720804586,336.27114573617604,324.34020343237711,306.36827873985402,282.26475817441695,251.90882375714611,221.30118521712575,7.7419395818159552E-5,7.4672545972689563E-5,7.0534886322056871E-5,6.4985555007348214E-5,5.7996736216679198E-5,5.094996781791775E-5]
[null,245.04684373780108,282.99356340461156,331.90596481894551,400.42768390951011,458.90135109625987,510.78972720804586,464.63626590356927,448.05541009751784,423.09356464089672,389.64205543665383,347.55598368871932,305.16803944897242,9.3601181688873731E-5,9.0260960938259011E-5,8.523238610815806E-5,7.8493564753556361E-5,7.0015306947767781E-5,6.1476236794716436E-5]
[null,245.04684373780108,282.99356340461156,331.90596481894551,400.42768390951011,458.90135109625987,510.78972720804586,910.56250885183943,877.77867796469843,828.46725281508168,762.46541882030328,679.55608987011499,596.19449819024317,1.4674657676903133E-4,1.4146312295966132E-4,1.3351607619904621E-4,1.2287919723131399E-4,1.0951750038196857E-4,9.6082916710756356E-5]
[null,245.04684373780108,282.99356340461156,331.90596481894551,400.42768390951011,458.90135109625987,510.78972720804586,2786.882797734721,2685.7521732152686,2533.7551897709759,2330.5305914037035,2075.5967034492687,1819.6593266111174,3.7427918314997596E-4,3.6069731039689346E-4,3.4028407061119739E-4,3.1299094700560081E-4,2.7875325053038796E-4,2.443807852016005E-4]
[null,245.04684373780108,282.99356340461156,331.90596481894551,400.42768390951011,458.90135109625987,510.78972720804586,26149.396591937588,25194.802913612293,23760.907229045537,21845.303337742735,19444.782972377772,17037.578716750086,2.8094973507319454E-3,2.7069355802967808E-3,2.552877489019128E-3,2.347064554149098E-3,2.0891520786868404E-3,1.8305214844748948E-3]
[null,245.04684373780108,282.99356340461156,331.90596481894551,400.42768390951011,458.90135109625987,510.78972720804586,89674.81903783101,86395.063418401696,81469.439512157012,74890.758746576277,66649.436358298452,58388.145713018515,8.0289031281073498E-3,7.7352550289552947E-3,7.2942465316641596E-3,6.7052340179583007E-3,5.9673593301368469E-3,5.227696813771914E-3]
[]
[]
[]
[null,268.41742117738761,309.97627979498839,363.54017779765974,438.56821577751344,502.58327088745233,559.37932781549853,92.135851372987588,88.914422047378082,82.413736110440865,74.178456617973225,64.12991310166413,46.976134013232588,3.71216161857323E-5,3.5823699455027425E-5,3.3204567328944744E-5,2.9886565921826435E-5,2.5837998832257904E-5,1.892672603272868E-5]
[null,268.41742117738761,309.97627979498839,363.54017779765974,438.56821577751344,502.58327088745233,559.37932781549853,152.02710334164283,146.62697887873253,135.74749527966441,121.99957576848981,105.28417700364909,76.896947907263282,4.9001483752342574E-5,4.7260911806199044E-5,4.3754228937845096E-5,3.9322989772277132E-5,3.3935270589411473E-5,2.4785478777522413E-5]
[null,268.41742117738761,309.97627979498839,363.54017779765974,438.56821577751344,502.58327088745233,559.37932781549853,230.58739862704826,222.30737943182709,205.64818996521441,184.63829486412908,159.15375528335821,116.01851547427103,6.1935911530230524E-5,5.9711893481554413E-5,5.5237225346552352E-5,4.9593955107206307E-5,4.2748792716453994E-5,3.1162641814201189E-5]
[null,268.41742117738761,309.97627979498839,363.54017779765974,438.56821577751344,502.58327088745233,559.37932781549853,330.3107086667315,318.35963003311269,294.33665478695548,264.08140201878439,227.44284925494983,165.57314145576078,7.6047129887586389E-5,7.3295644073469019E-5,6.7764856633349945E-5,6.0799217685917894E-5,5.2363957466317446E-5,3.8119751687754297E-5]
[null,268.41742117738761,309.97627979498839,363.54017779765974,438.56821577751344,502.58327088745233,559.37932781549853,456.35187545037991,439.74686984498322,406.39195983812027,364.4266370869106,313.66977809626661,228.10902113806094,9.1932287560511644E-5,8.8587201822115861E-5,8.186784041863824E-5,7.3413907551754746E-5,6.3188915813107687E-5,4.5952663404121855E-5]
[null,268.41742117738761,309.97627979498839,363.54017779765974,438.56821577751344,502.58327088745233,559.37932781549853,894.17963866286232,861.35962675734663,795.50251683606734,712.77409297775239,612.90299754459238,445.00393108767122,1.4410630760078362E-4,1.3881702284566425E-4,1.2820346766092948E-4,1.1487092554033077E-4,9.8775664390748162E-5,7.171699131146998E-5]
[null,268.41742117738761,309.97627979498839,363.54017779765974,438.56821577751344,502.58327088745233,559.37932781549853,2736.3375552526695,2635.1266516225201,2432.2231696980371,2177.6906772970888,1870.9270810894452,1356.4432563154801,3.6749094215050626E-4,3.5389828788913777E-4,3.2664829031668505E-4,2.9246450138290209E-4,2.5126605977564401E-4,1.8217073009877519E-4]
[null,268.41742117738761,309.97627979498839,363.54017779765974,438.56821577751344,502.58327088745233,559.37932781549853,25672.233430580196,24717.105041033887,22803.639994615154,20405.79318535528,17519.554279096639,12687.767653158193,2.7582308278893569E-3,2.6556116079542178E-3,2.4500284710840879E-3,2.1924032431217058E-3,1.8823050528172587E-3,1.3631767556441783E-3]
[null,268.41742117738761,309.97627979498839,363.54017779765974,438.56821577751344,502.58327088745233,559.37932781549853,88035.340593256406,84753.987513266853,78181.696589926811,69948.361504449829,60042.001302634664,43467.502543869341,7.8821148351021931E-3,7.5883237096666519E-3,6.9998833010947083E-3,6.2627237446906455E-3,5.3757723433283779E-3,3.8917989563854718E-3]
[]
[]
[]
[null,309.91583360733841,357.88989468644019,419.71571305613611,506.30199763714336,580.16312380833665,645.68105433703545,88.914422047378082,84.046157874507472,75.835442333636763,62.437384311891272,0,0,3.5823699455027425E-5,3.3862271504636362E-5,3.0554166935389502E-5,2.515607748263145E-5,0,0]
[null,309.91583360733841,357.88989468644019,419.71571305613611,506.30199763714336,580.16312380833665,645.68105433703545,146.62697887873253,138.4772705135874,124.7623654495993,102.47516709647842,0,0,4.7260911806199044E-5,4.4634092026941948E-5,4.0213494101401872E-5,3.3029868524247678E-5,0,0]
[null,309.91583360733841,357.88989468644019,419.71571305613611,506.30199763714336,580.16312380833665,645.68105433703545,222.30737943182709,209.82538121638891,188.85679906370788,154.87741295601333,0,0,5.9711893481554413E-5,5.6359221385009107E-5,5.0727047828017158E-5,4.1600164640347391E-5,0,0]
[null,309.91583360733841,357.88989468644019,419.71571305613611,506.30199763714336,580.16312380833665,645.68105433703545,318.35963003311269,300.35750084585976,270.15258890223851,221.30118521712575,0,0,7.3295644073469019E-5,6.9151030469865267E-5,6.2196981444051692E-5,5.094996781791775E-5,0,0]
[null,309.91583360733841,357.88989468644019,419.71571305613611,506.30199763714336,580.16312380833665,645.68105433703545,439.74686984498322,414.74879968934488,372.84385143649757,305.16803944897242,0,0,8.8587201822115861E-5,8.3551329510343436E-5,7.5109559112912464E-5,6.1476236794716436E-5,0,0]
[null,309.91583360733841,357.88989468644019,419.71571305613611,506.30199763714336,580.16312380833665,645.68105433703545,861.35962675734663,811.99393008016807,729.35595876779007,596.19449819024317,0,0,1.3881702284566425E-4,1.3086122966642514E-4,1.1754326491019985E-4,9.6082916710756356E-5,0,0]
[null,309.91583360733841,357.88989468644019,419.71571305613611,506.30199763714336,580.16312380833665,645.68105433703545,2635.1266516225201,2483.0092495121808,2228.6774548879757,1819.6593266111174,0,0,3.5389828788913777E-4,3.3346887584101274E-4,2.9931204067794461E-4,2.443807852016005E-4,0,0]
[null,309.91583360733841,357.88989468644019,419.71571305613611,506.30199763714336,580.16312380833665,645.68105433703545,24717.105041033887,23282.407289635597,20885.897258428278,17037.578716750086,0,0,2.6556116079542178E-3,2.5014673424266012E-3,2.2439857382141578E-3,1.8305214844748948E-3,0,0]
[null,309.91583360733841,357.88989468644019,419.71571305613611,506.30199763714336,580.16312380833665,645.68105433703545,84753.987513266853,79825.967416181942,71596.625982105412,58388.145713018515,0,0,7.5883237096666519E-3,7.1471006729503022E-3,6.4102986822549375E-3,5.227696813771914E-3,0,0]
[]
[]
[]
[null,346.47904826051155,400.10631077652431,469.21329557866233,565.9871262814404,648.5281483818892,721.73625139290027,84.046157874507472,79.134181018916934,69.177033978888971,43.484447211358834,0,0,3.3862271504636362E-5,3.1883231675631315E-5,2.7871488307368639E-5,1.7519922325285587E-5,0,0]
[null,346.47904826051155,400.10631077652431,469.21329557866233,565.9871262814404,648.5281483818892,721.73625139290027,138.4772705135874,130.2681361435065,113.67158938853733,71.140267414738403,0,0,4.4634092026941948E-5,4.1988118015634651E-5,3.6638707296869406E-5,2.2929981439077648E-5,0,0]
[null,346.47904826051155,400.10631077652431,469.21329557866233,565.9871262814404,648.5281483818892,721.73625139290027,209.82538121638891,197.26901969382288,171.93320672730758,107.29231643628319,0,0,5.6359221385009107E-5,5.2986575260226401E-5,4.6181360925948854E-5,2.8818779596100777E-5,0,0]
[null,346.47904826051155,400.10631077652431,469.21329557866233,565.9871262814404,648.5281483818892,721.73625139290027,300.35750084585976,282.26475817441695,245.80743237896201,153.07838191700318,0,0,6.9151030469865267E-5,6.4985555007348214E-5,5.6592018505574307E-5,3.524309472015729E-5,0,0]
[null,346.47904826051155,400.10631077652431,469.21329557866233,565.9871262814404,648.5281483818892,721.73625139290027,414.74879968934488,389.64205543665383,339.1025446401149,210.85197095034991,0,0,8.3551329510343436E-5,7.8493564753556361E-5,6.8312357904938521E-5,4.2476222995638574E-5,0,0]
[null,346.47904826051155,400.10631077652431,469.21329557866233,565.9871262814404,648.5281483818892,721.73625139290027,811.99393008016807,762.46541882030328,662.9199525525155,411.20703168603887,0,0,1.3086122966642514E-4,1.2287919723131399E-4,1.0683641459347551E-4,6.6270271021118268E-5,0,0]
[null,346.47904826051155,400.10631077652431,469.21329557866233,565.9871262814404,648.5281483818892,721.73625139290027,2483.0092495121808,2330.5305914037035,2024.4895071923356,1253.0648166965034,0,0,3.3346887584101274E-4,3.1299094700560081E-4,2.7188953897291641E-4,1.6828697511368565E-4,0,0]
[null,346.47904826051155,400.10631077652431,469.21329557866233,565.9871262814404,648.5281483818892,721.73625139290027,23282.407289635597,21845.303337742735,18963.876832473259,11718.202060644391,0,0,2.5014673424266012E-3,2.347064554149098E-3,2.0374834093444269E-3,1.2590063992097113E-3,0,0]
[null,346.47904826051155,400.10631077652431,469.21329557866233,565.9871262814404,648.5281483818892,721.73625139290027,79825.967416181942,74890.758746576277,64998.775689802613,40143.01802875525,0,0,7.1471006729503022E-3,6.7052340179583007E-3,5.8195698531473368E-3,3.5941461212960196E-3,0,0]
[]
[]
[]
[null,219.19854291255373,253.15099911325288,296.9203691225282,358.24945682881901,410.59855474089335,457.06397490511051,11.473676419178508,11.224535154192665,10.971661713000314,10.58484874986717,10.183397629332323,9.9076312393081523,1.2573891966223023E-5,1.2300860442950865E-5,1.2023738863561988E-5,1.1599834246429775E-5,1.115988781296693E-5,1.0857678070474687E-5]
[null,219.19854291255373,253.15099911325288,296.9203691225282,358.24945682881901,410.59855474089335,457.06397490511051,50.538898145591268,49.216999313678301,47.882007887415433,45.854972133615142,43.804504605234548,42.421635160647739,2.7692546929091106E-5,2.6968218802015507E-5,2.6236716650638593E-5,2.5126012128008297E-5,2.4002468276840849E-5,2.3244731594875473E-5]
[null,219.19854291255373,253.15099911325288,296.9203691225282,358.24945682881901,410.59855474089335,457.06397490511051,120.04347680084386,116.73381007473554,113.40364244931045,108.3699518249538,103.29013417713432,99.877962954442026,4.3851498374737486E-5,4.2642487698533531E-5,4.1425988109337154E-5,3.9587197013681755E-5,3.7731555863793358E-5,3.6485100622627222E-5]
[null,219.19854291255373,253.15099911325288,296.9203691225282,358.24945682881901,410.59855474089335,457.06397490511051,224.10455329618833,217.76245516304277,211.39229772137006,201.78445035537234,192.11346954518828,185.63107486940649,6.1398507752380367E-5,5.9660946620011721E-5,5.7915698005854807E-5,5.5283411056266396E-5,5.2633827272654327E-5,5.0857828731344241E-5]
[null,219.19854291255373,253.15099911325288,296.9203691225282,358.24945682881901,410.59855474089335,457.06397490511051,368.41818314774395,357.83584240668688,347.21713625143889,331.2208918669586,315.14282530054857,304.37865748853642,8.0749190826902778E-5,7.8429773678177951E-5,7.6102386027712628E-5,7.2596359861251198E-5,6.9072400065873664E-5,6.671313040844634E-5]
[null,219.19854291255373,253.15099911325288,296.9203691225282,358.24945682881901,410.59855474089335,457.06397490511051,574.02529275587131,557.37132638342428,540.67106379418749,515.53386450385096,490.29249872573689,473.40705126934,1.048448023298395E-4,1.0180298198784005E-4,9.8752705715833325E-5,9.4161436439059543E-5,8.9551141319769292E-5,8.6467041327733334E-5]
[null,219.19854291255373,253.15099911325288,296.9203691225282,358.24945682881901,410.59855474089335,457.06397490511051,2228.4855168693389,2162.7484799908852,2096.8993914081129,1997.9156615883562,1898.6798154338821,1832.3825200338342,3.0527198861223821E-4,2.9626691506724458E-4,2.8724649197371411E-4,2.7368707692991182E-4,2.6009312540190168E-4,2.5101130411422386E-4]
[null,219.19854291255373,253.15099911325288,296.9203691225282,358.24945682881901,410.59855474089335,457.06397490511051,20116.036098496526,19517.524372502507,18918.321076166267,18018.21943727024,17116.561765104208,16514.592187399074,2.2044971066845507E-3,2.1389067805482197E-3,2.0732406658812348E-3,1.9745993903857798E-3,1.8757875906963517E-3,1.8098183219067477E-3]
[null,219.19854291255373,253.15099911325288,296.9203691225282,358.24945682881901,410.59855474089335,457.06397490511051,74337.431968484787,72120.754927274334,69901.829610290151,66569.226117738086,63231.564004695079,61003.645584615908,6.7888065724643638E-3,6.58637031299309E-3,6.3837287315333469E-3,6.07938138061535E-3,5.7745720552232951E-3,5.5711091858096718E-3]
[]
[]
[]
[null,245.04684373780108,282.99356340461156,331.90596481894551,400.42768390951011,458.90135109625987,510.78972720804586,11.349874365848367,11.098711386131322,10.715412866178406,10.318841131444128,9.9076312393081523,9.3365809160575424,1.2438218483121498E-5,1.2162971382061723E-5,1.1742918209510582E-5,1.1308319048157948E-5,1.0857678070474687E-5,1.0231869497049362E-5]
[null,245.04684373780108,282.99356340461156,331.90596481894551,400.42768390951011,458.90135109625987,510.78972720804586,49.879585303928515,48.551140174840604,46.533923866802709,44.491154898508292,42.421635160647739,39.618267435301405,2.7331279618590966E-5,2.6603364479364715E-5,2.5498040474960388E-5,2.4378715012881255E-5,2.3244731594875473E-5,2.1708639690576113E-5]
[null,245.04684373780108,282.99356340461156,331.90596481894551,400.42768390951011,458.90135109625987,510.78972720804586,118.39120605020433,115.0712888744376,110.05297392456856,104.98853195123669,99.877962954442026,92.992117811107036,4.3247929150759575E-5,4.2035174018059396E-5,4.0201999607148334E-5,3.8351975142004274E-5,3.6485100622627222E-5,3.3969723401317641E-5]
[null,245.04684373780108,282.99356340461156,331.90596481894551,400.42768390951011,458.90135109625987,510.78972720804586,220.93701164318145,214.5808838557723,204.99408097117001,195.34414464238139,185.63107486940649,172.58210759226131,6.0530688121419578E-5,5.8789283248156798E-5,5.6162761909909589E-5,5.3518943737638742E-5,5.0857828731344241E-5,4.7282769203359264E-5]
[null,245.04684373780108,282.99356340461156,331.90596481894551,400.42768390951011,458.90135109625987,510.78972720804586,363.13155845398927,352.53103500583683,336.5620646819998,320.51127217623298,304.37865748853642,282.74122562193895,7.9590478565257926E-5,7.7267076165662865E-5,7.3767027875506808E-5,7.0249045956434619E-5,6.671313040844634E-5,6.1970679588370175E-5]
[null,245.04684373780108,282.99356340461156,331.90596481894551,400.42768390951011,458.90135109625987,510.78972720804586,565.70409659674658,549.02698211590473,523.92450498816061,498.71786137263911,473.40705126934,439.49726770617639,1.0332494915009071E-4,1.0027890084308762E-4,9.5693973513819288E-5,9.1090020342034545E-5,8.6467041327733334E-5,8.0273473553639521E-5]
[null,245.04684373780108,282.99356340461156,331.90596481894551,400.42768390951011,458.90135109625987,510.78972720804586,2195.6310048931523,2129.8379421625386,2030.9382511210213,1931.7864437447865,1832.3825200338342,1699.4517741207815,3.0077137053330854E-4,2.9175862221404638E-4,2.7821071933164675E-4,2.6462827996503926E-4,2.5101130411422386E-4,2.3280161289325775E-4]
[null,245.04684373780108,282.99356340461156,331.90596481894551,400.42768390951011,458.90135109625987,510.78972720804586,19816.866681792293,19218.009170627163,18318.426209487803,17417.287215078442,16514.592187399074,15308.578320962139,2.171711417182717E-3,2.1060831967810588E-3,2.007498762683595E-3,1.908743804392158E-3,1.8098183219067477E-3,1.6776524187355768E-3]
[null,245.04684373780108,282.99356340461156,331.90596481894551,400.42768390951011,458.90135109625987,510.78972720804586,73229.374482351282,71011.573303253957,67680.656017532223,64344.680111319525,61003.645584615908,56541.063917136264,6.6876141079772857E-3,6.4850751875117768E-3,6.1808818280851344E-3,5.8762264941844312E-3,5.5711091858096718E-3,5.1635674810170101E-3]
[]
[]
[]
[null,268.41742117738761,309.97627979498839,363.54017779765974,438.56821577751344,502.58327088745233,559.37932781549853,11.224535154192665,10.971661713000314,10.58484874986717,9.9076312393081523,9.4817831897704767,8.8934499996347878,1.2300860442950865E-5,1.2023738863561988E-5,1.1599834246429775E-5,1.0857678070474687E-5,1.0390995276460796E-5,9.7462465749422332E-6]
[null,268.41742117738761,309.97627979498839,363.54017779765974,438.56821577751344,502.58327088745233,559.37932781549853,49.216999313678301,47.882007887415433,45.854972133615142,42.421635160647739,40.324194000936295,37.480149201203531,2.6968218802015507E-5,2.6236716650638593E-5,2.5126012128008297E-5,2.3244731594875473E-5,2.2095448767636327E-5,2.0537068055453989E-5]
[null,268.41742117738761,309.97627979498839,363.54017779765974,438.56821577751344,502.58327088745233,559.37932781549853,116.73381007473554,113.40364244931045,108.3699518249538,99.877962954442026,94.72126693418457,87.773919092899192,4.2642487698533531E-5,4.1425988109337154E-5,3.9587197013681755E-5,3.6485100622627222E-5,3.4601376049017192E-5,3.2063532088730296E-5]
[null,268.41742117738761,309.97627979498839,363.54017779765974,438.56821577751344,502.58327088745233,559.37932781549853,217.76245516304277,211.39229772137006,201.78445035537234,185.63107486940649,175.85487165224535,162.72172644951837,5.9660946620011721E-5,5.7915698005854807E-5,5.5283411056266396E-5,5.0857828731344241E-5,4.8179416891026123E-5,4.4581294917676264E-5]
[null,268.41742117738761,309.97627979498839,363.54017779765974,438.56821577751344,502.58327088745233,559.37932781549853,357.83584240668688,347.21713625143889,331.2208918669586,304.37865748853642,288.16422061891001,266.4176925097396,7.8429773678177951E-5,7.6102386027712628E-5,7.2596359861251198E-5,6.671313040844634E-5,6.3159281231541916E-5,5.8392918906244295E-5]
[null,268.41742117738761,309.97627979498839,363.54017779765974,438.56821577751344,502.58327088745233,559.37932781549853,557.37132638342428,540.67106379418749,515.53386450385096,473.40705126934,447.99207467826335,413.94340246472962,1.0180298198784005E-4,9.8752705715833325E-5,9.4161436439059543E-5,8.6467041327733334E-5,8.182503647091568E-5,7.5606100906799932E-5]
[null,268.41742117738761,309.97627979498839,363.54017779765974,438.56821577751344,502.58327088745233,559.37932781549853,2162.7484799908852,2096.8993914081129,1997.9156615883562,1832.3825200338342,1732.7264799881643,1599.4595789621549,2.9626691506724458E-4,2.8724649197371411E-4,2.7368707692991182E-4,2.5101130411422386E-4,2.3735979177920058E-4,2.1910405191262396E-4]
[null,268.41742117738761,309.97627979498839,363.54017779765974,438.56821577751344,502.58327088745233,559.37932781549853,19517.524372502507,18918.321076166267,18018.21943727024,16514.592187399074,15610.341126449708,14402.252548986102,2.1389067805482197E-3,2.0732406658812348E-3,1.9745993903857798E-3,1.8098183219067477E-3,1.7107223152273653E-3,1.5783290464642303E-3]
[null,268.41742117738761,309.97627979498839,363.54017779765974,438.56821577751344,502.58327088745233,559.37932781549853,72120.754927274334,69901.829610290151,66569.226117738086,61003.645584615908,57657.552437421327,53188.225942620455,6.58637031299309E-3,6.3837287315333469E-3,6.07938138061535E-3,5.5711091858096718E-3,5.2655299029608516E-3,4.8573722322027809E-3]
[]
[]
[]
[null,309.91583360733841,357.88989468644019,419.71571305613611,506.30199763714336,580.16312380833665,645.68105433703545,10.971661713000314,10.58484874986717,10.183397629332323,9.3365809160575424,8.5898646924053885,7.8018200506051167,1.2023738863561988E-5,1.1599834246429775E-5,1.115988781296693E-5,1.0231869497049362E-5,9.4135503478415208E-6,8.5499397814850596E-6]
[null,309.91583360733841,357.88989468644019,419.71571305613611,506.30199763714336,580.16312380833665,645.68105433703545,47.882007887415433,45.854972133615142,43.804504605234548,39.618267435301405,36.037788264143948,32.372565188014768,2.6236716650638593E-5,2.5126012128008297E-5,2.4002468276840849E-5,2.1708639690576113E-5,1.974673329542134E-5,1.773839188384371E-5]
[null,309.91583360733841,357.88989468644019,419.71571305613611,506.30199763714336,580.16312380833665,645.68105433703545,113.40364244931045,108.3699518249538,103.29013417713432,92.992117811107036,84.26949382328128,75.418739214725548,4.1425988109337154E-5,3.9587197013681755E-5,3.7731555863793358E-5,3.3969723401317641E-5,3.0783376739098183E-5,2.7550224370675999E-5]
[null,309.91583360733841,357.88989468644019,419.71571305613611,506.30199763714336,580.16312380833665,645.68105433703545,211.39229772137006,201.78445035537234,192.11346954518828,172.58210759226131,156.113064885364,139.4686515001714,5.7915698005854807E-5,5.5283411056266396E-5,5.2633827272654327E-5,4.7282769203359264E-5,4.2770702708318901E-5,3.8210589452101755E-5]
[null,309.91583360733841,357.88989468644019,419.71571305613611,506.30199763714336,580.16312380833665,645.68105433703545,347.21713625143889,331.2208918669586,315.14282530054857,282.74122562193895,255.48988033386777,228.01125120710262,7.6102386027712628E-5,7.2596359861251198E-5,6.9072400065873664E-5,6.1970679588370175E-5,5.5997781990984715E-5,4.9975068757721124E-5]
[null,309.91583360733841,357.88989468644019,419.71571305613611,506.30199763714336,580.16312380833665,645.68105433703545,540.67106379418749,515.53386450385096,490.29249872573689,439.49726770617639,396.84962203277769,353.91262500444157,9.8752705715833325E-5,9.4161436439059543E-5,8.9551141319769292E-5,8.0273473553639521E-5,7.248394922973109E-5,6.4641575343277001E-5]
[null,309.91583360733841,357.88989468644019,419.71571305613611,506.30199763714336,580.16312380833665,645.68105433703545,2096.8993914081129,1997.9156615883562,1898.6798154338821,1699.4517741207815,1532.6580508926718,1365.1640045125691,2.8724649197371411E-4,2.7368707692991182E-4,2.6009312540190168E-4,2.3280161289325775E-4,2.0995315765653038E-4,1.8700876774144782E-4]
[null,309.91583360733841,357.88989468644019,419.71571305613611,506.30199763714336,580.16312380833665,645.68105433703545,18918.321076166267,18018.21943727024,17116.561765104208,15308.578320962139,13797.170904740964,12281.441173880885,2.0732406658812348E-3,1.9745993903857798E-3,1.8757875906963517E-3,1.6776524187355768E-3,1.5120187292866809E-3,1.345911361521193E-3]
[null,309.91583360733841,357.88989468644019,419.71571305613611,506.30199763714336,580.16312380833665,645.68105433703545,69901.829610290151,66569.226117738086,63231.564004695079,56541.063917136264,50950.190281559378,45345.264922396542,6.3837287315333469E-3,6.07938138061535E-3,5.7745720552232951E-3,5.1635674810170101E-3,4.6529854138410388E-3,4.1411200842371267E-3]
[]
[]
[]
[null,346.47904826051155,400.10631077652431,469.21329557866233,565.9871262814404,648.5281483818892,721.73625139290027,10.715412866178406,10.318841131444128,9.7673083513957781,8.7424882424122838,7.8018200506051167,6.6321483354806468,1.1742918209510582E-5,1.1308319048157948E-5,1.0703899563173455E-5,9.5808090327805845E-6,8.5499397814850596E-6,7.2681077649102975E-6]
[null,346.47904826051155,400.10631077652431,469.21329557866233,565.9871262814404,648.5281483818892,721.73625139290027,46.533923866802709,44.491154898508292,41.725877863609455,36.76066361077315,32.372565188014768,27.098883121081464,2.5498040474960388E-5,2.4378715012881255E-5,2.2863494719786002E-5,2.0142829375766108E-5,1.773839188384371E-5,1.4848703080044638E-5]
[null,346.47904826051155,400.10631077652431,469.21329557866233,565.9871262814404,648.5281483818892,721.73625139290027,110.05297392456856,104.98853195123669,98.164189505852107,86.024269070504857,75.418739214725548,62.812423319921137,4.0201999607148334E-5,3.8351975142004274E-5,3.5859064659672002E-5,3.1424390528038303E-5,2.7550224370675999E-5,2.2945177468464344E-5]
[null,346.47904826051155,400.10631077652431,469.21329557866233,565.9871262814404,648.5281483818892,721.73625139290027,204.99408097117001,195.34414464238139,182.37935529081795,159.42090308100708,139.4686515001714,115.87185002136565,5.6162761909909589E-5,5.3518943737638742E-5,4.9966946655018618E-5,4.3676959748221116E-5,3.8210589452101755E-5,3.1745712334620728E-5]
[null,346.47904826051155,400.10631077652431,469.21329557866233,565.9871262814404,648.5281483818892,721.73625139290027,336.5620646819998,320.51127217623298,298.98293655220874,260.95833209857756,228.01125120710262,189.15933358062557,7.3767027875506808E-5,7.0249045956434619E-5,6.5530506641579999E-5,5.719634676133207E-5,4.9975068757721124E-5,4.145957996287684E-5]
[null,346.47904826051155,400.10631077652431,469.21329557866233,565.9871262814404,648.5281483818892,721.73625139290027,523.92450498816061,498.71786137263911,464.94696645984527,405.40229927585239,353.91262500444157,293.31471888847585,9.5693973513819288E-5,9.1090020342034545E-5,8.49218203579626E-5,7.4046082059516411E-5,6.4641575343277001E-5,5.3573464637164542E-5]
[null,346.47904826051155,400.10631077652431,469.21329557866233,565.9871262814404,648.5281483818892,721.73625139290027,2030.9382511210213,1931.7864437447865,1799.1918529446909,1566.0728213904531,1365.1640045125691,1129.4957966850775,2.7821071933164675E-4,2.6462827996503926E-4,2.4646463738968368E-4,2.1453052347814426E-4,1.8700876774144782E-4,1.5472545160069554E-4]
[null,346.47904826051155,400.10631077652431,469.21329557866233,565.9871262814404,648.5281483818892,721.73625139290027,18318.426209487803,17417.287215078442,16213.348059668177,14099.798173156309,12281.441173880885,10152.158062083437,2.007498762683595E-3,1.908743804392158E-3,1.7768052668129509E-3,1.5451833614417872E-3,1.345911361521193E-3,1.112565267077637E-3]
[null,346.47904826051155,400.10631077652431,469.21329557866233,565.9871262814404,648.5281483818892,721.73625139290027,67680.656017532223,64344.680111319525,59888.843271161153,52069.489146561624,45345.264922396542,37474.762523944199,6.1808818280851344E-3,5.8762264941844312E-3,5.4693007553571829E-3,4.7552044882704682E-3,4.1411200842371267E-3,3.4223527419127123E-3]
[]
[]
[]
[null,379.53607389867221,438.27495798584511,513.96591067673842,619.95255910779599,710.34383369146872,790.50781205138537,10.452658171622408,9.9076312393081523,9.3365809160575424,8.1220232856783863,6.8039520989579323,4.6334580451319827,1.1454967859312229E-5,1.0857678070474687E-5,1.0231869497049362E-5,8.9008474363598748E-6,7.4563858618717067E-6,5.077762241240529E-6]
[null,379.53607389867221,438.27495798584511,513.96591067673842,619.95255910779599,710.34383369146872,790.50781205138537,45.174452383925136,42.421635160647739,39.618267435301405,33.848823687063039,27.862435542097106,18.476082580784027,2.4753124593931582E-5,2.3244731594875473E-5,2.1708639690576113E-5,1.8547300650445502E-5,1.5267087968272387E-5,1.0123880866183029E-5]
[null,379.53607389867221,438.27495798584511,513.96591067673842,619.95255910779599,710.34383369146872,790.50781205138537,106.68180450050986,99.877962954442026,92.992117811107036,78.974416732635447,64.628701265095074,42.495101084280584,3.8970522191967071E-5,3.6485100622627222E-5,3.3969723401317641E-5,2.8849102002789205E-5,2.3608657996381761E-5,1.5523324596997474E-5]
[null,379.53607389867221,438.27495798584511,513.96591067673842,619.95255910779599,710.34383369146872,790.50781205138537,198.5678049124428,185.63107486940649,172.58210759226131,146.1474613356439,119.26386614259049,78.096694097193009,5.4402138332176109E-5,5.0857828731344241E-5,4.7282769203359264E-5,4.0040400365929838E-5,3.2675031819887804E-5,2.1396354547176167E-5]
[null,379.53607389867221,438.27495798584511,513.96591067673842,619.95255910779599,710.34383369146872,790.50781205138537,325.87062769836979,304.37865748853642,282.74122562193895,239.02997691845189,194.73688158790839,127.20627616636227,7.1423699221560504E-5,6.671313040844634E-5,6.1970679588370175E-5,5.2390131927331925E-5,4.2682056238445672E-5,2.788082765290132E-5]
[null,379.53607389867221,438.27495798584511,513.96591067673842,619.95255910779599,710.34383369146872,790.50781205138537,507.1316499653438,473.40705126934,439.49726770617639,371.12214597836851,302.00628478192061,196.94360648354842,9.2626785381797958E-5,8.6467041327733334E-5,8.0273473553639521E-5,6.7784866845364112E-5,5.5160965256971799E-5,3.5971434974164094E-5]
[null,379.53607389867221,438.27495798584511,513.96591067673842,619.95255910779599,710.34383369146872,790.50781205138537,1964.8650591296114,1832.3825200338342,1699.4517741207815,1432.2456618428496,1163.2467222958155,756.38676184569795,2.6915959714104266E-4,2.5101130411422386E-4,2.3280161289325775E-4,1.9619803586888351E-4,1.5934886606791993E-4,1.0361462491036959E-4]
[null,379.53607389867221,438.27495798584511,513.96591067673842,619.95255910779599,710.34383369146872,790.50781205138537,17717.839772467119,16514.592187399074,15308.578320962139,12888.251743981584,10456.860041525453,6789.0253775745496,1.9416810709553007E-3,1.8098183219067477E-3,1.6776524187355768E-3,1.412411150025379E-3,1.1459572648247073E-3,7.4400278110406024E-4]
[null,379.53607389867221,438.27495798584511,513.96591067673842,619.95255910779599,710.34383369146872,790.50781205138537,65457.234149000535,61003.645584615908,56541.063917136264,47588.921272891981,38600.806216267702,25051.185358118761,5.9778296026484507E-3,5.5711091858096718E-3,5.1635674810170101E-3,4.3460202075700435E-3,3.5251877823075524E-3,2.2877794847597044E-3]
[]
[]
[]
[null,109.76474972005059,126.83082550792486,148.87323738811014,179.85345702302595,206.40135684355093,230.05907579361494,16.237049325495796,16.057217995432662,15.875662529793162,15.692888180890703,15.318422265092661,15.126730698197068,2.224253332259698E-5,2.1996189034839262E-5,2.1747482917524881E-5,2.1497107097110552E-5,2.098414008916803E-5,2.0721548901639819E-5]
[null,109.76474972005059,126.83082550792486,148.87323738811014,179.85345702302595,206.40135684355093,230.05907579361494,62.774501485172458,61.903143810024361,61.02653084472243,60.144662589266666,58.365160207893595,57.467526081976288,4.2996233893953738E-5,4.2399413568509834E-5,4.1798993729261939E-5,4.1194974376210046E-5,3.9976137128694242E-5,3.9361319234230337E-5]
[null,109.76474972005059,126.83082550792486,148.87323738811014,179.85345702302595,206.40135684355093,230.05907579361494,133.05655348573055,131.09220721781219,129.12063258599747,127.14182959028629,123.1625385071747,121.16205041977423,6.0756417116771942E-5,5.985945535059917E-5,5.8959192961642679E-5,5.8055629949902415E-5,5.623860205807064E-5,5.5325137177979103E-5]
[null,109.76474972005059,126.83082550792486,148.87323738811014,179.85345702302595,206.40135684355093,230.05907579361494,224.7531580209023,221.33893030207042,217.91569620072306,214.4842158620018,207.59635644188162,204.13881713895086,7.6970259596199426E-5,7.5801003528106316E-5,7.4628663082439411E-5,7.3453498582877325E-5,7.109464261708275E-5,6.9910553814709193E-5]
[null,109.76474972005059,126.83082550792486,148.87323738811014,179.85345702302595,206.40135684355093,230.05907579361494,336.69121056524432,331.49527234736445,326.28854780201232,321.07103692918776,310.60365620112117,305.35378634587903,9.224416727814913E-5,9.0820622560921761E-5,8.9394122685482831E-5,8.7964667651832258E-5,8.5096892109896209E-5,8.3658571601610693E-5]
[null,109.76474972005059,126.83082550792486,148.87323738811014,179.85345702302595,206.40135684355093,230.05907579361494,506.53537568960604,498.61580915790699,490.68343289000262,482.73824688589292,466.80944566905686,458.82583045633066,1.1102145220594105E-4,1.0928565680173305E-4,1.0754705378411016E-4,1.0580564315307242E-4,1.0231439905075218E-4,1.0056456557946974E-4]
[null,109.76474972005059,126.83082550792486,148.87323738811014,179.85345702302595,206.40135684355093,230.05907579361494,745.50833261537662,733.74692759403626,721.97018780421877,710.17811324592356,686.54795982390135,674.70988096017425,1.3616590550052541E-4,1.3401770367014361E-4,1.3186670096880708E-4,1.2971289739651572E-4,1.2539688763906875E-4,1.2323468145391311E-4]
[null,109.76474972005059,126.83082550792486,148.87323738811014,179.85345702302595,206.40135684355093,230.05907579361494,4160.532809876765,4093.8648399436324,4027.1456204782839,3960.3751514807191,3826.6804648889383,3759.7562472947247,5.6993600135298147E-4,5.6080340273200445E-4,5.5166378362716216E-4,5.4251714403845462E-4,5.2420280340944355E-4,5.1503510236914035E-4]
[null,109.76474972005059,126.83082550792486,148.87323738811014,179.85345702302595,206.40135684355093,230.05907579361494,44891.853976361766,44168.2648213625,43444.264237116571,42719.852223623973,41269.793908898748,40544.147607666127,4.9196552302862209E-3,4.8403577886424656E-3,4.7610152588620901E-3,4.6816276409450928E-3,4.5227171407012327E-3,4.4431942583743698E-3]
[]
[]
[]
[null,155.07458700146137,179.1247288286259,210.1481628907357,253.66164985863884,290.85155263825595,323.90428950027336,15.875662529793162,15.692888180890703,15.318422265092661,14.932066725303768,14.533821561524034,14.126627190778528,2.1747482917524881E-5,2.1497107097110552E-5,2.098414008916803E-5,2.0454885925073656E-5,1.9909344604827443E-5,1.9351544096956886E-5]
[null,155.07458700146137,179.1247288286259,210.1481628907357,253.66164985863884,290.85155263825595,323.90428950027336,61.02653084472243,60.144662589266666,58.365160207893595,56.564636665905162,54.743091963301374,52.900526100082232,4.1798993729261939E-5,4.1194974376210046E-5,3.9976137128694242E-5,3.8742901825962441E-5,3.7495268468014637E-5,3.6233237054850843E-5]
[null,155.07458700146137,179.1247288286259,210.1481628907357,253.66164985863884,290.85155263825595,323.90428950027336,129.12063258599747,127.14182959028629,123.1625385071747,119.1543339684774,115.11721597419437,111.05118452432565,5.8959192961642679E-5,5.8055629949902415E-5,5.623860205807064E-5,5.4408371675103839E-5,5.2564938801001991E-5,5.0708303435765138E-5]
[null,155.07458700146137,179.1247288286259,210.1481628907357,253.66164985863884,290.85155263825595,323.90428950027336,217.91569620072306,214.4842158620018,207.59635644188162,200.67220477410632,193.71425777379105,186.72042243855995,7.4628663082439411E-5,7.3453498582877325E-5,7.109464261708275E-5,6.872335779935148E-5,6.6340499237599671E-5,6.3945350150191758E-5]
[null,155.07458700146137,179.1247288286259,210.1481628907357,253.66164985863884,290.85155263825595,323.90428950027336,326.28854780201232,321.07103692918776,310.60365620112117,300.09313016316463,289.53945881531843,278.94264215758238,8.9394122685482831E-5,8.7964667651832258E-5,8.5096892109896209E-5,8.2217295935113602E-5,7.9325879127484504E-5,7.6422641687008875E-5]
[null,155.07458700146137,179.1247288286259,210.1481628907357,253.66164985863884,290.85155263825595,323.90428950027336,490.68343289000262,482.73824688589292,466.80944566905686,450.82940550739909,434.79812640091956,418.71560834961815,1.0754705378411016E-4,1.0580564315307242E-4,1.0231439905075218E-4,9.8811924494772403E-5,9.5298219485133052E-5,9.1773284021834118E-5]
[null,155.07458700146137,179.1247288286259,210.1481628907357,253.66164985863884,290.85155263825595,323.90428950027336,721.97018780421877,710.17811324592356,686.54795982390135,662.85646732796954,639.10363575812801,615.28946511437721,1.3186670096880708E-4,1.2971289739651572E-4,1.2539688763906875E-4,1.2106967439780266E-4,1.1673125767271745E-4,1.1238163746381319E-4]
[null,155.07458700146137,179.1247288286259,210.1481628907357,253.66164985863884,290.85155263825595,323.90428950027336,4027.1456204782839,3960.3751514807191,3826.6804648889383,3692.7807801682948,3558.6760973187861,3424.3664163404123,5.5166378362716216E-4,5.4251714403845462E-4,5.2420280340944355E-4,5.0586038084497189E-4,4.874898763450392E-4,4.6909128990964554E-4]
[null,155.07458700146137,179.1247288286259,210.1481628907357,253.66164985863884,290.85155263825595,323.90428950027336,43444.264237116571,42719.852223623973,41269.793908898748,39818.089877186838,38364.740128488258,36909.744662803001,4.7610152588620901E-3,4.6816276409450928E-3,4.5227171407012327E-3,4.3636262879108868E-3,4.204355082574056E-3,4.0449035246907395E-3]
[]
[]
[]
[null,189.86324956413722,219.28410822833914,257.21955735638238,310.39202327493928,355.79817041172225,396.11823606795463,15.50714142599054,15.318422265092661,14.932066725303768,14.331097635076398,13.708511904858025,13.059406882686737,2.1242659487658274E-5,2.098414008916803E-5,2.0454885925073656E-5,1.9631640595995065E-5,1.8778783431312362E-5,1.7889598469433886E-5]
[null,189.86324956413722,219.28410822833914,257.21955735638238,310.39202327493928,355.79817041172225,396.11823606795463,59.257539043657047,58.365160207893595,56.564636665905162,53.82443667676872,51.03756438925307,48.207119759320911,4.0587355509354143E-5,3.9976137128694242E-5,3.8742901825962441E-5,3.6866052518334742E-5,3.4957235883050049E-5,3.3018575177617064E-5]
[null,189.86324956413722,219.28410822833914,257.21955735638238,310.39202327493928,355.79817041172225,396.11823606795463,125.15579823067871,123.1625385071747,119.1543339684774,113.0878144312082,106.95623961887117,100.76189198558258,5.7148766315378404E-5,5.623860205807064E-5,5.4408371675103839E-5,5.1638271429775434E-5,4.8838465579393224E-5,4.6009996340448668E-5]
[null,189.86324956413722,219.28410822833914,257.21955735638238,310.39202327493928,355.79817041172225,396.11823606795463,211.04482268289863,207.59635644188162,200.67220477410632,190.22190723658235,179.69005006007413,169.07598453624274,7.2275624206472137E-5,7.109464261708275E-5,6.872335779935148E-5,6.514448877965149E-5,6.1537688376737709E-5,5.7902734430220119E-5]
[null,189.86324956413722,219.28410822833914,257.21955735638238,310.39202327493928,355.79817041172225,396.11823606795463,315.84273972889054,310.60365620112117,300.09313016316463,284.24644365018656,268.30268018995667,252.26183978247454,8.6532257459970014E-5,8.5096892109896209E-5,8.2217295935113602E-5,7.7875737986352484E-5,7.3507583613686755E-5,6.9112832817116307E-5]
[null,189.86324956413722,219.28410822833914,257.21955735638238,310.39202327493928,355.79817041172225,396.11823606795463,474.78025114557761,466.80944566905686,450.82940550739909,426.7632722433716,402.58185135349498,378.2851428377694,1.0406142490861976E-4,1.0231439905075218E-4,9.8811924494772403E-5,9.353715556019104E-5,8.8237118104875613E-5,8.2911812128826163E-5]
[null,189.86324956413722,219.28410822833914,257.21955735638238,310.39202327493928,355.79817041172225,396.11823606795463,698.37070391915108,686.54795982390135,662.85646732796954,627.20421782049129,591.41395539671646,555.48568005664538,1.275562929532696E-4,1.2539688763906875E-4,1.2106967439780266E-4,1.145578480037427E-4,1.0802081377108977E-4,1.0145857169984391E-4]
[null,189.86324956413722,219.28410822833914,257.21955735638238,310.39202327493928,355.79817041172225,396.11823606795463,3893.5534329509369,3826.6804648889383,3692.7807801682948,3491.5468815957074,3289.8517372331744,3087.6953470806943,5.3336348396588172E-4,5.2420280340944355E-4,5.0586038084497189E-4,4.7829409336927497E-4,4.5066462153879101E-4,4.2297196535351979E-4]
[null,189.86324956413722,219.28410822833914,257.21955735638238,310.39202327493928,355.79817041172225,396.11823606795463,41995.028780884692,41269.793908898748,39818.089877186838,37637.448110268968,35453.10348013106,33265.055986773121,4.6021949348914728E-3,4.5227171407012327E-3,4.3636262879108868E-3,4.1246518477007091E-3,3.8852716142609382E-3,3.6454855875915747E-3]
[]
[]
[]
[null,219.19854291255373,253.15099911325288,296.9203691225282,358.24945682881901,410.59855474089335,457.06397490511051,15.318422265092661,14.932066725303768,14.533821561524034,13.708511904858025,12.838199968016125,11.922030454598527,2.098414008916803E-5,2.0454885925073656E-5,1.9909344604827443E-5,1.8778783431312362E-5,1.7586575298652227E-5,1.6331548567943186E-5]
[null,219.19854291255373,253.15099911325288,296.9203691225282,358.24945682881901,410.59855474089335,457.06397490511051,58.365160207893595,56.564636665905162,54.743091963301374,51.03756438925307,47.252994590382215,43.384150586957226,3.9976137128694242E-5,3.8742901825962441E-5,3.7495268468014637E-5,3.4957235883050049E-5,3.2365064787933027E-5,2.9715171634902209E-5]
[null,219.19854291255373,253.15099911325288,296.9203691225282,358.24945682881901,410.59855474089335,457.06397490511051,123.1625385071747,119.1543339684774,115.11721597419437,106.95623961887117,98.683079232563756,90.299158467208159,5.623860205807064E-5,5.4408371675103839E-5,5.2564938801001991E-5,4.8838465579393224E-5,4.5060766772860164E-5,4.1232492450779984E-5]
[null,219.19854291255373,253.15099911325288,296.9203691225282,358.24945682881901,410.59855474089335,457.06397490511051,207.59635644188162,200.67220477410632,193.71425777379105,179.69005006007413,165.51969417333825,151.20319011358359,7.109464261708275E-5,6.872335779935148E-5,6.6340499237599671E-5,6.1537688376737709E-5,5.6684826771691184E-5,5.1781914422460133E-5]
[null,219.19854291255373,253.15099911325288,296.9203691225282,358.24945682881901,410.59855474089335,457.06397490511051,310.60365620112117,300.09313016316463,289.53945881531843,268.30268018995667,246.89332032503563,225.31137922055547,8.5096892109896209E-5,8.2217295935113602E-5,7.9325879127484504E-5,7.3507583613686755E-5,6.7642005568502908E-5,6.1729144991933002E-5]
[null,219.19854291255373,253.15099911325288,296.9203691225282,358.24945682881901,410.59855474089335,457.06397490511051,466.80944566905686,450.82940550739909,434.79812640091956,402.58185135349498,370.16062052678319,337.53443392078429,1.0231439905075218E-4,9.8811924494772403E-5,9.5298219485133052E-5,8.8237118104875613E-5,8.1131094909979879E-5,7.3980149900445877E-5]
[null,219.19854291255373,253.15099911325288,296.9203691225282,358.24945682881901,410.59855474089335,457.06397490511051,686.54795982390135,662.85646732796954,639.10363575812801,591.41395539671646,543.47891873966705,495.29852578697916,1.2539688763906875E-4,1.2106967439780266E-4,1.1673125767271745E-4,1.0802081377108977E-4,9.9265555934185764E-5,9.0465484162005323E-5]
[null,219.19854291255373,253.15099911325288,296.9203691225282,358.24945682881901,410.59855474089335,457.06397490511051,3826.6804648889383,3692.7807801682948,3558.6760973187861,3289.8517372331744,3020.2073846321018,2749.7430395155711,5.2420280340944355E-4,5.0586038084497189E-4,4.874898763450392E-4,4.5066462153879101E-4,4.1372703899069887E-4,3.7667712870076317E-4]
[null,219.19854291255373,253.15099911325288,296.9203691225282,358.24945682881901,410.59855474089335,457.06397490511051,41269.793908898748,39818.089877186838,38364.740128488258,35453.10348013106,32534.883963827124,29610.081579576472,4.5227171407012327E-3,4.3636262879108868E-3,4.204355082574056E-3,3.8852716142609382E-3,3.5654667357618765E-3,3.2449404470768738E-3]
[]
[]
[]
[null,245.04684373780108,282.99356340461156,331.90596481894551,400.42768390951011,458.90135109625987,510.78972720804586,14.932066725303768,14.533821561524034,13.919098614039072,13.059406882686737,11.922030454598527,10.706299389672445,2.0454885925073656E-5,1.9909344604827443E-5,1.9067258375395988E-5,1.7889598469433886E-5,1.6331548567943186E-5,1.4666163547496501E-5]
[null,245.04684373780108,282.99356340461156,331.90596481894551,400.42768390951011,458.90135109625987,510.78972720804586,56.564636665905162,54.743091963301374,51.971360233241896,48.207119759320911,43.384150586957226,38.431915680888196,3.8742901825962441E-5,3.7495268468014637E-5,3.559682207756294E-5,3.3018575177617064E-5,2.9715171634902209E-5,2.6323229918416573E-5]
[null,245.04684373780108,282.99356340461156,331.90596481894551,400.42768390951011,458.90135109625987,510.78972720804586,119.1543339684774,115.11721597419437,109.00732625354662,100.76189198558258,90.299158467208159,79.658340880561411,5.4408371675103839E-5,5.2564938801001991E-5,4.9775034818971061E-5,4.6009996340448668E-5,4.1232492450779984E-5,3.6373671634959548E-5]
[null,245.04684373780108,282.99356340461156,331.90596481894551,400.42768390951011,458.90135109625987,510.78972720804586,200.67220477410632,193.71425777379105,183.20980337972384,169.07598453624274,151.20319011358359,133.10203917058243,6.872335779935148E-5,6.6340499237599671E-5,6.2743083349220489E-5,5.7902734430220119E-5,5.1781914422460133E-5,4.5582890126911793E-5]
[null,245.04684373780108,282.99356340461156,331.90596481894551,400.42768390951011,458.90135109625987,510.78972720804586,300.09313016316463,289.53945881531843,273.62805433750566,252.26183978247454,225.31137922055547,198.09126047182522,8.2217295935113602E-5,7.9325879127484504E-5,7.496659022945361E-5,6.9112832817116307E-5,6.1729144991933002E-5,5.4271578211458967E-5]
[null,245.04684373780108,282.99356340461156,331.90596481894551,400.42768390951011,458.90135109625987,510.78972720804586,450.82940550739909,434.79812640091956,410.65513471965932,378.2851428377694,337.53443392078429,296.46348159866312,9.8811924494772403E-5,9.5298219485133052E-5,9.0006604870062314E-5,8.2911812128826163E-5,7.3980149900445877E-5,6.4978297336693285E-5]
[null,245.04684373780108,282.99356340461156,331.90596481894551,400.42768390951011,458.90135109625987,510.78972720804586,662.85646732796954,639.10363575812801,603.35937763978552,555.48568005664538,495.29852578697916,434.7280023053782,1.2106967439780266E-4,1.1673125767271745E-4,1.1020262605292886E-4,1.0145857169984391E-4,9.0465484162005323E-5,7.9402374850297391E-5]
[null,245.04684373780108,282.99356340461156,331.90596481894551,400.42768390951011,458.90135109625987,510.78972720804586,3692.7807801682948,3558.6760973187861,3357.1347015529013,3087.6953470806943,2749.7430395155711,2410.5094936450428,5.0586038084497189E-4,4.874898763450392E-4,4.5988146596615085E-4,4.2297196535351979E-4,3.7667712870076317E-4,3.3020677995137572E-4]
[null,245.04684373780108,282.99356340461156,331.90596481894551,400.42768390951011,458.90135109625987,510.78972720804586,39818.089877186838,38364.740128488258,36181.629786090365,33265.055986773121,29610.081579576472,25944.821441213062,4.3636262879108868E-3,4.204355082574056E-3,3.9651101135441498E-3,3.6454855875915747E-3,3.2449404470768738E-3,2.843268103146637E-3]
[]
[]
[]
[null,268.41742117738761,309.97627979498839,363.54017779765974,438.56821577751344,502.58327088745233,559.37932781549853,14.734430346412756,14.331097635076398,13.494867063235386,12.386383582254354,10.955713973604688,8.3250154158109257,2.0184151159469529E-5,1.9631640595995065E-5,1.8486119264706007E-5,1.6967648742814184E-5,1.5007827361102312E-5,1.1404130706590309E-5]
[null,268.41742117738761,309.97627979498839,363.54017779765974,438.56821577751344,502.58327088745233,559.37932781549853,55.656491959680196,53.82443667676872,50.099404658756328,45.328778814062886,39.433118441636324,29.183846837912409,3.8120884903890548E-5,3.6866052518334742E-5,3.4314660725175565E-5,3.1047108776755401E-5,2.7008985233997484E-5,1.9988936190350966E-5]
[null,268.41742117738761,309.97627979498839,363.54017779765974,438.56821577751344,502.58327088745233,559.37932781549853,117.1393891532841,113.0878144312082,104.89792462029932,94.505586218490521,81.801283305816568,60.039333624934173,5.3488305549444795E-5,5.1638271429775434E-5,4.7898595717031654E-5,4.3153235716205715E-5,3.7352184157907108E-5,2.7415220833303274E-5]
[null,268.41742117738761,309.97627979498839,363.54017779765974,438.56821577751344,502.58327088745233,559.37932781549853,197.19747405018614,190.22190723658235,176.16116247961062,158.37971066508828,136.74053788081005,99.944509041918721,6.7533381524036355E-5,6.514448877965149E-5,6.0329165232743366E-5,5.4239626940098727E-5,4.6828951329044539E-5,3.422757158969819E-5]
[null,268.41742117738761,309.97627979498839,363.54017779765974,438.56821577751344,502.58327088745233,559.37932781549853,294.82168765297774,284.24644365018656,262.96651971493509,236.12392242774041,203.55685687651615,148.41550809334657,8.0773065110404855E-5,7.7875737986352484E-5,7.2045621839708244E-5,6.4691485596641207E-5,5.5769001883977025E-5,4.0661783039273033E-5]
[null,268.41742117738761,309.97627979498839,363.54017779765974,438.56821577751344,502.58327088745233,559.37932781549853,442.82017082226207,426.7632722433716,394.49575825112527,353.87314669619457,304.70329153549824,221.7287540379015,9.7056475796660182E-5,9.353715556019104E-5,8.646482372627403E-5,7.7561237632042649E-5,6.6784283076273593E-5,4.8598083076800326E-5]
[null,268.41742117738761,309.97627979498839,363.54017779765974,438.56821577751344,502.58327088745233,559.37932781549853,650.98771892728746,627.20421782049129,579.45319838517037,519.41939180027794,446.87277653865306,324.7349696244209,1.1890186647073744E-4,1.145578480037427E-4,1.0583620061829596E-4,9.4871121790005103E-5,8.1620598454548498E-5,5.9312323219072313E-5]
[null,268.41742117738761,309.97627979498839,363.54017779765974,438.56821577751344,502.58327088745233,559.37932781549853,3625.7540635096484,3491.5468815957074,3222.5175233812297,2885.0777111382686,2478.4587018835805,1796.6603905484708,4.9667863883693817E-4,4.7829409336927497E-4,4.414407566275657E-4,3.9521612481346142E-4,3.3951489066898362E-4,2.461178617189686E-4]
[null,268.41742117738761,309.97627979498839,363.54017779765974,438.56821577751344,502.58327088745233,559.37932781549853,39091.620717460894,37637.448110268968,34724.165744925085,31073.305630195133,26678.696327379079,19321.433149618693,4.2840132293107827E-3,4.1246518477007091E-3,3.8053880268411051E-3,3.4052937676926172E-3,2.9236927482059263E-3,2.1174173314650623E-3]