{"text_format":"1","workbook":"xlsx","n_sheets":9,"sheets":["ReadMe","UserInput","Input","Results","Profile","Ref","Crash","Capacity","Tables"],"not_rendered":{"charts":1,"images":6,"macros":1,"external_links":0,"defined_names":65,"comments":1,"pivot_tables":0},"unopened":[],"bounds":{"document_bytes":16777216,"sheet_cells":100000,"rows_first":2000,"rows_last":500,"rows_between":2000,"halvings":0,"cell_chars":16384,"cell_head_chars":4096},"cells_cut":0,"cells_raw":0,"read":"whole","date_system":"1900"}

{"sheet":"ReadMe","index":0,"n_rows":20,"n_cols":3,"rows_kept":20,"cut":false,"hidden":false,"merged":[[16,1,16,2],[19,1,19,2],[1,1,5,2],[13,1,13,2]]}
[]
[null,"Reliability Analysis of Horizontal Sightline Obstructions along Horizontal Curves"]
[]
[]
[]
[]
[]
[null,"Worksheet Name","Description"]
{"$rows_left_out":13}
{"sheet":"UserInput","index":1,"n_rows":92,"n_cols":15,"rows_kept":92,"cut":false,"hidden":false,"merged":[[78,2,78,6],[83,2,83,6],[88,2,88,6],[66,1,66,8],[30,12,32,15],[54,1,55,2],[73,2,73,6],[37,4,37,14],[42,1,42,2],[36,1,36,14],[38,5,38,6],[38,7,38,8],[38,9,38,10],[38,11,38,12],[38,13,38,14],[8,4,8,8],[9,4,9,8],[11,4,11,6],[11,7,11,8],[5,1,5,2],[6,4,6,8],[7,4,7,8],[10,4,10,8],[11,9,11,12],[49,1,51,2],[67,3,67,8],[34,4,34,8],[33,4,33,8],[32,4,32,8],[30,9,31,9],[30,10,31,10],[31,1,31,8],[12,2,13,3],[14,2,14,3],[16,1,16,2],[25,1,25,2]]}
[]
[]
[]
[]
[null,"INPUT DATA"]
[null,"Facility Type",null,null,"RESULTS",null,null,null,null,"Lane 1",{"$f":"IF($C$8>1,\"Lane 2\",\"\")","v":"Lane 2"},{"$f":"IF($C$8>2,\"Lane 3\",\"\")","v":"Lane 3"},{"$f":"IF($C$8>3,\"Lane 4\",\"\")","v":"Lane 4"},"Total"]
[null,"Urban freeway (8 lanes)",{"$f":"IF(B7=\"Rural two-lane highway\",1,IF(B7=\"Rural four-lane undivided highway\",2,IF(B7=\"Rural four-lane divided highway\",3,IF(B7=\"Rural freeway (4 lanes)\",4,IF(B7=\"Rural freeway (6 lanes)\",5,IF(B7=\"Urban freeway (4 lanes)\",6,IF(B7=\"Urban freeway (6 lanes)\",7,IF(B7=\"Urban freeway (8 lanes)\",8,IF(B7=\"Rural one-lane entrance ramp\",9,IF(B7=\"Rural one-lane exit ramp\",10,IF(B7=\"Urban one-lane entrance ramp\",11,IF(B7=\"Urban one-lane exit ramp\",12,IF(B7=\"Urban two-lane entrance ramp\",13,IF(B7=\"Urban two-lane exit ramp\",14,0))))))))))))))","v":8},null,"Minimum available sight distance (ft)",null,null,null,null,379.72675788817207,539.5139177755317,663.81546260066239,770.01419469659345]
[null,"Number of lanes in analysis direction",{"$f":"VLOOKUP(C7,Ref!D102:E115,2)","v":4},null,"Length of sight-restricted roadway (mi)",null,null,null,null,0.34090909090909088,0.28409090909090912,0.20833333333333331,0]
{"$rows_left_out":85}
{"sheet":"Input","index":2,"n_rows":57,"n_cols":9,"rows_kept":57,"cut":false,"hidden":true,"merged":[[41,1,41,2],[48,1,48,2],[53,1,53,2],[17,1,17,2],[19,4,20,4],[26,1,26,2],[32,1,32,2],[37,1,37,2]]}
[]
[]
[]
[]
[]
[]
[]
[null,null,null,null,null,"(calculated values for display only)"]
{"$rows_left_out":50}
{"sheet":"Results","index":3,"n_rows":38,"n_cols":41,"rows_kept":38,"cut":false,"hidden":true,"merged":[]}
["E (mi)","S' (ft)","R","L","S","Tx","Ty","Cx","Cy","alpha1","U","beta","gamma","Delta","O","PTx","PTy ","Ix","Iy","N","alpha2","lambda","theta","beta1","beta2","Q","Iycircle","delta","P","T2x","T2y","Condition","Zc","Zt","Zi","Zsl","SLCondition","E (ft)","Available SD (ft)","Design SSD (ft)","CrestControl"]
[0,1167.7556834654642,1536,0.3,682.01,682.01,48,null,null,null,null,3.7577442592358636,null,59.086266107672131,1167.7556834654642,null,null,null,null,null,4.0258495397345762,null,18.11925423856913,0,59.086266107672131,380.98818879330105,null,66.057961524488576,1680.6051410429518,null,null,2,3.5,-19.482457583515025,-33.032670503963928,-21.056645348155584,0]
[9.46969696969697E-3,1124.6070975110642,1536,0.3,682.01,null,null,null,null,null,null,4.0133152652410047,null,59.086266107672131,1174.6070975110642,null,null,null,null,null,null,null,18.374825244574275,0,59.086266107672131,380.98818879330105,null,67.634549162890195,1660.9432982796252,null,null,2,2,-19.688000004883015,-33.238212925331929,-21.24005577240402,0]
[1.893939393939394E-2,1082.3762423019648,1536,0.3,682.01,null,null,null,null,null,null,4.3031194044734491,null,59.086266107672131,1182.3762423019648,null,null,null,null,null,null,null,18.664629383806719,0,59.086266107672131,380.98818879330105,null,69.247654967734306,1642.5686104695901,null,null,2,0.5,-19.921074348610034,-33.471287269058941,-21.449589299482842,0]
[2.8409090909090908E-2,1041.2408536196433,1536,0.3,682.01,null,null,null,null,null,null,4.6337865656208237,null,59.086266107672131,1191.2408536196433,null,null,null,null,null,null,null,18.995296544954087,0,59.086266107672131,380.98818879330105,null,70.895918342815705,1625.5247276187465,null,null,2,-1,-20.187012688140392,-33.737225608589299,-21.690550835403407,0]
[3.787878787878788E-2,1001.4210142798682,1536,0.3,682.01,null,null,null,null,null,null,5.0135262637198679,null,59.086266107672131,1201.4210142798684,null,null,null,null,null,null,null,19.375036243053145,0,59.086266107672131,380.98818879330105,null,72.577686475154806,1609.8539188696593,null,null,2,-2.5,-20.492417507947131,-34.042630428396052,-21.969561956748038,0]
[4.7348484848484848E-2,963.18959067389198,1536,0.3,682.01,null,null,null,null,null,null,5.4525169433447331,null,59.086266107672131,1213.1895906738919,null,null,null,null,null,null,null,19.814026922677993,0,59.086266107672131,380.98818879330105,null,74.291008303919327,1595.5966407898959,null,null,2,-4,-20.84547479976786,-34.395687720216756,-22.294900453601681,0]
[5.6818181818181816E-2,926.88422079249744,1536,0.3,682.01,null,null,null,null,null,null,5.9633531551086492,null,59.086266107672131,1226.8842207924974,null,null,null,null,null,null,null,20.324863134441919,0,59.086266107672131,380.98818879330105,null,76.033633756484065,1582.7910917426848,null,null,2,-5.5,-21.256313703326015,-34.806526623774921,-22.676896995634213,0]
{"$rows_left_out":31}
{"sheet":"Profile","index":4,"n_rows":44,"n_cols":6,"rows_kept":44,"cut":false,"hidden":false,"merged":[]}
["Distance from PC, ft","ASSD(lane1, ft)","ASSD(lane2, ft)","ASSD(lane3, ft)","ASSD(lane4, ft)","DSSD (ft)"]
[-682.01,897.77512821285609,1003.0556182980499,1090.1357867063809,1167.7556834654642,682]
[-632.01,849.74090237621908,956.79987816417179,1045.5008220625011,1124.6070975110642,682]
[-582.01,802.02162265813695,911.10669683742424,1001.6254018742439,1082.3762423019648,682]
[-532.01,754.69713933621188,866.10552280807246,958.6693608446692,1041.2408536196433,682]
[-482.01,707.87570064247848,821.9657469548963,916.83571939732519,1001.4210142798682,682]
[-432.01,661.70713840726569,778.91172930929349,876.38387262631238,963.18959067389198,682]
[-382.01,616.40360127085467,737.24398670495486,837.6463926919148,926.88422079249744,682]
{"$rows_left_out":37}
{"sheet":"Ref","index":5,"n_rows":250,"n_cols":24,"rows_kept":250,"cut":false,"hidden":true,"merged":[[67,9,75,9],[78,9,86,9],[89,9,97,9],[12,9,20,9],[23,9,31,9],[34,9,42,9],[45,9,53,9],[56,9,64,9],[32,12,32,14],[32,15,32,17],[32,18,32,20],[37,22,39,22],[34,22,36,22],[10,12,10,14],[10,15,10,17],[10,18,10,20],[12,22,14,22],[15,22,17,22],[21,12,21,14],[21,15,21,17],[21,18,21,20],[23,22,25,22],[26,22,28,22],[43,12,43,14],[43,15,43,17],[43,18,43,20],[45,22,47,22],[48,22,50,22],[54,12,54,14],[54,15,54,17],[54,18,54,20],[56,22,58,22],[59,22,61,22],[65,12,65,14],[65,15,65,17],[65,18,65,20],[67,22,69,22],[70,22,72,22],[76,12,76,14],[76,15,76,17],[76,18,76,20],[78,22,80,22],[81,22,83,22],[87,12,87,14],[87,15,87,17],[87,18,87,20],[89,22,91,22],[92,22,94,22]]}
[]
[null,"Combination","1st Condition","2nd Condition","3rd Condition","4th Condition"]
[null,1,1,2,4,8]
[null,2,1,2,6,8]
[null,3,1,5,6,8]
[null,4,1,5,7,8]
[null,5,1,3,4,8]
[null,6,1,3,7,8]
{"$rows_left_out":243}
{"sheet":"Crash","index":6,"n_rows":53,"n_cols":26,"rows_kept":53,"cut":false,"hidden":false,"merged":[[48,4,48,5],[1,16,1,20],[1,21,1,25],[9,1,9,2],[24,1,24,2],[16,1,16,3],[1,1,1,4],[1,11,1,15],[28,7,28,8],[31,2,31,6],[31,7,31,11],[31,12,31,16],[31,17,31,21]]}
[null,null,null,null,null,null,null,"Dir AADT",{"$f":"UserInput!C10","v":50000},null,"Crash/yr/25'/dir",{"$f":"C53","v":4.3893244862902372E-2}]
[null,"Crash Probability per 25'",null,null,null,null,null,null,null,null,null,"Crash/yr/hr/ln per 25'",null,null,null,null,"Flow Rate (veh/hr/ln)",null,null,null,null,"Number of Vehicles at Risk per yr/hr/ln"]
[null,null,"Final","Prob","Exists?",null,null,"Hr of Day","k","Hourly Volume","Crash/yr/hr/dir","Lane 1","Lane 2","Lane 3","Lane 4","Lane 5","Lane 1","Lane 2","Lane 3","Lane 4","Lane 5","Lane 1","Lane 2","Lane 3","Lane 4","Lane 5"]
[null,"Lane 1 (closest to obstruction)",{"$f":"IF(E4=1,D4,0)","v":0.2},0.2,{"$f":"IF(Input!$C$40>=1,1,0)","v":1},null,null,0,{"$f":"IF($J$29=\"No\",IF(UserInput!$C$38=0.08,UserInput!F41,IF(UserInput!$C$38=0.09,UserInput!H41,IF(UserInput!$C$38=0.1,UserInput!J41,IF(UserInput!$C$38=0.11,UserInput!L41,UserInput!N41)))),IF(UserInput!$C$38=0.08,UserInput!G41,IF(UserInput!$C$38=0.09,UserInput!I41,IF(UserInput!$C$38=0.1,UserInput!K41,IF(UserInput!$C$38=0.11,UserInput!M41,UserInput!O41)))))","v":1.0200000000000001E-2},{"$f":"$I$1*I4","v":510.00000000000006},{"$f":"$L$1*I4","v":4.4771109760160426E-4},{"$f":"IF(Input!$C$40>0,$K4*Input!$C$43,0)","v":1.1192777440040106E-4},{"$f":"IF(Input!$C$40>1,$K4*Input!$C$44,0)","v":1.1192777440040106E-4},{"$f":"IF(Input!$C$40>2,$K4*Input!$C$45,0)","v":1.1192777440040106E-4},{"$f":"IF(Input!$C$40>3,$K4*Input!$C$46,0)","v":1.1192777440040106E-4},{"$f":"IF(Input!$C$40>4,$K4*Input!$C$47,0)","v":0},{"$f":"$J4*Input!$C$43","v":127.50000000000001},{"$f":"$J4*Input!$C$44","v":127.50000000000001},{"$f":"$J4*Input!$C$45","v":127.50000000000001},{"$f":"$J4*Input!$C$46","v":127.50000000000001},{"$f":"$J4*Input!$C$47","v":0},{"$f":"L4*Q4*(0.5*(1+$D$19)*MIN($D$19,Q4)+$D$19*MAX(0,(Q4-$D$19)))/Q4","v":0.74140957762825677},{"$f":"IF(R4=0,0,M4*R4*(0.5*(1+$D$20)*MIN($D$20,R4)+$D$20*MAX(0,(R4-$D$20)))/R4)","v":0.65813531347435827},{"$f":"IF(S4=0,0,N4*S4*(0.5*(1+$D$21)*MIN($D$21,S4)+$D$21*MAX(0,(S4-$D$21)))/S4)","v":0.5220311398034706},{"$f":"IF(T4=0,0,O4*T4*(0.5*(1+$D$22)*MIN($D$22,T4)+$D$22*MAX(0,(T4-$D$22)))/T4)","v":0},{"$f":"IF(U4=0,0,P4*U4*(0.5*(1+$D$23)*MIN($D$23,U4)+$D$23*MAX(0,(U4-$D$23)))/U4)","v":0}]
[null,"Lane 2",{"$f":"IF(E5=1,D5,0)","v":0.2},0.2,{"$f":"IF(Input!$C$40>=2,1,0)","v":1},null,null,1,{"$f":"IF($J$29=\"No\",IF(UserInput!$C$38=0.08,UserInput!F42,IF(UserInput!$C$38=0.09,UserInput!H42,IF(UserInput!$C$38=0.1,UserInput!J42,IF(UserInput!$C$38=0.11,UserInput!L42,UserInput!N42)))),IF(UserInput!$C$38=0.08,UserInput!G42,IF(UserInput!$C$38=0.09,UserInput!I42,IF(UserInput!$C$38=0.1,UserInput!K42,IF(UserInput!$C$38=0.11,UserInput!M42,UserInput!O42)))))","v":7.3000000000000001E-3},{"$f":"$I$1*I5","v":365},{"$f":"$L$1*I5","v":3.2042068749918733E-4},{"$f":"IF(Input!$C$40>0,$K5*Input!$C$43,0)","v":8.0105171874796831E-5},{"$f":"IF(Input!$C$40>1,$K5*Input!$C$44,0)","v":8.0105171874796831E-5},{"$f":"IF(Input!$C$40>2,$K5*Input!$C$45,0)","v":8.0105171874796831E-5},{"$f":"IF(Input!$C$40>3,$K5*Input!$C$46,0)","v":8.0105171874796831E-5},{"$f":"IF(Input!$C$40>4,$K5*Input!$C$47,0)","v":0},{"$f":"$J5*Input!$C$43","v":91.25},{"$f":"$J5*Input!$C$44","v":91.25},{"$f":"$J5*Input!$C$45","v":91.25},{"$f":"$J5*Input!$C$46","v":91.25},{"$f":"$J5*Input!$C$47","v":0},{"$f":"L5*Q5*(0.5*(1+$D$19)*MIN($D$19,Q5)+$D$19*MAX(0,(Q5-$D$19)))/Q5","v":0.3215421599054345},{"$f":"IF(R5=0,0,M5*R5*(0.5*(1+$D$20)*MIN($D$20,R5)+$D$20*MAX(0,(R5-$D$20)))/R5)","v":0.29678966179612226},{"$f":"IF(S5=0,0,N5*S5*(0.5*(1+$D$21)*MIN($D$21,S5)+$D$21*MAX(0,(S5-$D$21)))/S5)","v":0.24584277248375147},{"$f":"IF(T5=0,0,O5*T5*(0.5*(1+$D$22)*MIN($D$22,T5)+$D$22*MAX(0,(T5-$D$22)))/T5)","v":0},{"$f":"IF(U5=0,0,P5*U5*(0.5*(1+$D$23)*MIN($D$23,U5)+$D$23*MAX(0,(U5-$D$23)))/U5)","v":0}]
[null,"Lane 3",0.2,0.2,{"$f":"IF(Input!$C$40>=3,1,0)","v":1},null,null,2,{"$f":"IF($J$29=\"No\",IF(UserInput!$C$38=0.08,UserInput!F43,IF(UserInput!$C$38=0.09,UserInput!H43,IF(UserInput!$C$38=0.1,UserInput!J43,IF(UserInput!$C$38=0.11,UserInput!L43,UserInput!N43)))),IF(UserInput!$C$38=0.08,UserInput!G43,IF(UserInput!$C$38=0.09,UserInput!I43,IF(UserInput!$C$38=0.1,UserInput!K43,IF(UserInput!$C$38=0.11,UserInput!M43,UserInput!O43)))))","v":6.7000000000000002E-3},335,2.940847405814459E-4,{"$f":"IF(Input!$C$40>0,$K6*Input!$C$43,0)","v":7.3521185145361475E-5},{"$f":"IF(Input!$C$40>1,$K6*Input!$C$44,0)","v":7.3521185145361475E-5},{"$f":"IF(Input!$C$40>2,$K6*Input!$C$45,0)","v":7.3521185145361475E-5},{"$f":"IF(Input!$C$40>3,$K6*Input!$C$46,0)","v":7.3521185145361475E-5},{"$f":"IF(Input!$C$40>4,$K6*Input!$C$47,0)","v":0},{"$f":"$J6*Input!$C$43","v":83.75},{"$f":"$J6*Input!$C$44","v":83.75},{"$f":"$J6*Input!$C$45","v":83.75},{"$f":"$J6*Input!$C$46","v":83.75},{"$f":"$J6*Input!$C$47","v":0},0.25541259719498577,0.23931145764815162,0.20137452611314507,0,0]
[null,"Lane 4",0.2,0.2,{"$f":"IF(Input!$C$40>=4,1,0)","v":1},null,null,3,{"$f":"IF($J$29=\"No\",IF(UserInput!$C$38=0.08,UserInput!F44,IF(UserInput!$C$38=0.09,UserInput!H44,IF(UserInput!$C$38=0.1,UserInput!J44,IF(UserInput!$C$38=0.11,UserInput!L44,UserInput!N44)))),IF(UserInput!$C$38=0.08,UserInput!G44,IF(UserInput!$C$38=0.09,UserInput!I44,IF(UserInput!$C$38=0.1,UserInput!K44,IF(UserInput!$C$38=0.11,UserInput!M44,UserInput!O44)))))","v":7.7999999999999996E-3},390,3.423673099306385E-4,{"$f":"IF(Input!$C$40>0,$K7*Input!$C$43,0)","v":8.5591827482659624E-5},{"$f":"IF(Input!$C$40>1,$K7*Input!$C$44,0)","v":8.5591827482659624E-5},{"$f":"IF(Input!$C$40>2,$K7*Input!$C$45,0)","v":8.5591827482659624E-5},{"$f":"IF(Input!$C$40>3,$K7*Input!$C$46,0)","v":8.5591827482659624E-5},{"$f":"IF(Input!$C$40>4,$K7*Input!$C$47,0)","v":0},{"$f":"$J7*Input!$C$43","v":97.5},{"$f":"$J7*Input!$C$44","v":97.5},{"$f":"$J7*Input!$C$45","v":97.5},{"$f":"$J7*Input!$C$46","v":97.5},{"$f":"$J7*Input!$C$47","v":0},0.38208191788259255,0.34921465612925123,0.28621907110201372,0,0]
[null,"Lane 5",0,0.2,{"$f":"IF(Input!$C$40>=5,1,0)","v":0},null,null,4,{"$f":"IF($J$29=\"No\",IF(UserInput!$C$38=0.08,UserInput!F45,IF(UserInput!$C$38=0.09,UserInput!H45,IF(UserInput!$C$38=0.1,UserInput!J45,IF(UserInput!$C$38=0.11,UserInput!L45,UserInput!N45)))),IF(UserInput!$C$38=0.08,UserInput!G45,IF(UserInput!$C$38=0.09,UserInput!I45,IF(UserInput!$C$38=0.1,UserInput!K45,IF(UserInput!$C$38=0.11,UserInput!M45,UserInput!O45)))))","v":1.21E-2},605,5.3110826284111874E-4,{"$f":"IF(Input!$C$40>0,$K8*Input!$C$43,0)","v":1.3277706571027969E-4},{"$f":"IF(Input!$C$40>1,$K8*Input!$C$44,0)","v":1.3277706571027969E-4},{"$f":"IF(Input!$C$40>2,$K8*Input!$C$45,0)","v":1.3277706571027969E-4},{"$f":"IF(Input!$C$40>3,$K8*Input!$C$46,0)","v":1.3277706571027969E-4},{"$f":"IF(Input!$C$40>4,$K8*Input!$C$47,0)","v":0},{"$f":"$J8*Input!$C$43","v":151.25},{"$f":"$J8*Input!$C$44","v":151.25},{"$f":"$J8*Input!$C$45","v":151.25},{"$f":"$J8*Input!$C$46","v":151.25},{"$f":"$J8*Input!$C$47","v":0},1.1065640656294708,0.9699364650135931,0.75802426813998669,0,0]
{"$rows_left_out":46}
{"sheet":"Capacity","index":7,"n_rows":37,"n_cols":25,"rows_kept":37,"cut":false,"hidden":false,"merged":[[1,20,1,24],[16,1,16,2],[23,1,23,3],[31,1,31,2],[9,1,9,2],[1,1,1,4],[1,10,1,14],[1,15,1,19]]}
[null,null,null,null,null,null,null,"Dir AADT",{"$f":"UserInput!C10","v":50000}]
[null,"Probability of Event per 25'",null,null,null,null,null,null,null,null,"P(queue formation)",null,null,null,null,"Flow Rate (veh/hr/ln)",null,null,null,null,"Number of Vehicles at Risk per hour per lane per yr"]
[null,null,"Final","Prob","Exists?",null,null,"Hr of Day","k","Hourly Volume","Lane 1","Lane 2","Lane 3","Lane 4","Lane 5","Lane 1","Lane 2","Lane 3","Lane 4","Lane 5","Lane 1","Lane 2","Lane 3","Lane 4","Lane 5"]
[null,"Lane 1 (closest to obstruction)",{"$f":"IF(E4=1,D4,0)","v":0},{"$f":"Input!$C$52*25/5280/365/24","v":0},{"$f":"IF(Input!$C$40>=1,1,0)","v":1},null,null,0,{"$f":"IF(Crash!$J$29=\"No\",IF(UserInput!$C$38=0.08,UserInput!F41,IF(UserInput!$C$38=0.09,UserInput!H41,IF(UserInput!$C$38=0.1,UserInput!J41,IF(UserInput!$C$38=0.11,UserInput!L41,UserInput!N41)))),IF(UserInput!$C$38=0.08,UserInput!G41,IF(UserInput!$C$38=0.09,UserInput!I41,IF(UserInput!$C$38=0.1,UserInput!K41,IF(UserInput!$C$38=0.11,UserInput!M41,UserInput!O41)))))","v":1.0200000000000001E-2},{"$f":"$I$1*I4","v":510.00000000000006},{"$f":"IF(P4>=$I$33,1,IF(P4>0,1-_xlfn.LOGNORM.DIST(3600/P4-$I$32,$I$30,$I$31,TRUE),0))","v":0},0,{"$f":"IF(R4>=$I$33,1,IF(R4>0,1-_xlfn.LOGNORM.DIST(3600/R4-$I$32,$I$30,$I$31,TRUE),0))","v":0},{"$f":"IF(S4>=$I$33,1,IF(S4>0,1-_xlfn.LOGNORM.DIST(3600/S4-$I$32,$I$30,$I$31,TRUE),0))","v":0},{"$f":"IF(T4>=$I$33,1,IF(T4>0,1-_xlfn.LOGNORM.DIST(3600/T4-$I$32,$I$30,$I$31,TRUE),0))","v":0},{"$f":"$J4*Input!$C$43","v":127.50000000000001},{"$f":"$J4*Input!$C$44","v":127.50000000000001},{"$f":"$J4*Input!$C$45","v":127.50000000000001},{"$f":"$J4*Input!$C$46","v":127.50000000000001},{"$f":"$J4*Input!$C$47","v":0},{"$f":"K4*(365-Crash!L4*Crash!Q4)*(0.5*(1+$D$26)*MIN(P4,$D$26)+$D$26*MAX(0,(P4-$D$26)))/P4","v":0},{"$f":"IF(Q4=0,0,L4*(365-Crash!M4*Crash!R4)*(0.5*(1+$D$27)*MIN(Q4,$D$27)+$D$27*MAX(0,(Q4-$D$27)))/Q4)","v":0},{"$f":"IF(R4=0,0,M4*(365-Crash!N4*Crash!S4)*(0.5*(1+$D$28)*MIN(R4,$D$28)+$D$28*MAX(0,(R4-$D$28)))/R4)","v":0},{"$f":"IF(S4=0,0,N4*(365-Crash!O4*Crash!T4)*(0.5*(1+$D$29)*MIN(S4,$D$29)+$D$29*MAX(0,(S4-$D$29)))/S4)","v":0},{"$f":"IF(T4=0,0,O4*(365-Crash!P4*Crash!U4)*(0.5*(1+$D$30)*MIN(T4,$D$30)+$D$30*MAX(0,(T4-$D$30)))/T4)","v":0}]
[null,"Lane 2",{"$f":"IF(E5=1,D5,0)","v":0},{"$f":"Input!$C$52*25/5280/365/24","v":0},{"$f":"IF(Input!$C$40>=2,1,0)","v":1},null,null,1,{"$f":"IF(Crash!$J$29=\"No\",IF(UserInput!$C$38=0.08,UserInput!F42,IF(UserInput!$C$38=0.09,UserInput!H42,IF(UserInput!$C$38=0.1,UserInput!J42,IF(UserInput!$C$38=0.11,UserInput!L42,UserInput!N42)))),IF(UserInput!$C$38=0.08,UserInput!G42,IF(UserInput!$C$38=0.09,UserInput!I42,IF(UserInput!$C$38=0.1,UserInput!K42,IF(UserInput!$C$38=0.11,UserInput!M42,UserInput!O42)))))","v":7.3000000000000001E-3},{"$f":"$I$1*I5","v":365},0,{"$f":"IF(Q5>=$I$33,1,IF(Q5>0,1-_xlfn.LOGNORM.DIST(3600/Q5-$I$32,$I$30,$I$31,TRUE),0))","v":0},{"$f":"IF(R5>=$I$33,1,IF(R5>0,1-_xlfn.LOGNORM.DIST(3600/R5-$I$32,$I$30,$I$31,TRUE),0))","v":0},{"$f":"IF(S5>=$I$33,1,IF(S5>0,1-_xlfn.LOGNORM.DIST(3600/S5-$I$32,$I$30,$I$31,TRUE),0))","v":0},{"$f":"IF(T5>=$I$33,1,IF(T5>0,1-_xlfn.LOGNORM.DIST(3600/T5-$I$32,$I$30,$I$31,TRUE),0))","v":0},{"$f":"$J5*Input!$C$43","v":91.25},{"$f":"$J5*Input!$C$44","v":91.25},{"$f":"$J5*Input!$C$45","v":91.25},{"$f":"$J5*Input!$C$46","v":91.25},{"$f":"$J5*Input!$C$47","v":0},{"$f":"K5*(365-Crash!L5*Crash!Q5)*(0.5*(1+$D$26)*MIN(P5,$D$26)+$D$26*MAX(0,(P5-$D$26)))/P5","v":0},{"$f":"IF(Q5=0,0,L5*(365-Crash!M5*Crash!R5)*(0.5*(1+$D$27)*MIN(Q5,$D$27)+$D$27*MAX(0,(Q5-$D$27)))/Q5)","v":0},{"$f":"IF(R5=0,0,M5*(365-Crash!N5*Crash!S5)*(0.5*(1+$D$28)*MIN(R5,$D$28)+$D$28*MAX(0,(R5-$D$28)))/R5)","v":0},{"$f":"IF(S5=0,0,N5*(365-Crash!O5*Crash!T5)*(0.5*(1+$D$29)*MIN(S5,$D$29)+$D$29*MAX(0,(S5-$D$29)))/S5)","v":0},{"$f":"IF(T5=0,0,O5*(365-Crash!P5*Crash!U5)*(0.5*(1+$D$30)*MIN(T5,$D$30)+$D$30*MAX(0,(T5-$D$30)))/T5)","v":0}]
[null,"Lane 3",0,{"$f":"Input!$C$52*25/5280/365/24","v":0},{"$f":"IF(Input!$C$40>=3,1,0)","v":1},null,null,2,{"$f":"IF(Crash!$J$29=\"No\",IF(UserInput!$C$38=0.08,UserInput!F43,IF(UserInput!$C$38=0.09,UserInput!H43,IF(UserInput!$C$38=0.1,UserInput!J43,IF(UserInput!$C$38=0.11,UserInput!L43,UserInput!N43)))),IF(UserInput!$C$38=0.08,UserInput!G43,IF(UserInput!$C$38=0.09,UserInput!I43,IF(UserInput!$C$38=0.1,UserInput!K43,IF(UserInput!$C$38=0.11,UserInput!M43,UserInput!O43)))))","v":6.7000000000000002E-3},335,0,0,0,0,0,{"$f":"$J6*Input!$C$43","v":83.75},{"$f":"$J6*Input!$C$44","v":83.75},{"$f":"$J6*Input!$C$45","v":83.75},{"$f":"$J6*Input!$C$46","v":83.75},{"$f":"$J6*Input!$C$47","v":0},{"$f":"K6*(365-Crash!L6*Crash!Q6)*(0.5*(1+$D$26)*MIN(P6,$D$26)+$D$26*MAX(0,(P6-$D$26)))/P6","v":0},{"$f":"IF(Q6=0,0,L6*(365-Crash!M6*Crash!R6)*(0.5*(1+$D$27)*MIN(Q6,$D$27)+$D$27*MAX(0,(Q6-$D$27)))/Q6)","v":0},{"$f":"IF(R6=0,0,M6*(365-Crash!N6*Crash!S6)*(0.5*(1+$D$28)*MIN(R6,$D$28)+$D$28*MAX(0,(R6-$D$28)))/R6)","v":0},{"$f":"IF(S6=0,0,N6*(365-Crash!O6*Crash!T6)*(0.5*(1+$D$29)*MIN(S6,$D$29)+$D$29*MAX(0,(S6-$D$29)))/S6)","v":0},{"$f":"IF(T6=0,0,O6*(365-Crash!P6*Crash!U6)*(0.5*(1+$D$30)*MIN(T6,$D$30)+$D$30*MAX(0,(T6-$D$30)))/T6)","v":0}]
[null,"Lane 4",0,{"$f":"Input!$C$52*25/5280/365/24","v":0},{"$f":"IF(Input!$C$40>=4,1,0)","v":1},null,null,3,{"$f":"IF(Crash!$J$29=\"No\",IF(UserInput!$C$38=0.08,UserInput!F44,IF(UserInput!$C$38=0.09,UserInput!H44,IF(UserInput!$C$38=0.1,UserInput!J44,IF(UserInput!$C$38=0.11,UserInput!L44,UserInput!N44)))),IF(UserInput!$C$38=0.08,UserInput!G44,IF(UserInput!$C$38=0.09,UserInput!I44,IF(UserInput!$C$38=0.1,UserInput!K44,IF(UserInput!$C$38=0.11,UserInput!M44,UserInput!O44)))))","v":7.7999999999999996E-3},390,0,0,0,0,0,{"$f":"$J7*Input!$C$43","v":97.5},{"$f":"$J7*Input!$C$44","v":97.5},{"$f":"$J7*Input!$C$45","v":97.5},{"$f":"$J7*Input!$C$46","v":97.5},{"$f":"$J7*Input!$C$47","v":0},{"$f":"K7*(365-Crash!L7*Crash!Q7)*(0.5*(1+$D$26)*MIN(P7,$D$26)+$D$26*MAX(0,(P7-$D$26)))/P7","v":0},{"$f":"IF(Q7=0,0,L7*(365-Crash!M7*Crash!R7)*(0.5*(1+$D$27)*MIN(Q7,$D$27)+$D$27*MAX(0,(Q7-$D$27)))/Q7)","v":0},{"$f":"IF(R7=0,0,M7*(365-Crash!N7*Crash!S7)*(0.5*(1+$D$28)*MIN(R7,$D$28)+$D$28*MAX(0,(R7-$D$28)))/R7)","v":0},{"$f":"IF(S7=0,0,N7*(365-Crash!O7*Crash!T7)*(0.5*(1+$D$29)*MIN(S7,$D$29)+$D$29*MAX(0,(S7-$D$29)))/S7)","v":0},{"$f":"IF(T7=0,0,O7*(365-Crash!P7*Crash!U7)*(0.5*(1+$D$30)*MIN(T7,$D$30)+$D$30*MAX(0,(T7-$D$30)))/T7)","v":0}]
[null,"Lane 5",0,{"$f":"Input!$C$52*25/5280/365/24","v":0},{"$f":"IF(Input!$C$40>=5,1,0)","v":0},null,null,4,{"$f":"IF(Crash!$J$29=\"No\",IF(UserInput!$C$38=0.08,UserInput!F45,IF(UserInput!$C$38=0.09,UserInput!H45,IF(UserInput!$C$38=0.1,UserInput!J45,IF(UserInput!$C$38=0.11,UserInput!L45,UserInput!N45)))),IF(UserInput!$C$38=0.08,UserInput!G45,IF(UserInput!$C$38=0.09,UserInput!I45,IF(UserInput!$C$38=0.1,UserInput!K45,IF(UserInput!$C$38=0.11,UserInput!M45,UserInput!O45)))))","v":1.21E-2},605,0,0,0,0,0,{"$f":"$J8*Input!$C$43","v":151.25},{"$f":"$J8*Input!$C$44","v":151.25},{"$f":"$J8*Input!$C$45","v":151.25},{"$f":"$J8*Input!$C$46","v":151.25},{"$f":"$J8*Input!$C$47","v":0},{"$f":"K8*(365-Crash!L8*Crash!Q8)*(0.5*(1+$D$26)*MIN(P8,$D$26)+$D$26*MAX(0,(P8-$D$26)))/P8","v":0},{"$f":"IF(Q8=0,0,L8*(365-Crash!M8*Crash!R8)*(0.5*(1+$D$27)*MIN(Q8,$D$27)+$D$27*MAX(0,(Q8-$D$27)))/Q8)","v":0},{"$f":"IF(R8=0,0,M8*(365-Crash!N8*Crash!S8)*(0.5*(1+$D$28)*MIN(R8,$D$28)+$D$28*MAX(0,(R8-$D$28)))/R8)","v":0},{"$f":"IF(S8=0,0,N8*(365-Crash!O8*Crash!T8)*(0.5*(1+$D$29)*MIN(S8,$D$29)+$D$29*MAX(0,(S8-$D$29)))/S8)","v":0},{"$f":"IF(T8=0,0,O8*(365-Crash!P8*Crash!U8)*(0.5*(1+$D$30)*MIN(T8,$D$30)+$D$30*MAX(0,(T8-$D$30)))/T8)","v":0}]
{"$rows_left_out":30}
{"sheet":"Tables","index":8,"n_rows":358,"n_cols":19,"rows_kept":358,"cut":false,"hidden":true,"merged":[]}
[]
[null,109.76474972005059,126.83082550792486,148.87323738811014,179.85345702302595,206.40135684355093,230.05907579361494,0.55282674474766946,0.54391018434851357,0.53499362394935757,0.52607706355020167,0.50824394275188978,0.49932738235273383,3.0291876424529835E-6,2.9803297772521291E-6,2.9314719120512743E-6,2.8826140468504203E-6,2.7848983164487111E-6,2.7360404512478567E-6]
[null,109.76474972005059,126.83082550792486,148.87323738811014,179.85345702302595,206.40135684355093,230.05907579361494,2.3867358878999623,2.3617729102670295,2.3363479977489368,2.3110914771251294,2.2697607416118819,2.2501211557176442,6.5390024326026368E-6,6.4706107130603551E-6,6.4009534184902377E-6,6.3317574715756966E-6,6.2185225797585804E-6,6.1647154951168334E-6]
[null,109.76474972005059,126.83082550792486,148.87323738811014,179.85345702302595,206.40135684355093,230.05907579361494,6.5493641672178482,6.4902943338763626,6.4296173389080158,6.367333182312807,6.2379433842418086,6.1708377427660182,1.1962308981219814E-5,1.1854418874660023E-5,1.1743593313074002E-5,1.1629832296461748E-5,1.1393503898158555E-5,1.1270936516467614E-5]
[null,109.76474972005059,126.83082550792486,148.87323738811014,179.85345702302595,206.40135684355093,230.05907579361494,12.981783113384578,12.836091379676928,12.688165211416651,12.538004608603742,12.230980099320041,12.074493125645768,1.7783264538882982E-5,1.7583686821475243E-5,1.738104823481733E-5,1.7175348778909238E-5,1.6754767259342522E-5,1.6540401541980504E-5]
[null,109.76474972005059,126.83082550792486,148.87323738811014,179.85345702302595,206.40135684355093,230.05907579361494,21.597354423444354,21.332287748725758,21.06425637009735,20.793260287559121,20.242374010753235,19.96248381648557,2.366833361473354E-5,2.3377849587644665E-5,2.3084116569969699E-5,2.2787134561708625E-5,2.2183423573428201E-5,2.1876694593408844E-5]
[null,109.76474972005059,126.83082550792486,148.87323738811014,179.85345702302595,206.40135684355093,230.05907579361494,60.539491569819511,59.692276231399518,58.840221767820353,57.983328179082029,56.255023626127887,55.383612661912096,4.1465405184807883E-5,4.0885120706438028E-5,4.0301521758781063E-5,3.9714608341837008E-5,3.8530838100087593E-5,3.793398127528226E-5]
[null,109.76474972005059,126.83082550792486,148.87323738811014,179.85345702302595,206.40135684355093,230.05907579361494,97.362686797737126,95.950452802504472,94.532091499406604,93.107602888443424,90.240243742921351,88.797373208362387,5.3349417423417602E-5,5.2575590576714781E-5,5.1798406301044717E-5,5.1017864596407357E-5,4.9446708900230876E-5,4.8656094908691721E-5]
{"$rows_left_out":350}