{"text_format":"1","workbook":"xlsx","n_sheets":7,"sheets":["Basic Input","Data Inputs","Straight-Line Diagram","Working Data","Working Data - 2","Working Data - HZ","Working Data - Vol"],"not_rendered":{"charts":10,"images":2,"macros":1,"external_links":0,"defined_names":2,"comments":0,"pivot_tables":0},"unopened":[],"bounds":{"document_bytes":16777216,"sheet_cells":100000,"rows_first":2000,"rows_last":500,"rows_between":2000,"halvings":0,"cell_chars":16384,"cell_head_chars":4096},"cells_cut":0,"cells_raw":0,"read":"whole","date_system":"1900"}

{"sheet":"Basic Input","index":0,"n_rows":70,"n_cols":26,"rows_kept":70,"cut":false,"hidden":false,"merged":[[12,15,13,15],[10,15,11,15],[61,4,61,5],[62,4,62,5],[20,1,21,1],[28,4,29,8],[50,6,53,8],[16,2,25,6],[63,4,63,5],[64,4,64,5],[65,4,65,5],[66,4,66,5],[2,2,2,3],[6,2,6,3],[2,4,3,8],[4,4,4,8],[6,4,6,8],[9,4,9,8],[62,6,64,8]]}
[null,null,null,null,"Transition Zone Straight-Line Diagram Workbook"]
[null,null,null,null,"Enter Fields in Grey Boxes With Blue Text"]
[null,"Reference Location:","Navarre Road",null,"Enter a cross-street as the reference location for the diagram. The intersection should be within community portion of study area and will serve as the zero point on the straight-line diagram."]
[]
[null,"State Mile Post for Reference Location:",5.35,null,"Enter the state mile post of above cross-street reference location.",null,null,null,null,null,null,null,null,null,null,"DATA INPUT -- DO NOT MODIFY"]
[]
[null,"Increasing/Decreasing MP: ","Increasing",null,"Enter whether the mile posts are increasing or decreasing when traveling away from the community."]
[]
[null,null,null,null,null,null,null,null,null,null,null,null,null,null,null,"Length of Analysis:",2500,"In feet",null,null,"Increasing",null,"Right",null,null,"Tangent"]
[null,"Number of Years of Crash Data:",5,"years","Enter the number of years of crash data being used in the analysis.",null,null,null,null,null,null,null,null,null,null,null,null,null,null,null,"Decreasing",null,"Left",null,null,"Curve Right"]
[null,null,null,null,null,null,null,null,null,null,null,null,null,null,null,"Length Before Start of Analysis to Consider:",null,null,null,null,null,null,null,null,null,"Curve Left"]
[null,"Average Crash Rate for Similar Roads:",1.1040000000000001,null,null,null,null,null,null,null,null,null,null,null,null,null,1000,"In feet",null,null,"x=",0]
[null,null,null,null,null,null,null,null,null,null,null,null,null,null,null,"Length After End of Analysis to Consider:"]
[null,"Crash Rate Threshold:",null,null,null,null,null,null,null,null,null,null,null,null,null,null,1000,"In feet"]
[]
[]
[null,"Land-Use Data:","Enter land-use data directly onto the Straight Line Diagram sheet using text boxes.  Use an aerial photo placed on the straight-line diagram to assist.  Some typical land-uses are provided on the right for reference.",null,null,null,null,"Typical Land-Uses"]
[null,null,null,null,null,null,null,"Rural"]
[null,null,null,null,null,null,null,"Residential"]
[null,null,null,null,null,null,null,"Retail"]
[null,null,null,null,null,null,null,"Industrial"]
[null,null,null,null,null,null,null,"Office"]
[null,null,null,null,null,null,null,"Mixed-Use"]
[null,null,null,null,null,null,null,"Recreational"]
[null,null,null,null,null,null,null,"Farm"]
[null,null,null,null,null,null,null,"Park"]
[]
[null,null,"MP","Elevation (ft)"]
[null,"Enter Vertical Elevation Data:",5.25,931,"Define the approximate vertical geometry by entering between 3 and 20 mile post and elevation pairs.  "]
[null,null,5.35,929]
[null,null,5.45,933]
[null,null,5.48,932]
[null,null,5.51,934]
[null,null,5.55,932]
[null,null,5.59,932]
[null,null,5.63,928]
[null,null,5.7,929]
[null,null,5.78,930]
[null,null,5.85,929]
[null,null,5.89,930]
[]
[]
[]
[]
[]
[]
[]
[]
[]
[null,null,"Type","Start","End","Radius (ft)"]
[null,"Enter Horizontal Curvature Data:","Tangent",-1000,3500,0,"Define the approximate horizontal geometry by entering sections of tangents and curves.  Provide the start and end points in feet from the reference point (similar to the land-use data entry fields above).  For curves enter the radius (enter 0 for tangent sections)."]
[]
[]
[]
[]
[]
[]
[]
[]
[]
[]
[null,null,"Start","End","Two-Way ADT"]
[null,"Enter Average Daily Traffic Data:",-1000,3500,4310,null,"Enter up to five average daily traffic volumes, providing the start and end points in feet from the reference point."]
[]
[]
[]
[]
[]
[]
[null,null,null,null,"Remember To Fill Out Data Inputs Sheet"]

{"sheet":"Data Inputs","index":1,"n_rows":206,"n_cols":14,"rows_kept":206,"cut":false,"hidden":false,"merged":[[19,13,23,13],[2,6,2,7],[2,8,2,10],[5,13,6,13],[9,13,10,13],[13,13,17,13]]}
[null,null,null,null,null,null,"Enter Posted Speeds, Observed Speeds, Crash Data, and Access Points In Grey Boxes With Blue Text"]
[]
[null,null,"Please Do Not Modify the Cells in Red",null,null,null,"Observed Speed Data",null,"Crash Data (nearest MP)"]
[null,null,"Distance (miles)","Distance (feet)","Mile Post","Posted Speed (mph)","85th Percentile Speed","Mean Speed","Property Damage Only","Injury","Fatal","Access Points"]
[{"$f":"IF(H5<>\"\", A4+1, A4)","v":0},0,{"$f":"IF(D5=\"\", \"\", D5*0.0001893939)","v":-0.1893939},{"$f":"-'Basic Input'!Q12","v":-1000},{"$f":"IF(D5=\"\", \"\",IF(D5=0, 'Basic Input'!$C$5, IF('Basic Input'!$C$7=\"Increasing\", 'Basic Input'!$C$5+(D5/5280), 'Basic Input'!$C$5-(D5/5280))))","v":5.1606060606060602},null,null,null,null,null,null,null,null,"Posted Speeds"]
[{"$f":"IF(H6<>\"\", A5+1, A5)","v":0},{"$f":"IF(F5=\"\", B5+1, B5+2)","v":1},{"$f":"IF(D6=\"\", \"\", D6*0.0001893939)","v":-0.17045451},{"$f":"IF(D5=\"\", \"\", IF(D5+100<='Basic Input'!$Q$14+'Basic Input'!$Q$9, D5+100, \"\"))","v":-900},{"$f":"IF(D6=\"\", \"\",IF(D6=0, 'Basic Input'!$C$5, IF('Basic Input'!$C$7=\"Increasing\", 'Basic Input'!$C$5+(D6/5280), 'Basic Input'!$C$5-(D6/5280))))","v":5.1795454545454538},null,null,null,null,null,null,null,null,"Enter the posted speeds based on feet from the reference point (column D)."]
[0,{"$f":"IF(F6=\"\", B6+1, B6+2)","v":2},-0.15151512,{"$f":"IF(D6=\"\", \"\", IF(D6+100<='Basic Input'!$Q$14+'Basic Input'!$Q$9, D6+100, \"\"))","v":-800},{"$f":"IF(D7=\"\", \"\",IF(D7=0, 'Basic Input'!$C$5, IF('Basic Input'!$C$7=\"Increasing\", 'Basic Input'!$C$5+(D7/5280), 'Basic Input'!$C$5-(D7/5280))))","v":5.1984848484848483}]
[0,3,-0.13257573,{"$f":"IF(D7=\"\", \"\", IF(D7+100<='Basic Input'!$Q$14+'Basic Input'!$Q$9, D7+100, \"\"))","v":-700},{"$f":"IF(D8=\"\", \"\",IF(D8=0, 'Basic Input'!$C$5, IF('Basic Input'!$C$7=\"Increasing\", 'Basic Input'!$C$5+(D8/5280), 'Basic Input'!$C$5-(D8/5280))))","v":5.2174242424242419}]
[0,{"$f":"IF(F8=\"\", B8+1, B8+2)","v":4},-0.11363634,{"$f":"IF(D8=\"\", \"\", IF(D8+100<='Basic Input'!$Q$14+'Basic Input'!$Q$9, D8+100, \"\"))","v":-600},{"$f":"IF(D9=\"\", \"\",IF(D9=0, 'Basic Input'!$C$5, IF('Basic Input'!$C$7=\"Increasing\", 'Basic Input'!$C$5+(D9/5280), 'Basic Input'!$C$5-(D9/5280))))","v":5.2363636363636363},null,null,null,null,null,null,null,null,"Observed Speed Data"]
[0,5,-9.4696950000000002E-2,{"$f":"IF(D9=\"\", \"\", IF(D9+100<='Basic Input'!$Q$14+'Basic Input'!$Q$9, D9+100, \"\"))","v":-500},{"$f":"IF(D10=\"\", \"\",IF(D10=0, 'Basic Input'!$C$5, IF('Basic Input'!$C$7=\"Increasing\", 'Basic Input'!$C$5+(D10/5280), 'Basic Input'!$C$5-(D10/5280))))","v":5.2553030303030299},null,null,null,3,null,null,2,null,"Enter the observed 85th percentile and mean speeds based on feet from the reference point."]
[0,6,-7.5757560000000002E-2,{"$f":"IF(D10=\"\", \"\", IF(D10+100<='Basic Input'!$Q$14+'Basic Input'!$Q$9, D10+100, \"\"))","v":-400},{"$f":"IF(D11=\"\", \"\",IF(D11=0, 'Basic Input'!$C$5, IF('Basic Input'!$C$7=\"Increasing\", 'Basic Input'!$C$5+(D11/5280), 'Basic Input'!$C$5-(D11/5280))))","v":5.2742424242424235},null,null,null,null,null,null,1]
[0,7,-5.6818170000000001E-2,{"$f":"IF(D11=\"\", \"\", IF(D11+100<='Basic Input'!$Q$14+'Basic Input'!$Q$9, D11+100, \"\"))","v":-300},{"$f":"IF(D12=\"\", \"\",IF(D12=0, 'Basic Input'!$C$5, IF('Basic Input'!$C$7=\"Increasing\", 'Basic Input'!$C$5+(D12/5280), 'Basic Input'!$C$5-(D12/5280))))","v":5.293181818181818}]
[0,8,-3.7878780000000001E-2,{"$f":"IF(D12=\"\", \"\", IF(D12+100<='Basic Input'!$Q$14+'Basic Input'!$Q$9, D12+100, \"\"))","v":-200},{"$f":"IF(D13=\"\", \"\",IF(D13=0, 'Basic Input'!$C$5, IF('Basic Input'!$C$7=\"Increasing\", 'Basic Input'!$C$5+(D13/5280), 'Basic Input'!$C$5-(D13/5280))))","v":5.3121212121212116},null,null,null,null,null,null,1,null,"Crash Data"]
[0,9,-1.893939E-2,{"$f":"IF(D13=\"\", \"\", IF(D13+100<='Basic Input'!$Q$14+'Basic Input'!$Q$9, D13+100, \"\"))","v":-100},{"$f":"IF(D14=\"\", \"\",IF(D14=0, 'Basic Input'!$C$5, IF('Basic Input'!$C$7=\"Increasing\", 'Basic Input'!$C$5+(D14/5280), 'Basic Input'!$C$5-(D14/5280))))","v":5.3310606060606061},null,null,null,null,null,null,1,null,"Enter all reported crashes by type using either the distance from the reference point of mile post information.  Locations must be grouped to the nearest 100-foot location (100-foot \"bins').  Enter the number of crashes occurring at that location (could be more than one)."]
[0,10,0,{"$f":"IF(D14=\"\", \"\", IF(D14+100<='Basic Input'!$Q$14+'Basic Input'!$Q$9, D14+100, \"\"))","v":0},{"$f":"IF(D15=\"\", \"\",IF(D15=0, 'Basic Input'!$C$5, IF('Basic Input'!$C$7=\"Increasing\", 'Basic Input'!$C$5+(D15/5280), 'Basic Input'!$C$5-(D15/5280))))","v":5.35},null,null,null,1,2,null,2]
[1,11,1.893939E-2,{"$f":"IF(D15=\"\", \"\", IF(D15+100<='Basic Input'!$Q$14+'Basic Input'!$Q$9, D15+100, \"\"))","v":100},{"$f":"IF(D16=\"\", \"\",IF(D16=0, 'Basic Input'!$C$5, IF('Basic Input'!$C$7=\"Increasing\", 'Basic Input'!$C$5+(D16/5280), 'Basic Input'!$C$5-(D16/5280))))","v":5.3689393939393932},null,34,30]
[1,12,3.7878780000000001E-2,{"$f":"IF(D16=\"\", \"\", IF(D16+100<='Basic Input'!$Q$14+'Basic Input'!$Q$9, D16+100, \"\"))","v":200},{"$f":"IF(D17=\"\", \"\",IF(D17=0, 'Basic Input'!$C$5, IF('Basic Input'!$C$7=\"Increasing\", 'Basic Input'!$C$5+(D17/5280), 'Basic Input'!$C$5-(D17/5280))))","v":5.3878787878787877},null,null,null,null,null,null,1]
[1,13,5.6818170000000001E-2,{"$f":"IF(D17=\"\", \"\", IF(D17+100<='Basic Input'!$Q$14+'Basic Input'!$Q$9, D17+100, \"\"))","v":300},{"$f":"IF(D18=\"\", \"\",IF(D18=0, 'Basic Input'!$C$5, IF('Basic Input'!$C$7=\"Increasing\", 'Basic Input'!$C$5+(D18/5280), 'Basic Input'!$C$5-(D18/5280))))","v":5.4068181818181813}]
[1,14,7.5757560000000002E-2,{"$f":"IF(D18=\"\", \"\", IF(D18+100<='Basic Input'!$Q$14+'Basic Input'!$Q$9, D18+100, \"\"))","v":400},{"$f":"IF(D19=\"\", \"\",IF(D19=0, 'Basic Input'!$C$5, IF('Basic Input'!$C$7=\"Increasing\", 'Basic Input'!$C$5+(D19/5280), 'Basic Input'!$C$5-(D19/5280))))","v":5.4257575757575758},null,null,null,1,null,null,1,null,"Access Points"]
[2,15,9.4696950000000002E-2,{"$f":"IF(D19=\"\", \"\", IF(D19+100<='Basic Input'!$Q$14+'Basic Input'!$Q$9, D19+100, \"\"))","v":500},{"$f":"IF(D20=\"\", \"\",IF(D20=0, 'Basic Input'!$C$5, IF('Basic Input'!$C$7=\"Increasing\", 'Basic Input'!$C$5+(D20/5280), 'Basic Input'!$C$5-(D20/5280))))","v":5.4446969696969694},null,38,33,null,null,null,null,null,"Enter the number of access points (on both sides of the roadway).  Count all active driveways and streets, but do not count inactive/unused locations.  Similar to the crash data, it is necessary to group access points into 100-foot \"bins\".  There could be more than one access point in a particular 100-foot stretch of roadway."]
[2,16,0.11363634,{"$f":"IF(D20=\"\", \"\", IF(D20+100<='Basic Input'!$Q$14+'Basic Input'!$Q$9, D20+100, \"\"))","v":600},{"$f":"IF(D21=\"\", \"\",IF(D21=0, 'Basic Input'!$C$5, IF('Basic Input'!$C$7=\"Increasing\", 'Basic Input'!$C$5+(D21/5280), 'Basic Input'!$C$5-(D21/5280))))","v":5.463636363636363}]
[2,17,0.13257573,{"$f":"IF(D21=\"\", \"\", IF(D21+100<='Basic Input'!$Q$14+'Basic Input'!$Q$9, D21+100, \"\"))","v":700},{"$f":"IF(D22=\"\", \"\",IF(D22=0, 'Basic Input'!$C$5, IF('Basic Input'!$C$7=\"Increasing\", 'Basic Input'!$C$5+(D22/5280), 'Basic Input'!$C$5-(D22/5280))))","v":5.4825757575757574}]
[2,18,0.15151512,{"$f":"IF(D22=\"\", \"\", IF(D22+100<='Basic Input'!$Q$14+'Basic Input'!$Q$9, D22+100, \"\"))","v":800},{"$f":"IF(D23=\"\", \"\",IF(D23=0, 'Basic Input'!$C$5, IF('Basic Input'!$C$7=\"Increasing\", 'Basic Input'!$C$5+(D23/5280), 'Basic Input'!$C$5-(D23/5280))))","v":5.501515151515151},null,null,null,1,null,null,1]
[2,19,0.17045451,{"$f":"IF(D23=\"\", \"\", IF(D23+100<='Basic Input'!$Q$14+'Basic Input'!$Q$9, D23+100, \"\"))","v":900},{"$f":"IF(D24=\"\", \"\",IF(D24=0, 'Basic Input'!$C$5, IF('Basic Input'!$C$7=\"Increasing\", 'Basic Input'!$C$5+(D24/5280), 'Basic Input'!$C$5-(D24/5280))))","v":5.5204545454545455},30]
[2,21,0.1893939,{"$f":"IF(D24=\"\", \"\", IF(D24+100<='Basic Input'!$Q$14+'Basic Input'!$Q$9, D24+100, \"\"))","v":1000},{"$f":"IF(D25=\"\", \"\",IF(D25=0, 'Basic Input'!$C$5, IF('Basic Input'!$C$7=\"Increasing\", 'Basic Input'!$C$5+(D25/5280), 'Basic Input'!$C$5-(D25/5280))))","v":5.5393939393939391}]
[2,22,0.20833329,{"$f":"IF(D25=\"\", \"\", IF(D25+100<='Basic Input'!$Q$14+'Basic Input'!$Q$9, D25+100, \"\"))","v":1100},{"$f":"IF(D26=\"\", \"\",IF(D26=0, 'Basic Input'!$C$5, IF('Basic Input'!$C$7=\"Increasing\", 'Basic Input'!$C$5+(D26/5280), 'Basic Input'!$C$5-(D26/5280))))","v":5.5583333333333327}]
[3,23,0.22727268,{"$f":"IF(D26=\"\", \"\", IF(D26+100<='Basic Input'!$Q$14+'Basic Input'!$Q$9, D26+100, \"\"))","v":1200},{"$f":"IF(D27=\"\", \"\",IF(D27=0, 'Basic Input'!$C$5, IF('Basic Input'!$C$7=\"Increasing\", 'Basic Input'!$C$5+(D27/5280), 'Basic Input'!$C$5-(D27/5280))))","v":5.5772727272727272},null,null,42.071199999999997]
[3,24,0.24621207000000001,{"$f":"IF(D27=\"\", \"\", IF(D27+100<='Basic Input'!$Q$14+'Basic Input'!$Q$9, D27+100, \"\"))","v":1300},{"$f":"IF(D28=\"\", \"\",IF(D28=0, 'Basic Input'!$C$5, IF('Basic Input'!$C$7=\"Increasing\", 'Basic Input'!$C$5+(D28/5280), 'Basic Input'!$C$5-(D28/5280))))","v":5.5962121212121207},null,null,null,null,null,null,1]
[3,25,0.26515146000000001,{"$f":"IF(D28=\"\", \"\", IF(D28+100<='Basic Input'!$Q$14+'Basic Input'!$Q$9, D28+100, \"\"))","v":1400},{"$f":"IF(D29=\"\", \"\",IF(D29=0, 'Basic Input'!$C$5, IF('Basic Input'!$C$7=\"Increasing\", 'Basic Input'!$C$5+(D29/5280), 'Basic Input'!$C$5-(D29/5280))))","v":5.6151515151515152}]
[3,26,0.28409085000000001,{"$f":"IF(D29=\"\", \"\", IF(D29+100<='Basic Input'!$Q$14+'Basic Input'!$Q$9, D29+100, \"\"))","v":1500},{"$f":"IF(D30=\"\", \"\",IF(D30=0, 'Basic Input'!$C$5, IF('Basic Input'!$C$7=\"Increasing\", 'Basic Input'!$C$5+(D30/5280), 'Basic Input'!$C$5-(D30/5280))))","v":5.6340909090909088}]
[4,27,0.30303024000000001,{"$f":"IF(D30=\"\", \"\", IF(D30+100<='Basic Input'!$Q$14+'Basic Input'!$Q$9, D30+100, \"\"))","v":1600},{"$f":"IF(D31=\"\", \"\",IF(D31=0, 'Basic Input'!$C$5, IF('Basic Input'!$C$7=\"Increasing\", 'Basic Input'!$C$5+(D31/5280), 'Basic Input'!$C$5-(D31/5280))))","v":5.6530303030303024},null,null,48.978700000000003]
[4,28,0.32196963000000001,{"$f":"IF(D31=\"\", \"\", IF(D31+100<='Basic Input'!$Q$14+'Basic Input'!$Q$9, D31+100, \"\"))","v":1700},{"$f":"IF(D32=\"\", \"\",IF(D32=0, 'Basic Input'!$C$5, IF('Basic Input'!$C$7=\"Increasing\", 'Basic Input'!$C$5+(D32/5280), 'Basic Input'!$C$5-(D32/5280))))","v":5.6719696969696969}]
[4,29,0.34090902000000001,{"$f":"IF(D32=\"\", \"\", IF(D32+100<='Basic Input'!$Q$14+'Basic Input'!$Q$9, D32+100, \"\"))","v":1800},{"$f":"IF(D33=\"\", \"\",IF(D33=0, 'Basic Input'!$C$5, IF('Basic Input'!$C$7=\"Increasing\", 'Basic Input'!$C$5+(D33/5280), 'Basic Input'!$C$5-(D33/5280))))","v":5.6909090909090905}]
[4,30,0.35984841000000001,{"$f":"IF(D33=\"\", \"\", IF(D33+100<='Basic Input'!$Q$14+'Basic Input'!$Q$9, D33+100, \"\"))","v":1900},{"$f":"IF(D34=\"\", \"\",IF(D34=0, 'Basic Input'!$C$5, IF('Basic Input'!$C$7=\"Increasing\", 'Basic Input'!$C$5+(D34/5280), 'Basic Input'!$C$5-(D34/5280))))","v":5.7098484848484841}]
[4,31,0.37878780000000001,{"$f":"IF(D34=\"\", \"\", IF(D34+100<='Basic Input'!$Q$14+'Basic Input'!$Q$9, D34+100, \"\"))","v":2000},{"$f":"IF(D35=\"\", \"\",IF(D35=0, 'Basic Input'!$C$5, IF('Basic Input'!$C$7=\"Increasing\", 'Basic Input'!$C$5+(D35/5280), 'Basic Input'!$C$5-(D35/5280))))","v":5.7287878787878785}]
[4,32,0.39772719000000001,{"$f":"IF(D35=\"\", \"\", IF(D35+100<='Basic Input'!$Q$14+'Basic Input'!$Q$9, D35+100, \"\"))","v":2100},{"$f":"IF(D36=\"\", \"\",IF(D36=0, 'Basic Input'!$C$5, IF('Basic Input'!$C$7=\"Increasing\", 'Basic Input'!$C$5+(D36/5280), 'Basic Input'!$C$5-(D36/5280))))","v":5.7477272727272721}]
[4,33,0.41666658000000001,{"$f":"IF(D36=\"\", \"\", IF(D36+100<='Basic Input'!$Q$14+'Basic Input'!$Q$9, D36+100, \"\"))","v":2200},{"$f":"IF(D37=\"\", \"\",IF(D37=0, 'Basic Input'!$C$5, IF('Basic Input'!$C$7=\"Increasing\", 'Basic Input'!$C$5+(D37/5280), 'Basic Input'!$C$5-(D37/5280))))","v":5.7666666666666666},50,null,null,1]
[4,35,0.43560597000000001,{"$f":"IF(D37=\"\", \"\", IF(D37+100<='Basic Input'!$Q$14+'Basic Input'!$Q$9, D37+100, \"\"))","v":2300},{"$f":"IF(D38=\"\", \"\",IF(D38=0, 'Basic Input'!$C$5, IF('Basic Input'!$C$7=\"Increasing\", 'Basic Input'!$C$5+(D38/5280), 'Basic Input'!$C$5-(D38/5280))))","v":5.7856060606060602}]
[4,36,0.45454536000000001,{"$f":"IF(D38=\"\", \"\", IF(D38+100<='Basic Input'!$Q$14+'Basic Input'!$Q$9, D38+100, \"\"))","v":2400},{"$f":"IF(D39=\"\", \"\",IF(D39=0, 'Basic Input'!$C$5, IF('Basic Input'!$C$7=\"Increasing\", 'Basic Input'!$C$5+(D39/5280), 'Basic Input'!$C$5-(D39/5280))))","v":5.8045454545454538}]
[5,37,0.47348475000000001,{"$f":"IF(D39=\"\", \"\", IF(D39+100<='Basic Input'!$Q$14+'Basic Input'!$Q$9, D39+100, \"\"))","v":2500},{"$f":"IF(D40=\"\", \"\",IF(D40=0, 'Basic Input'!$C$5, IF('Basic Input'!$C$7=\"Increasing\", 'Basic Input'!$C$5+(D40/5280), 'Basic Input'!$C$5-(D40/5280))))","v":5.8234848484848483},null,64,58]
[5,38,0.49242414000000001,{"$f":"IF(D40=\"\", \"\", IF(D40+100<='Basic Input'!$Q$14+'Basic Input'!$Q$9, D40+100, \"\"))","v":2600},{"$f":"IF(D41=\"\", \"\",IF(D41=0, 'Basic Input'!$C$5, IF('Basic Input'!$C$7=\"Increasing\", 'Basic Input'!$C$5+(D41/5280), 'Basic Input'!$C$5-(D41/5280))))","v":5.8424242424242419}]
[5,39,0.51136353000000001,{"$f":"IF(D41=\"\", \"\", IF(D41+100<='Basic Input'!$Q$14+'Basic Input'!$Q$9, D41+100, \"\"))","v":2700},{"$f":"IF(D42=\"\", \"\",IF(D42=0, 'Basic Input'!$C$5, IF('Basic Input'!$C$7=\"Increasing\", 'Basic Input'!$C$5+(D42/5280), 'Basic Input'!$C$5-(D42/5280))))","v":5.8613636363636363},null,null,null,null,null,null,1]
[5,{"$f":"IF(F42=\"\", B42+1, B42+2)","v":40},0.53030292000000001,{"$f":"IF(D42=\"\", \"\", IF(D42+100<='Basic Input'!$Q$14+'Basic Input'!$Q$9, D42+100, \"\"))","v":2800},{"$f":"IF(D43=\"\", \"\",IF(D43=0, 'Basic Input'!$C$5, IF('Basic Input'!$C$7=\"Increasing\", 'Basic Input'!$C$5+(D43/5280), 'Basic Input'!$C$5-(D43/5280))))","v":5.8803030303030299}]
[5,41,0.54924231000000001,{"$f":"IF(D43=\"\", \"\", IF(D43+100<='Basic Input'!$Q$14+'Basic Input'!$Q$9, D43+100, \"\"))","v":2900},{"$f":"IF(D44=\"\", \"\",IF(D44=0, 'Basic Input'!$C$5, IF('Basic Input'!$C$7=\"Increasing\", 'Basic Input'!$C$5+(D44/5280), 'Basic Input'!$C$5-(D44/5280))))","v":5.8992424242424235}]
[5,42,0.56818170000000001,{"$f":"IF(D44=\"\", \"\", IF(D44+100<='Basic Input'!$Q$14+'Basic Input'!$Q$9, D44+100, \"\"))","v":3000},{"$f":"IF(D45=\"\", \"\",IF(D45=0, 'Basic Input'!$C$5, IF('Basic Input'!$C$7=\"Increasing\", 'Basic Input'!$C$5+(D45/5280), 'Basic Input'!$C$5-(D45/5280))))","v":5.918181818181818}]
[5,43,0.58712109000000001,{"$f":"IF(D45=\"\", \"\", IF(D45+100<='Basic Input'!$Q$14+'Basic Input'!$Q$9, D45+100, \"\"))","v":3100},{"$f":"IF(D46=\"\", \"\",IF(D46=0, 'Basic Input'!$C$5, IF('Basic Input'!$C$7=\"Increasing\", 'Basic Input'!$C$5+(D46/5280), 'Basic Input'!$C$5-(D46/5280))))","v":5.9371212121212116},65]
[5,45,0.60606048000000001,{"$f":"IF(D46=\"\", \"\", IF(D46+100<='Basic Input'!$Q$14+'Basic Input'!$Q$9, D46+100, \"\"))","v":3200},{"$f":"IF(D47=\"\", \"\",IF(D47=0, 'Basic Input'!$C$5, IF('Basic Input'!$C$7=\"Increasing\", 'Basic Input'!$C$5+(D47/5280), 'Basic Input'!$C$5-(D47/5280))))","v":5.9560606060606061}]
[5,46,0.62499987000000001,{"$f":"IF(D47=\"\", \"\", IF(D47+100<='Basic Input'!$Q$14+'Basic Input'!$Q$9, D47+100, \"\"))","v":3300},{"$f":"IF(D48=\"\", \"\",IF(D48=0, 'Basic Input'!$C$5, IF('Basic Input'!$C$7=\"Increasing\", 'Basic Input'!$C$5+(D48/5280), 'Basic Input'!$C$5-(D48/5280))))","v":5.9749999999999996}]
[5,47,0.64393926000000001,{"$f":"IF(D48=\"\", \"\", IF(D48+100<='Basic Input'!$Q$14+'Basic Input'!$Q$9, D48+100, \"\"))","v":3400},{"$f":"IF(D49=\"\", \"\",IF(D49=0, 'Basic Input'!$C$5, IF('Basic Input'!$C$7=\"Increasing\", 'Basic Input'!$C$5+(D49/5280), 'Basic Input'!$C$5-(D49/5280))))","v":5.9939393939393932}]
[5,48,0.66287865000000001,{"$f":"IF(D49=\"\", \"\", IF(D49+100<='Basic Input'!$Q$14+'Basic Input'!$Q$9, D49+100, \"\"))","v":3500},{"$f":"IF(D50=\"\", \"\",IF(D50=0, 'Basic Input'!$C$5, IF('Basic Input'!$C$7=\"Increasing\", 'Basic Input'!$C$5+(D50/5280), 'Basic Input'!$C$5-(D50/5280))))","v":6.0128787878787877}]
[5,49,"",{"$f":"IF(D50=\"\", \"\", IF(D50+100<='Basic Input'!$Q$14+'Basic Input'!$Q$9, D50+100, \"\"))","v":""},{"$f":"IF(D51=\"\", \"\",IF(D51=0, 'Basic Input'!$C$5, IF('Basic Input'!$C$7=\"Increasing\", 'Basic Input'!$C$5+(D51/5280), 'Basic Input'!$C$5-(D51/5280))))","v":""}]
[5,50,"",{"$f":"IF(D51=\"\", \"\", IF(D51+100<='Basic Input'!$Q$14+'Basic Input'!$Q$9, D51+100, \"\"))","v":""},{"$f":"IF(D52=\"\", \"\",IF(D52=0, 'Basic Input'!$C$5, IF('Basic Input'!$C$7=\"Increasing\", 'Basic Input'!$C$5+(D52/5280), 'Basic Input'!$C$5-(D52/5280))))","v":""}]
[5,51,"",{"$f":"IF(D52=\"\", \"\", IF(D52+100<='Basic Input'!$Q$14+'Basic Input'!$Q$9, D52+100, \"\"))","v":""},{"$f":"IF(D53=\"\", \"\",IF(D53=0, 'Basic Input'!$C$5, IF('Basic Input'!$C$7=\"Increasing\", 'Basic Input'!$C$5+(D53/5280), 'Basic Input'!$C$5-(D53/5280))))","v":""}]
[5,52,"",{"$f":"IF(D53=\"\", \"\", IF(D53+100<='Basic Input'!$Q$14+'Basic Input'!$Q$9, D53+100, \"\"))","v":""},{"$f":"IF(D54=\"\", \"\",IF(D54=0, 'Basic Input'!$C$5, IF('Basic Input'!$C$7=\"Increasing\", 'Basic Input'!$C$5+(D54/5280), 'Basic Input'!$C$5-(D54/5280))))","v":""}]
[5,53,"",{"$f":"IF(D54=\"\", \"\", IF(D54+100<='Basic Input'!$Q$14+'Basic Input'!$Q$9, D54+100, \"\"))","v":""},{"$f":"IF(D55=\"\", \"\",IF(D55=0, 'Basic Input'!$C$5, IF('Basic Input'!$C$7=\"Increasing\", 'Basic Input'!$C$5+(D55/5280), 'Basic Input'!$C$5-(D55/5280))))","v":""}]
[5,54,"",{"$f":"IF(D55=\"\", \"\", IF(D55+100<='Basic Input'!$Q$14+'Basic Input'!$Q$9, D55+100, \"\"))","v":""},{"$f":"IF(D56=\"\", \"\",IF(D56=0, 'Basic Input'!$C$5, IF('Basic Input'!$C$7=\"Increasing\", 'Basic Input'!$C$5+(D56/5280), 'Basic Input'!$C$5-(D56/5280))))","v":""}]
[5,55,"",{"$f":"IF(D56=\"\", \"\", IF(D56+100<='Basic Input'!$Q$14+'Basic Input'!$Q$9, D56+100, \"\"))","v":""},{"$f":"IF(D57=\"\", \"\",IF(D57=0, 'Basic Input'!$C$5, IF('Basic Input'!$C$7=\"Increasing\", 'Basic Input'!$C$5+(D57/5280), 'Basic Input'!$C$5-(D57/5280))))","v":""}]
[5,56,"",{"$f":"IF(D57=\"\", \"\", IF(D57+100<='Basic Input'!$Q$14+'Basic Input'!$Q$9, D57+100, \"\"))","v":""},{"$f":"IF(D58=\"\", \"\",IF(D58=0, 'Basic Input'!$C$5, IF('Basic Input'!$C$7=\"Increasing\", 'Basic Input'!$C$5+(D58/5280), 'Basic Input'!$C$5-(D58/5280))))","v":""}]
[5,57,"",{"$f":"IF(D58=\"\", \"\", IF(D58+100<='Basic Input'!$Q$14+'Basic Input'!$Q$9, D58+100, \"\"))","v":""},{"$f":"IF(D59=\"\", \"\",IF(D59=0, 'Basic Input'!$C$5, IF('Basic Input'!$C$7=\"Increasing\", 'Basic Input'!$C$5+(D59/5280), 'Basic Input'!$C$5-(D59/5280))))","v":""}]
[5,58,"",{"$f":"IF(D59=\"\", \"\", IF(D59+100<='Basic Input'!$Q$14+'Basic Input'!$Q$9, D59+100, \"\"))","v":""},{"$f":"IF(D60=\"\", \"\",IF(D60=0, 'Basic Input'!$C$5, IF('Basic Input'!$C$7=\"Increasing\", 'Basic Input'!$C$5+(D60/5280), 'Basic Input'!$C$5-(D60/5280))))","v":""}]
[5,59,"",{"$f":"IF(D60=\"\", \"\", IF(D60+100<='Basic Input'!$Q$14+'Basic Input'!$Q$9, D60+100, \"\"))","v":""},{"$f":"IF(D61=\"\", \"\",IF(D61=0, 'Basic Input'!$C$5, IF('Basic Input'!$C$7=\"Increasing\", 'Basic Input'!$C$5+(D61/5280), 'Basic Input'!$C$5-(D61/5280))))","v":""}]
[5,60,"",{"$f":"IF(D61=\"\", \"\", IF(D61+100<='Basic Input'!$Q$14+'Basic Input'!$Q$9, D61+100, \"\"))","v":""},{"$f":"IF(D62=\"\", \"\",IF(D62=0, 'Basic Input'!$C$5, IF('Basic Input'!$C$7=\"Increasing\", 'Basic Input'!$C$5+(D62/5280), 'Basic Input'!$C$5-(D62/5280))))","v":""}]
[5,61,"",{"$f":"IF(D62=\"\", \"\", IF(D62+100<='Basic Input'!$Q$14+'Basic Input'!$Q$9, D62+100, \"\"))","v":""},{"$f":"IF(D63=\"\", \"\",IF(D63=0, 'Basic Input'!$C$5, IF('Basic Input'!$C$7=\"Increasing\", 'Basic Input'!$C$5+(D63/5280), 'Basic Input'!$C$5-(D63/5280))))","v":""}]
[5,62,"",{"$f":"IF(D63=\"\", \"\", IF(D63+100<='Basic Input'!$Q$14+'Basic Input'!$Q$9, D63+100, \"\"))","v":""},{"$f":"IF(D64=\"\", \"\",IF(D64=0, 'Basic Input'!$C$5, IF('Basic Input'!$C$7=\"Increasing\", 'Basic Input'!$C$5+(D64/5280), 'Basic Input'!$C$5-(D64/5280))))","v":""}]
[5,63,"",{"$f":"IF(D64=\"\", \"\", IF(D64+100<='Basic Input'!$Q$14+'Basic Input'!$Q$9, D64+100, \"\"))","v":""},{"$f":"IF(D65=\"\", \"\",IF(D65=0, 'Basic Input'!$C$5, IF('Basic Input'!$C$7=\"Increasing\", 'Basic Input'!$C$5+(D65/5280), 'Basic Input'!$C$5-(D65/5280))))","v":""}]
[5,64,"",{"$f":"IF(D65=\"\", \"\", IF(D65+100<='Basic Input'!$Q$14+'Basic Input'!$Q$9, D65+100, \"\"))","v":""},{"$f":"IF(D66=\"\", \"\",IF(D66=0, 'Basic Input'!$C$5, IF('Basic Input'!$C$7=\"Increasing\", 'Basic Input'!$C$5+(D66/5280), 'Basic Input'!$C$5-(D66/5280))))","v":""}]
[5,65,"",{"$f":"IF(D66=\"\", \"\", IF(D66+100<='Basic Input'!$Q$14+'Basic Input'!$Q$9, D66+100, \"\"))","v":""},{"$f":"IF(D67=\"\", \"\",IF(D67=0, 'Basic Input'!$C$5, IF('Basic Input'!$C$7=\"Increasing\", 'Basic Input'!$C$5+(D67/5280), 'Basic Input'!$C$5-(D67/5280))))","v":""}]
[5,66,"",{"$f":"IF(D67=\"\", \"\", IF(D67+100<='Basic Input'!$Q$14+'Basic Input'!$Q$9, D67+100, \"\"))","v":""},{"$f":"IF(D68=\"\", \"\",IF(D68=0, 'Basic Input'!$C$5, IF('Basic Input'!$C$7=\"Increasing\", 'Basic Input'!$C$5+(D68/5280), 'Basic Input'!$C$5-(D68/5280))))","v":""}]
[5,67,"",{"$f":"IF(D68=\"\", \"\", IF(D68+100<='Basic Input'!$Q$14+'Basic Input'!$Q$9, D68+100, \"\"))","v":""},{"$f":"IF(D69=\"\", \"\",IF(D69=0, 'Basic Input'!$C$5, IF('Basic Input'!$C$7=\"Increasing\", 'Basic Input'!$C$5+(D69/5280), 'Basic Input'!$C$5-(D69/5280))))","v":""}]
[{"$f":"IF(H70<>\"\", A69+1, A69)","v":5},68,{"$f":"IF(D70=\"\", \"\", D70*0.0001893939)","v":""},{"$f":"IF(D69=\"\", \"\", IF(D69+100<='Basic Input'!$Q$14+'Basic Input'!$Q$9, D69+100, \"\"))","v":""},{"$f":"IF(D70=\"\", \"\",IF(D70=0, 'Basic Input'!$C$5, IF('Basic Input'!$C$7=\"Increasing\", 'Basic Input'!$C$5+(D70/5280), 'Basic Input'!$C$5-(D70/5280))))","v":""}]
[5,{"$f":"IF(F70=\"\", B70+1, B70+2)","v":69},"",{"$f":"IF(D70=\"\", \"\", IF(D70+100<='Basic Input'!$Q$14+'Basic Input'!$Q$9, D70+100, \"\"))","v":""},{"$f":"IF(D71=\"\", \"\",IF(D71=0, 'Basic Input'!$C$5, IF('Basic Input'!$C$7=\"Increasing\", 'Basic Input'!$C$5+(D71/5280), 'Basic Input'!$C$5-(D71/5280))))","v":""}]
[5,70,"",{"$f":"IF(D71=\"\", \"\", IF(D71+100<='Basic Input'!$Q$14+'Basic Input'!$Q$9, D71+100, \"\"))","v":""},{"$f":"IF(D72=\"\", \"\",IF(D72=0, 'Basic Input'!$C$5, IF('Basic Input'!$C$7=\"Increasing\", 'Basic Input'!$C$5+(D72/5280), 'Basic Input'!$C$5-(D72/5280))))","v":""}]
[5,71,"",{"$f":"IF(D72=\"\", \"\", IF(D72+100<='Basic Input'!$Q$14+'Basic Input'!$Q$9, D72+100, \"\"))","v":""},{"$f":"IF(D73=\"\", \"\",IF(D73=0, 'Basic Input'!$C$5, IF('Basic Input'!$C$7=\"Increasing\", 'Basic Input'!$C$5+(D73/5280), 'Basic Input'!$C$5-(D73/5280))))","v":""}]
[5,72,"",{"$f":"IF(D73=\"\", \"\", IF(D73+100<='Basic Input'!$Q$14+'Basic Input'!$Q$9, D73+100, \"\"))","v":""},{"$f":"IF(D74=\"\", \"\",IF(D74=0, 'Basic Input'!$C$5, IF('Basic Input'!$C$7=\"Increasing\", 'Basic Input'!$C$5+(D74/5280), 'Basic Input'!$C$5-(D74/5280))))","v":""}]
[5,73,"",{"$f":"IF(D74=\"\", \"\", IF(D74+100<='Basic Input'!$Q$14+'Basic Input'!$Q$9, D74+100, \"\"))","v":""},{"$f":"IF(D75=\"\", \"\",IF(D75=0, 'Basic Input'!$C$5, IF('Basic Input'!$C$7=\"Increasing\", 'Basic Input'!$C$5+(D75/5280), 'Basic Input'!$C$5-(D75/5280))))","v":""}]
[5,74,"",{"$f":"IF(D75=\"\", \"\", IF(D75+100<='Basic Input'!$Q$14+'Basic Input'!$Q$9, D75+100, \"\"))","v":""},{"$f":"IF(D76=\"\", \"\",IF(D76=0, 'Basic Input'!$C$5, IF('Basic Input'!$C$7=\"Increasing\", 'Basic Input'!$C$5+(D76/5280), 'Basic Input'!$C$5-(D76/5280))))","v":""}]
[5,75,"",{"$f":"IF(D76=\"\", \"\", IF(D76+100<='Basic Input'!$Q$14+'Basic Input'!$Q$9, D76+100, \"\"))","v":""},{"$f":"IF(D77=\"\", \"\",IF(D77=0, 'Basic Input'!$C$5, IF('Basic Input'!$C$7=\"Increasing\", 'Basic Input'!$C$5+(D77/5280), 'Basic Input'!$C$5-(D77/5280))))","v":""}]
[5,76,"",{"$f":"IF(D77=\"\", \"\", IF(D77+100<='Basic Input'!$Q$14+'Basic Input'!$Q$9, D77+100, \"\"))","v":""},{"$f":"IF(D78=\"\", \"\",IF(D78=0, 'Basic Input'!$C$5, IF('Basic Input'!$C$7=\"Increasing\", 'Basic Input'!$C$5+(D78/5280), 'Basic Input'!$C$5-(D78/5280))))","v":""}]
[5,77,"",{"$f":"IF(D78=\"\", \"\", IF(D78+100<='Basic Input'!$Q$14+'Basic Input'!$Q$9, D78+100, \"\"))","v":""},{"$f":"IF(D79=\"\", \"\",IF(D79=0, 'Basic Input'!$C$5, IF('Basic Input'!$C$7=\"Increasing\", 'Basic Input'!$C$5+(D79/5280), 'Basic Input'!$C$5-(D79/5280))))","v":""}]
[5,78,"",{"$f":"IF(D79=\"\", \"\", IF(D79+100<='Basic Input'!$Q$14+'Basic Input'!$Q$9, D79+100, \"\"))","v":""},{"$f":"IF(D80=\"\", \"\",IF(D80=0, 'Basic Input'!$C$5, IF('Basic Input'!$C$7=\"Increasing\", 'Basic Input'!$C$5+(D80/5280), 'Basic Input'!$C$5-(D80/5280))))","v":""}]
[5,79,"",{"$f":"IF(D80=\"\", \"\", IF(D80+100<='Basic Input'!$Q$14+'Basic Input'!$Q$9, D80+100, \"\"))","v":""},{"$f":"IF(D81=\"\", \"\",IF(D81=0, 'Basic Input'!$C$5, IF('Basic Input'!$C$7=\"Increasing\", 'Basic Input'!$C$5+(D81/5280), 'Basic Input'!$C$5-(D81/5280))))","v":""}]
[5,80,"",{"$f":"IF(D81=\"\", \"\", IF(D81+100<='Basic Input'!$Q$14+'Basic Input'!$Q$9, D81+100, \"\"))","v":""},{"$f":"IF(D82=\"\", \"\",IF(D82=0, 'Basic Input'!$C$5, IF('Basic Input'!$C$7=\"Increasing\", 'Basic Input'!$C$5+(D82/5280), 'Basic Input'!$C$5-(D82/5280))))","v":""}]
[5,81,"",{"$f":"IF(D82=\"\", \"\", IF(D82+100<='Basic Input'!$Q$14+'Basic Input'!$Q$9, D82+100, \"\"))","v":""},{"$f":"IF(D83=\"\", \"\",IF(D83=0, 'Basic Input'!$C$5, IF('Basic Input'!$C$7=\"Increasing\", 'Basic Input'!$C$5+(D83/5280), 'Basic Input'!$C$5-(D83/5280))))","v":""}]
[5,82,"",{"$f":"IF(D83=\"\", \"\", IF(D83+100<='Basic Input'!$Q$14+'Basic Input'!$Q$9, D83+100, \"\"))","v":""},{"$f":"IF(D84=\"\", \"\",IF(D84=0, 'Basic Input'!$C$5, IF('Basic Input'!$C$7=\"Increasing\", 'Basic Input'!$C$5+(D84/5280), 'Basic Input'!$C$5-(D84/5280))))","v":""}]
[5,83,"",{"$f":"IF(D84=\"\", \"\", IF(D84+100<='Basic Input'!$Q$14+'Basic Input'!$Q$9, D84+100, \"\"))","v":""},{"$f":"IF(D85=\"\", \"\",IF(D85=0, 'Basic Input'!$C$5, IF('Basic Input'!$C$7=\"Increasing\", 'Basic Input'!$C$5+(D85/5280), 'Basic Input'!$C$5-(D85/5280))))","v":""}]
[5,84,"",{"$f":"IF(D85=\"\", \"\", IF(D85+100<='Basic Input'!$Q$14+'Basic Input'!$Q$9, D85+100, \"\"))","v":""},{"$f":"IF(D86=\"\", \"\",IF(D86=0, 'Basic Input'!$C$5, IF('Basic Input'!$C$7=\"Increasing\", 'Basic Input'!$C$5+(D86/5280), 'Basic Input'!$C$5-(D86/5280))))","v":""}]
[5,85,"",{"$f":"IF(D86=\"\", \"\", IF(D86+100<='Basic Input'!$Q$14+'Basic Input'!$Q$9, D86+100, \"\"))","v":""},{"$f":"IF(D87=\"\", \"\",IF(D87=0, 'Basic Input'!$C$5, IF('Basic Input'!$C$7=\"Increasing\", 'Basic Input'!$C$5+(D87/5280), 'Basic Input'!$C$5-(D87/5280))))","v":""}]
[5,86,"",{"$f":"IF(D87=\"\", \"\", IF(D87+100<='Basic Input'!$Q$14+'Basic Input'!$Q$9, D87+100, \"\"))","v":""},{"$f":"IF(D88=\"\", \"\",IF(D88=0, 'Basic Input'!$C$5, IF('Basic Input'!$C$7=\"Increasing\", 'Basic Input'!$C$5+(D88/5280), 'Basic Input'!$C$5-(D88/5280))))","v":""}]
[5,87,"",{"$f":"IF(D88=\"\", \"\", IF(D88+100<='Basic Input'!$Q$14+'Basic Input'!$Q$9, D88+100, \"\"))","v":""},{"$f":"IF(D89=\"\", \"\",IF(D89=0, 'Basic Input'!$C$5, IF('Basic Input'!$C$7=\"Increasing\", 'Basic Input'!$C$5+(D89/5280), 'Basic Input'!$C$5-(D89/5280))))","v":""}]
[5,88,"",{"$f":"IF(D89=\"\", \"\", IF(D89+100<='Basic Input'!$Q$14+'Basic Input'!$Q$9, D89+100, \"\"))","v":""},{"$f":"IF(D90=\"\", \"\",IF(D90=0, 'Basic Input'!$C$5, IF('Basic Input'!$C$7=\"Increasing\", 'Basic Input'!$C$5+(D90/5280), 'Basic Input'!$C$5-(D90/5280))))","v":""}]
[5,89,"",{"$f":"IF(D90=\"\", \"\", IF(D90+100<='Basic Input'!$Q$14+'Basic Input'!$Q$9, D90+100, \"\"))","v":""},{"$f":"IF(D91=\"\", \"\",IF(D91=0, 'Basic Input'!$C$5, IF('Basic Input'!$C$7=\"Increasing\", 'Basic Input'!$C$5+(D91/5280), 'Basic Input'!$C$5-(D91/5280))))","v":""}]
[5,90,"",{"$f":"IF(D91=\"\", \"\", IF(D91+100<='Basic Input'!$Q$14+'Basic Input'!$Q$9, D91+100, \"\"))","v":""},{"$f":"IF(D92=\"\", \"\",IF(D92=0, 'Basic Input'!$C$5, IF('Basic Input'!$C$7=\"Increasing\", 'Basic Input'!$C$5+(D92/5280), 'Basic Input'!$C$5-(D92/5280))))","v":""}]
[5,91,"",{"$f":"IF(D92=\"\", \"\", IF(D92+100<='Basic Input'!$Q$14+'Basic Input'!$Q$9, D92+100, \"\"))","v":""},{"$f":"IF(D93=\"\", \"\",IF(D93=0, 'Basic Input'!$C$5, IF('Basic Input'!$C$7=\"Increasing\", 'Basic Input'!$C$5+(D93/5280), 'Basic Input'!$C$5-(D93/5280))))","v":""}]
[5,92,"",{"$f":"IF(D93=\"\", \"\", IF(D93+100<='Basic Input'!$Q$14+'Basic Input'!$Q$9, D93+100, \"\"))","v":""},{"$f":"IF(D94=\"\", \"\",IF(D94=0, 'Basic Input'!$C$5, IF('Basic Input'!$C$7=\"Increasing\", 'Basic Input'!$C$5+(D94/5280), 'Basic Input'!$C$5-(D94/5280))))","v":""}]
[5,93,"",{"$f":"IF(D94=\"\", \"\", IF(D94+100<='Basic Input'!$Q$14+'Basic Input'!$Q$9, D94+100, \"\"))","v":""},{"$f":"IF(D95=\"\", \"\",IF(D95=0, 'Basic Input'!$C$5, IF('Basic Input'!$C$7=\"Increasing\", 'Basic Input'!$C$5+(D95/5280), 'Basic Input'!$C$5-(D95/5280))))","v":""}]
[5,94,"",{"$f":"IF(D95=\"\", \"\", IF(D95+100<='Basic Input'!$Q$14+'Basic Input'!$Q$9, D95+100, \"\"))","v":""},{"$f":"IF(D96=\"\", \"\",IF(D96=0, 'Basic Input'!$C$5, IF('Basic Input'!$C$7=\"Increasing\", 'Basic Input'!$C$5+(D96/5280), 'Basic Input'!$C$5-(D96/5280))))","v":""}]
[5,95,"",{"$f":"IF(D96=\"\", \"\", IF(D96+100<='Basic Input'!$Q$14+'Basic Input'!$Q$9, D96+100, \"\"))","v":""},{"$f":"IF(D97=\"\", \"\",IF(D97=0, 'Basic Input'!$C$5, IF('Basic Input'!$C$7=\"Increasing\", 'Basic Input'!$C$5+(D97/5280), 'Basic Input'!$C$5-(D97/5280))))","v":""}]
[5,96,"",{"$f":"IF(D97=\"\", \"\", IF(D97+100<='Basic Input'!$Q$14+'Basic Input'!$Q$9, D97+100, \"\"))","v":""},{"$f":"IF(D98=\"\", \"\",IF(D98=0, 'Basic Input'!$C$5, IF('Basic Input'!$C$7=\"Increasing\", 'Basic Input'!$C$5+(D98/5280), 'Basic Input'!$C$5-(D98/5280))))","v":""}]
[5,97,"",{"$f":"IF(D98=\"\", \"\", IF(D98+100<='Basic Input'!$Q$14+'Basic Input'!$Q$9, D98+100, \"\"))","v":""},{"$f":"IF(D99=\"\", \"\",IF(D99=0, 'Basic Input'!$C$5, IF('Basic Input'!$C$7=\"Increasing\", 'Basic Input'!$C$5+(D99/5280), 'Basic Input'!$C$5-(D99/5280))))","v":""}]
[5,98,"",{"$f":"IF(D99=\"\", \"\", IF(D99+100<='Basic Input'!$Q$14+'Basic Input'!$Q$9, D99+100, \"\"))","v":""},{"$f":"IF(D100=\"\", \"\",IF(D100=0, 'Basic Input'!$C$5, IF('Basic Input'!$C$7=\"Increasing\", 'Basic Input'!$C$5+(D100/5280), 'Basic Input'!$C$5-(D100/5280))))","v":""}]
[5,99,"",{"$f":"IF(D100=\"\", \"\", IF(D100+100<='Basic Input'!$Q$14+'Basic Input'!$Q$9, D100+100, \"\"))","v":""},{"$f":"IF(D101=\"\", \"\",IF(D101=0, 'Basic Input'!$C$5, IF('Basic Input'!$C$7=\"Increasing\", 'Basic Input'!$C$5+(D101/5280), 'Basic Input'!$C$5-(D101/5280))))","v":""}]
[5,100,"",{"$f":"IF(D101=\"\", \"\", IF(D101+100<='Basic Input'!$Q$14+'Basic Input'!$Q$9, D101+100, \"\"))","v":""},{"$f":"IF(D102=\"\", \"\",IF(D102=0, 'Basic Input'!$C$5, IF('Basic Input'!$C$7=\"Increasing\", 'Basic Input'!$C$5+(D102/5280), 'Basic Input'!$C$5-(D102/5280))))","v":""}]
[5,101,"",{"$f":"IF(D102=\"\", \"\", IF(D102+100<='Basic Input'!$Q$14+'Basic Input'!$Q$9, D102+100, \"\"))","v":""},{"$f":"IF(D103=\"\", \"\",IF(D103=0, 'Basic Input'!$C$5, IF('Basic Input'!$C$7=\"Increasing\", 'Basic Input'!$C$5+(D103/5280), 'Basic Input'!$C$5-(D103/5280))))","v":""}]
[5,102,"",{"$f":"IF(D103=\"\", \"\", IF(D103+100<='Basic Input'!$Q$14+'Basic Input'!$Q$9, D103+100, \"\"))","v":""},{"$f":"IF(D104=\"\", \"\",IF(D104=0, 'Basic Input'!$C$5, IF('Basic Input'!$C$7=\"Increasing\", 'Basic Input'!$C$5+(D104/5280), 'Basic Input'!$C$5-(D104/5280))))","v":""}]
[5,103,"",{"$f":"IF(D104=\"\", \"\", IF(D104+100<='Basic Input'!$Q$14+'Basic Input'!$Q$9, D104+100, \"\"))","v":""},{"$f":"IF(D105=\"\", \"\",IF(D105=0, 'Basic Input'!$C$5, IF('Basic Input'!$C$7=\"Increasing\", 'Basic Input'!$C$5+(D105/5280), 'Basic Input'!$C$5-(D105/5280))))","v":""}]
[5,104,"",{"$f":"IF(D105=\"\", \"\", IF(D105+100<='Basic Input'!$Q$14+'Basic Input'!$Q$9, D105+100, \"\"))","v":""},{"$f":"IF(D106=\"\", \"\",IF(D106=0, 'Basic Input'!$C$5, IF('Basic Input'!$C$7=\"Increasing\", 'Basic Input'!$C$5+(D106/5280), 'Basic Input'!$C$5-(D106/5280))))","v":""}]
[5,105,"",{"$f":"IF(D106=\"\", \"\", IF(D106+100<='Basic Input'!$Q$14+'Basic Input'!$Q$9, D106+100, \"\"))","v":""},{"$f":"IF(D107=\"\", \"\",IF(D107=0, 'Basic Input'!$C$5, IF('Basic Input'!$C$7=\"Increasing\", 'Basic Input'!$C$5+(D107/5280), 'Basic Input'!$C$5-(D107/5280))))","v":""}]
[5,106,"",{"$f":"IF(D107=\"\", \"\", IF(D107+100<='Basic Input'!$Q$14+'Basic Input'!$Q$9, D107+100, \"\"))","v":""},{"$f":"IF(D108=\"\", \"\",IF(D108=0, 'Basic Input'!$C$5, IF('Basic Input'!$C$7=\"Increasing\", 'Basic Input'!$C$5+(D108/5280), 'Basic Input'!$C$5-(D108/5280))))","v":""}]
[5,107,"",{"$f":"IF(D108=\"\", \"\", IF(D108+100<='Basic Input'!$Q$14+'Basic Input'!$Q$9, D108+100, \"\"))","v":""},{"$f":"IF(D109=\"\", \"\",IF(D109=0, 'Basic Input'!$C$5, IF('Basic Input'!$C$7=\"Increasing\", 'Basic Input'!$C$5+(D109/5280), 'Basic Input'!$C$5-(D109/5280))))","v":""}]
[5,108,"",{"$f":"IF(D109=\"\", \"\", IF(D109+100<='Basic Input'!$Q$14+'Basic Input'!$Q$9, D109+100, \"\"))","v":""},{"$f":"IF(D110=\"\", \"\",IF(D110=0, 'Basic Input'!$C$5, IF('Basic Input'!$C$7=\"Increasing\", 'Basic Input'!$C$5+(D110/5280), 'Basic Input'!$C$5-(D110/5280))))","v":""}]
[5,109,"",{"$f":"IF(D110=\"\", \"\", IF(D110+100<='Basic Input'!$Q$14+'Basic Input'!$Q$9, D110+100, \"\"))","v":""},{"$f":"IF(D111=\"\", \"\",IF(D111=0, 'Basic Input'!$C$5, IF('Basic Input'!$C$7=\"Increasing\", 'Basic Input'!$C$5+(D111/5280), 'Basic Input'!$C$5-(D111/5280))))","v":""}]
[5,110,"",{"$f":"IF(D111=\"\", \"\", IF(D111+100<='Basic Input'!$Q$14+'Basic Input'!$Q$9, D111+100, \"\"))","v":""},{"$f":"IF(D112=\"\", \"\",IF(D112=0, 'Basic Input'!$C$5, IF('Basic Input'!$C$7=\"Increasing\", 'Basic Input'!$C$5+(D112/5280), 'Basic Input'!$C$5-(D112/5280))))","v":""}]
[5,111,"",{"$f":"IF(D112=\"\", \"\", IF(D112+100<='Basic Input'!$Q$14+'Basic Input'!$Q$9, D112+100, \"\"))","v":""},{"$f":"IF(D113=\"\", \"\",IF(D113=0, 'Basic Input'!$C$5, IF('Basic Input'!$C$7=\"Increasing\", 'Basic Input'!$C$5+(D113/5280), 'Basic Input'!$C$5-(D113/5280))))","v":""}]
[5,112,"",{"$f":"IF(D113=\"\", \"\", IF(D113+100<='Basic Input'!$Q$14+'Basic Input'!$Q$9, D113+100, \"\"))","v":""},{"$f":"IF(D114=\"\", \"\",IF(D114=0, 'Basic Input'!$C$5, IF('Basic Input'!$C$7=\"Increasing\", 'Basic Input'!$C$5+(D114/5280), 'Basic Input'!$C$5-(D114/5280))))","v":""}]
[5,113,"",{"$f":"IF(D114=\"\", \"\", IF(D114+100<='Basic Input'!$Q$14+'Basic Input'!$Q$9, D114+100, \"\"))","v":""},{"$f":"IF(D115=\"\", \"\",IF(D115=0, 'Basic Input'!$C$5, IF('Basic Input'!$C$7=\"Increasing\", 'Basic Input'!$C$5+(D115/5280), 'Basic Input'!$C$5-(D115/5280))))","v":""}]
[5,114,"",{"$f":"IF(D115=\"\", \"\", IF(D115+100<='Basic Input'!$Q$14+'Basic Input'!$Q$9, D115+100, \"\"))","v":""},{"$f":"IF(D116=\"\", \"\",IF(D116=0, 'Basic Input'!$C$5, IF('Basic Input'!$C$7=\"Increasing\", 'Basic Input'!$C$5+(D116/5280), 'Basic Input'!$C$5-(D116/5280))))","v":""}]
[5,115,"",{"$f":"IF(D116=\"\", \"\", IF(D116+100<='Basic Input'!$Q$14+'Basic Input'!$Q$9, D116+100, \"\"))","v":""},{"$f":"IF(D117=\"\", \"\",IF(D117=0, 'Basic Input'!$C$5, IF('Basic Input'!$C$7=\"Increasing\", 'Basic Input'!$C$5+(D117/5280), 'Basic Input'!$C$5-(D117/5280))))","v":""}]
[5,116,"",{"$f":"IF(D117=\"\", \"\", IF(D117+100<='Basic Input'!$Q$14+'Basic Input'!$Q$9, D117+100, \"\"))","v":""},{"$f":"IF(D118=\"\", \"\",IF(D118=0, 'Basic Input'!$C$5, IF('Basic Input'!$C$7=\"Increasing\", 'Basic Input'!$C$5+(D118/5280), 'Basic Input'!$C$5-(D118/5280))))","v":""}]
[5,117,"",{"$f":"IF(D118=\"\", \"\", IF(D118+100<='Basic Input'!$Q$14+'Basic Input'!$Q$9, D118+100, \"\"))","v":""},{"$f":"IF(D119=\"\", \"\",IF(D119=0, 'Basic Input'!$C$5, IF('Basic Input'!$C$7=\"Increasing\", 'Basic Input'!$C$5+(D119/5280), 'Basic Input'!$C$5-(D119/5280))))","v":""}]
[5,118,"",{"$f":"IF(D119=\"\", \"\", IF(D119+100<='Basic Input'!$Q$14+'Basic Input'!$Q$9, D119+100, \"\"))","v":""},{"$f":"IF(D120=\"\", \"\",IF(D120=0, 'Basic Input'!$C$5, IF('Basic Input'!$C$7=\"Increasing\", 'Basic Input'!$C$5+(D120/5280), 'Basic Input'!$C$5-(D120/5280))))","v":""}]
[5,119,"",{"$f":"IF(D120=\"\", \"\", IF(D120+100<='Basic Input'!$Q$14+'Basic Input'!$Q$9, D120+100, \"\"))","v":""},{"$f":"IF(D121=\"\", \"\",IF(D121=0, 'Basic Input'!$C$5, IF('Basic Input'!$C$7=\"Increasing\", 'Basic Input'!$C$5+(D121/5280), 'Basic Input'!$C$5-(D121/5280))))","v":""}]
[5,120,"",{"$f":"IF(D121=\"\", \"\", IF(D121+100<='Basic Input'!$Q$14+'Basic Input'!$Q$9, D121+100, \"\"))","v":""},{"$f":"IF(D122=\"\", \"\",IF(D122=0, 'Basic Input'!$C$5, IF('Basic Input'!$C$7=\"Increasing\", 'Basic Input'!$C$5+(D122/5280), 'Basic Input'!$C$5-(D122/5280))))","v":""}]
[5,121,"",{"$f":"IF(D122=\"\", \"\", IF(D122+100<='Basic Input'!$Q$14+'Basic Input'!$Q$9, D122+100, \"\"))","v":""},{"$f":"IF(D123=\"\", \"\",IF(D123=0, 'Basic Input'!$C$5, IF('Basic Input'!$C$7=\"Increasing\", 'Basic Input'!$C$5+(D123/5280), 'Basic Input'!$C$5-(D123/5280))))","v":""}]
[5,122,"",{"$f":"IF(D123=\"\", \"\", IF(D123+100<='Basic Input'!$Q$14+'Basic Input'!$Q$9, D123+100, \"\"))","v":""},{"$f":"IF(D124=\"\", \"\",IF(D124=0, 'Basic Input'!$C$5, IF('Basic Input'!$C$7=\"Increasing\", 'Basic Input'!$C$5+(D124/5280), 'Basic Input'!$C$5-(D124/5280))))","v":""}]
[5,123,"",{"$f":"IF(D124=\"\", \"\", IF(D124+100<='Basic Input'!$Q$14+'Basic Input'!$Q$9, D124+100, \"\"))","v":""},{"$f":"IF(D125=\"\", \"\",IF(D125=0, 'Basic Input'!$C$5, IF('Basic Input'!$C$7=\"Increasing\", 'Basic Input'!$C$5+(D125/5280), 'Basic Input'!$C$5-(D125/5280))))","v":""}]
[5,124,"",{"$f":"IF(D125=\"\", \"\", IF(D125+100<='Basic Input'!$Q$14+'Basic Input'!$Q$9, D125+100, \"\"))","v":""},{"$f":"IF(D126=\"\", \"\",IF(D126=0, 'Basic Input'!$C$5, IF('Basic Input'!$C$7=\"Increasing\", 'Basic Input'!$C$5+(D126/5280), 'Basic Input'!$C$5-(D126/5280))))","v":""}]
[5,125,"",{"$f":"IF(D126=\"\", \"\", IF(D126+100<='Basic Input'!$Q$14+'Basic Input'!$Q$9, D126+100, \"\"))","v":""},{"$f":"IF(D127=\"\", \"\",IF(D127=0, 'Basic Input'!$C$5, IF('Basic Input'!$C$7=\"Increasing\", 'Basic Input'!$C$5+(D127/5280), 'Basic Input'!$C$5-(D127/5280))))","v":""}]
[5,126,"",{"$f":"IF(D127=\"\", \"\", IF(D127+100<='Basic Input'!$Q$14+'Basic Input'!$Q$9, D127+100, \"\"))","v":""},{"$f":"IF(D128=\"\", \"\",IF(D128=0, 'Basic Input'!$C$5, IF('Basic Input'!$C$7=\"Increasing\", 'Basic Input'!$C$5+(D128/5280), 'Basic Input'!$C$5-(D128/5280))))","v":""}]
[5,127,"",{"$f":"IF(D128=\"\", \"\", IF(D128+100<='Basic Input'!$Q$14+'Basic Input'!$Q$9, D128+100, \"\"))","v":""},{"$f":"IF(D129=\"\", \"\",IF(D129=0, 'Basic Input'!$C$5, IF('Basic Input'!$C$7=\"Increasing\", 'Basic Input'!$C$5+(D129/5280), 'Basic Input'!$C$5-(D129/5280))))","v":""}]
[5,128,"",{"$f":"IF(D129=\"\", \"\", IF(D129+100<='Basic Input'!$Q$14+'Basic Input'!$Q$9, D129+100, \"\"))","v":""},{"$f":"IF(D130=\"\", \"\",IF(D130=0, 'Basic Input'!$C$5, IF('Basic Input'!$C$7=\"Increasing\", 'Basic Input'!$C$5+(D130/5280), 'Basic Input'!$C$5-(D130/5280))))","v":""}]
[5,129,"",{"$f":"IF(D130=\"\", \"\", IF(D130+100<='Basic Input'!$Q$14+'Basic Input'!$Q$9, D130+100, \"\"))","v":""},{"$f":"IF(D131=\"\", \"\",IF(D131=0, 'Basic Input'!$C$5, IF('Basic Input'!$C$7=\"Increasing\", 'Basic Input'!$C$5+(D131/5280), 'Basic Input'!$C$5-(D131/5280))))","v":""}]
[5,130,"",{"$f":"IF(D131=\"\", \"\", IF(D131+100<='Basic Input'!$Q$14+'Basic Input'!$Q$9, D131+100, \"\"))","v":""},{"$f":"IF(D132=\"\", \"\",IF(D132=0, 'Basic Input'!$C$5, IF('Basic Input'!$C$7=\"Increasing\", 'Basic Input'!$C$5+(D132/5280), 'Basic Input'!$C$5-(D132/5280))))","v":""}]
[5,131,"",{"$f":"IF(D132=\"\", \"\", IF(D132+100<='Basic Input'!$Q$14+'Basic Input'!$Q$9, D132+100, \"\"))","v":""},{"$f":"IF(D133=\"\", \"\",IF(D133=0, 'Basic Input'!$C$5, IF('Basic Input'!$C$7=\"Increasing\", 'Basic Input'!$C$5+(D133/5280), 'Basic Input'!$C$5-(D133/5280))))","v":""}]
[{"$f":"IF(H134<>\"\", A133+1, A133)","v":5},132,{"$f":"IF(D134=\"\", \"\", D134*0.0001893939)","v":""},{"$f":"IF(D133=\"\", \"\", IF(D133+100<='Basic Input'!$Q$14+'Basic Input'!$Q$9, D133+100, \"\"))","v":""},{"$f":"IF(D134=\"\", \"\",IF(D134=0, 'Basic Input'!$C$5, IF('Basic Input'!$C$7=\"Increasing\", 'Basic Input'!$C$5+(D134/5280), 'Basic Input'!$C$5-(D134/5280))))","v":""}]
[5,{"$f":"IF(F134=\"\", B134+1, B134+2)","v":133},"",{"$f":"IF(D134=\"\", \"\", IF(D134+100<='Basic Input'!$Q$14+'Basic Input'!$Q$9, D134+100, \"\"))","v":""},{"$f":"IF(D135=\"\", \"\",IF(D135=0, 'Basic Input'!$C$5, IF('Basic Input'!$C$7=\"Increasing\", 'Basic Input'!$C$5+(D135/5280), 'Basic Input'!$C$5-(D135/5280))))","v":""}]
[5,134,"",{"$f":"IF(D135=\"\", \"\", IF(D135+100<='Basic Input'!$Q$14+'Basic Input'!$Q$9, D135+100, \"\"))","v":""},{"$f":"IF(D136=\"\", \"\",IF(D136=0, 'Basic Input'!$C$5, IF('Basic Input'!$C$7=\"Increasing\", 'Basic Input'!$C$5+(D136/5280), 'Basic Input'!$C$5-(D136/5280))))","v":""}]
[5,135,"",{"$f":"IF(D136=\"\", \"\", IF(D136+100<='Basic Input'!$Q$14+'Basic Input'!$Q$9, D136+100, \"\"))","v":""},{"$f":"IF(D137=\"\", \"\",IF(D137=0, 'Basic Input'!$C$5, IF('Basic Input'!$C$7=\"Increasing\", 'Basic Input'!$C$5+(D137/5280), 'Basic Input'!$C$5-(D137/5280))))","v":""}]
[5,136,"",{"$f":"IF(D137=\"\", \"\", IF(D137+100<='Basic Input'!$Q$14+'Basic Input'!$Q$9, D137+100, \"\"))","v":""},{"$f":"IF(D138=\"\", \"\",IF(D138=0, 'Basic Input'!$C$5, IF('Basic Input'!$C$7=\"Increasing\", 'Basic Input'!$C$5+(D138/5280), 'Basic Input'!$C$5-(D138/5280))))","v":""}]
[5,137,"",{"$f":"IF(D138=\"\", \"\", IF(D138+100<='Basic Input'!$Q$14+'Basic Input'!$Q$9, D138+100, \"\"))","v":""},{"$f":"IF(D139=\"\", \"\",IF(D139=0, 'Basic Input'!$C$5, IF('Basic Input'!$C$7=\"Increasing\", 'Basic Input'!$C$5+(D139/5280), 'Basic Input'!$C$5-(D139/5280))))","v":""}]
[5,138,"",{"$f":"IF(D139=\"\", \"\", IF(D139+100<='Basic Input'!$Q$14+'Basic Input'!$Q$9, D139+100, \"\"))","v":""},{"$f":"IF(D140=\"\", \"\",IF(D140=0, 'Basic Input'!$C$5, IF('Basic Input'!$C$7=\"Increasing\", 'Basic Input'!$C$5+(D140/5280), 'Basic Input'!$C$5-(D140/5280))))","v":""}]
[5,139,"",{"$f":"IF(D140=\"\", \"\", IF(D140+100<='Basic Input'!$Q$14+'Basic Input'!$Q$9, D140+100, \"\"))","v":""},{"$f":"IF(D141=\"\", \"\",IF(D141=0, 'Basic Input'!$C$5, IF('Basic Input'!$C$7=\"Increasing\", 'Basic Input'!$C$5+(D141/5280), 'Basic Input'!$C$5-(D141/5280))))","v":""}]
[5,140,"",{"$f":"IF(D141=\"\", \"\", IF(D141+100<='Basic Input'!$Q$14+'Basic Input'!$Q$9, D141+100, \"\"))","v":""},{"$f":"IF(D142=\"\", \"\",IF(D142=0, 'Basic Input'!$C$5, IF('Basic Input'!$C$7=\"Increasing\", 'Basic Input'!$C$5+(D142/5280), 'Basic Input'!$C$5-(D142/5280))))","v":""}]
[5,141,"",{"$f":"IF(D142=\"\", \"\", IF(D142+100<='Basic Input'!$Q$14+'Basic Input'!$Q$9, D142+100, \"\"))","v":""},{"$f":"IF(D143=\"\", \"\",IF(D143=0, 'Basic Input'!$C$5, IF('Basic Input'!$C$7=\"Increasing\", 'Basic Input'!$C$5+(D143/5280), 'Basic Input'!$C$5-(D143/5280))))","v":""}]
[5,142,"",{"$f":"IF(D143=\"\", \"\", IF(D143+100<='Basic Input'!$Q$14+'Basic Input'!$Q$9, D143+100, \"\"))","v":""},{"$f":"IF(D144=\"\", \"\",IF(D144=0, 'Basic Input'!$C$5, IF('Basic Input'!$C$7=\"Increasing\", 'Basic Input'!$C$5+(D144/5280), 'Basic Input'!$C$5-(D144/5280))))","v":""}]
[5,143,"",{"$f":"IF(D144=\"\", \"\", IF(D144+100<='Basic Input'!$Q$14+'Basic Input'!$Q$9, D144+100, \"\"))","v":""},{"$f":"IF(D145=\"\", \"\",IF(D145=0, 'Basic Input'!$C$5, IF('Basic Input'!$C$7=\"Increasing\", 'Basic Input'!$C$5+(D145/5280), 'Basic Input'!$C$5-(D145/5280))))","v":""}]
[5,144,"",{"$f":"IF(D145=\"\", \"\", IF(D145+100<='Basic Input'!$Q$14+'Basic Input'!$Q$9, D145+100, \"\"))","v":""},{"$f":"IF(D146=\"\", \"\",IF(D146=0, 'Basic Input'!$C$5, IF('Basic Input'!$C$7=\"Increasing\", 'Basic Input'!$C$5+(D146/5280), 'Basic Input'!$C$5-(D146/5280))))","v":""}]
[5,145,"",{"$f":"IF(D146=\"\", \"\", IF(D146+100<='Basic Input'!$Q$14+'Basic Input'!$Q$9, D146+100, \"\"))","v":""},{"$f":"IF(D147=\"\", \"\",IF(D147=0, 'Basic Input'!$C$5, IF('Basic Input'!$C$7=\"Increasing\", 'Basic Input'!$C$5+(D147/5280), 'Basic Input'!$C$5-(D147/5280))))","v":""}]
[5,146,"",{"$f":"IF(D147=\"\", \"\", IF(D147+100<='Basic Input'!$Q$14+'Basic Input'!$Q$9, D147+100, \"\"))","v":""},{"$f":"IF(D148=\"\", \"\",IF(D148=0, 'Basic Input'!$C$5, IF('Basic Input'!$C$7=\"Increasing\", 'Basic Input'!$C$5+(D148/5280), 'Basic Input'!$C$5-(D148/5280))))","v":""}]
[5,147,"",{"$f":"IF(D148=\"\", \"\", IF(D148+100<='Basic Input'!$Q$14+'Basic Input'!$Q$9, D148+100, \"\"))","v":""},{"$f":"IF(D149=\"\", \"\",IF(D149=0, 'Basic Input'!$C$5, IF('Basic Input'!$C$7=\"Increasing\", 'Basic Input'!$C$5+(D149/5280), 'Basic Input'!$C$5-(D149/5280))))","v":""}]
[5,148,"",{"$f":"IF(D149=\"\", \"\", IF(D149+100<='Basic Input'!$Q$14+'Basic Input'!$Q$9, D149+100, \"\"))","v":""},{"$f":"IF(D150=\"\", \"\",IF(D150=0, 'Basic Input'!$C$5, IF('Basic Input'!$C$7=\"Increasing\", 'Basic Input'!$C$5+(D150/5280), 'Basic Input'!$C$5-(D150/5280))))","v":""}]
[5,149,"",{"$f":"IF(D150=\"\", \"\", IF(D150+100<='Basic Input'!$Q$14+'Basic Input'!$Q$9, D150+100, \"\"))","v":""},{"$f":"IF(D151=\"\", \"\",IF(D151=0, 'Basic Input'!$C$5, IF('Basic Input'!$C$7=\"Increasing\", 'Basic Input'!$C$5+(D151/5280), 'Basic Input'!$C$5-(D151/5280))))","v":""}]
[5,150,"",{"$f":"IF(D151=\"\", \"\", IF(D151+100<='Basic Input'!$Q$14+'Basic Input'!$Q$9, D151+100, \"\"))","v":""},{"$f":"IF(D152=\"\", \"\",IF(D152=0, 'Basic Input'!$C$5, IF('Basic Input'!$C$7=\"Increasing\", 'Basic Input'!$C$5+(D152/5280), 'Basic Input'!$C$5-(D152/5280))))","v":""}]
[5,151,"",{"$f":"IF(D152=\"\", \"\", IF(D152+100<='Basic Input'!$Q$14+'Basic Input'!$Q$9, D152+100, \"\"))","v":""},{"$f":"IF(D153=\"\", \"\",IF(D153=0, 'Basic Input'!$C$5, IF('Basic Input'!$C$7=\"Increasing\", 'Basic Input'!$C$5+(D153/5280), 'Basic Input'!$C$5-(D153/5280))))","v":""}]
[5,152,"",{"$f":"IF(D153=\"\", \"\", IF(D153+100<='Basic Input'!$Q$14+'Basic Input'!$Q$9, D153+100, \"\"))","v":""},{"$f":"IF(D154=\"\", \"\",IF(D154=0, 'Basic Input'!$C$5, IF('Basic Input'!$C$7=\"Increasing\", 'Basic Input'!$C$5+(D154/5280), 'Basic Input'!$C$5-(D154/5280))))","v":""}]
[5,153,"",{"$f":"IF(D154=\"\", \"\", IF(D154+100<='Basic Input'!$Q$14+'Basic Input'!$Q$9, D154+100, \"\"))","v":""},{"$f":"IF(D155=\"\", \"\",IF(D155=0, 'Basic Input'!$C$5, IF('Basic Input'!$C$7=\"Increasing\", 'Basic Input'!$C$5+(D155/5280), 'Basic Input'!$C$5-(D155/5280))))","v":""}]
[5,154,"",{"$f":"IF(D155=\"\", \"\", IF(D155+100<='Basic Input'!$Q$14+'Basic Input'!$Q$9, D155+100, \"\"))","v":""},{"$f":"IF(D156=\"\", \"\",IF(D156=0, 'Basic Input'!$C$5, IF('Basic Input'!$C$7=\"Increasing\", 'Basic Input'!$C$5+(D156/5280), 'Basic Input'!$C$5-(D156/5280))))","v":""}]
[5,155,"",{"$f":"IF(D156=\"\", \"\", IF(D156+100<='Basic Input'!$Q$14+'Basic Input'!$Q$9, D156+100, \"\"))","v":""},{"$f":"IF(D157=\"\", \"\",IF(D157=0, 'Basic Input'!$C$5, IF('Basic Input'!$C$7=\"Increasing\", 'Basic Input'!$C$5+(D157/5280), 'Basic Input'!$C$5-(D157/5280))))","v":""}]
[5,156,"",{"$f":"IF(D157=\"\", \"\", IF(D157+100<='Basic Input'!$Q$14+'Basic Input'!$Q$9, D157+100, \"\"))","v":""},{"$f":"IF(D158=\"\", \"\",IF(D158=0, 'Basic Input'!$C$5, IF('Basic Input'!$C$7=\"Increasing\", 'Basic Input'!$C$5+(D158/5280), 'Basic Input'!$C$5-(D158/5280))))","v":""}]
[5,157,"",{"$f":"IF(D158=\"\", \"\", IF(D158+100<='Basic Input'!$Q$14+'Basic Input'!$Q$9, D158+100, \"\"))","v":""},{"$f":"IF(D159=\"\", \"\",IF(D159=0, 'Basic Input'!$C$5, IF('Basic Input'!$C$7=\"Increasing\", 'Basic Input'!$C$5+(D159/5280), 'Basic Input'!$C$5-(D159/5280))))","v":""}]
[5,158,"",{"$f":"IF(D159=\"\", \"\", IF(D159+100<='Basic Input'!$Q$14+'Basic Input'!$Q$9, D159+100, \"\"))","v":""},{"$f":"IF(D160=\"\", \"\",IF(D160=0, 'Basic Input'!$C$5, IF('Basic Input'!$C$7=\"Increasing\", 'Basic Input'!$C$5+(D160/5280), 'Basic Input'!$C$5-(D160/5280))))","v":""}]
[5,159,"",{"$f":"IF(D160=\"\", \"\", IF(D160+100<='Basic Input'!$Q$14+'Basic Input'!$Q$9, D160+100, \"\"))","v":""},{"$f":"IF(D161=\"\", \"\",IF(D161=0, 'Basic Input'!$C$5, IF('Basic Input'!$C$7=\"Increasing\", 'Basic Input'!$C$5+(D161/5280), 'Basic Input'!$C$5-(D161/5280))))","v":""}]
[5,160,"",{"$f":"IF(D161=\"\", \"\", IF(D161+100<='Basic Input'!$Q$14+'Basic Input'!$Q$9, D161+100, \"\"))","v":""},{"$f":"IF(D162=\"\", \"\",IF(D162=0, 'Basic Input'!$C$5, IF('Basic Input'!$C$7=\"Increasing\", 'Basic Input'!$C$5+(D162/5280), 'Basic Input'!$C$5-(D162/5280))))","v":""}]
[5,161,"",{"$f":"IF(D162=\"\", \"\", IF(D162+100<='Basic Input'!$Q$14+'Basic Input'!$Q$9, D162+100, \"\"))","v":""},{"$f":"IF(D163=\"\", \"\",IF(D163=0, 'Basic Input'!$C$5, IF('Basic Input'!$C$7=\"Increasing\", 'Basic Input'!$C$5+(D163/5280), 'Basic Input'!$C$5-(D163/5280))))","v":""}]
[5,162,"",{"$f":"IF(D163=\"\", \"\", IF(D163+100<='Basic Input'!$Q$14+'Basic Input'!$Q$9, D163+100, \"\"))","v":""},{"$f":"IF(D164=\"\", \"\",IF(D164=0, 'Basic Input'!$C$5, IF('Basic Input'!$C$7=\"Increasing\", 'Basic Input'!$C$5+(D164/5280), 'Basic Input'!$C$5-(D164/5280))))","v":""}]
[5,163,"",{"$f":"IF(D164=\"\", \"\", IF(D164+100<='Basic Input'!$Q$14+'Basic Input'!$Q$9, D164+100, \"\"))","v":""},{"$f":"IF(D165=\"\", \"\",IF(D165=0, 'Basic Input'!$C$5, IF('Basic Input'!$C$7=\"Increasing\", 'Basic Input'!$C$5+(D165/5280), 'Basic Input'!$C$5-(D165/5280))))","v":""}]
[5,164,"",{"$f":"IF(D165=\"\", \"\", IF(D165+100<='Basic Input'!$Q$14+'Basic Input'!$Q$9, D165+100, \"\"))","v":""},{"$f":"IF(D166=\"\", \"\",IF(D166=0, 'Basic Input'!$C$5, IF('Basic Input'!$C$7=\"Increasing\", 'Basic Input'!$C$5+(D166/5280), 'Basic Input'!$C$5-(D166/5280))))","v":""}]
[5,165,"",{"$f":"IF(D166=\"\", \"\", IF(D166+100<='Basic Input'!$Q$14+'Basic Input'!$Q$9, D166+100, \"\"))","v":""},{"$f":"IF(D167=\"\", \"\",IF(D167=0, 'Basic Input'!$C$5, IF('Basic Input'!$C$7=\"Increasing\", 'Basic Input'!$C$5+(D167/5280), 'Basic Input'!$C$5-(D167/5280))))","v":""}]
[5,166,"",{"$f":"IF(D167=\"\", \"\", IF(D167+100<='Basic Input'!$Q$14+'Basic Input'!$Q$9, D167+100, \"\"))","v":""},{"$f":"IF(D168=\"\", \"\",IF(D168=0, 'Basic Input'!$C$5, IF('Basic Input'!$C$7=\"Increasing\", 'Basic Input'!$C$5+(D168/5280), 'Basic Input'!$C$5-(D168/5280))))","v":""}]
[5,167,"",{"$f":"IF(D168=\"\", \"\", IF(D168+100<='Basic Input'!$Q$14+'Basic Input'!$Q$9, D168+100, \"\"))","v":""},{"$f":"IF(D169=\"\", \"\",IF(D169=0, 'Basic Input'!$C$5, IF('Basic Input'!$C$7=\"Increasing\", 'Basic Input'!$C$5+(D169/5280), 'Basic Input'!$C$5-(D169/5280))))","v":""}]
[5,168,"",{"$f":"IF(D169=\"\", \"\", IF(D169+100<='Basic Input'!$Q$14+'Basic Input'!$Q$9, D169+100, \"\"))","v":""},{"$f":"IF(D170=\"\", \"\",IF(D170=0, 'Basic Input'!$C$5, IF('Basic Input'!$C$7=\"Increasing\", 'Basic Input'!$C$5+(D170/5280), 'Basic Input'!$C$5-(D170/5280))))","v":""}]
[5,169,"",{"$f":"IF(D170=\"\", \"\", IF(D170+100<='Basic Input'!$Q$14+'Basic Input'!$Q$9, D170+100, \"\"))","v":""},{"$f":"IF(D171=\"\", \"\",IF(D171=0, 'Basic Input'!$C$5, IF('Basic Input'!$C$7=\"Increasing\", 'Basic Input'!$C$5+(D171/5280), 'Basic Input'!$C$5-(D171/5280))))","v":""}]
[5,170,"",{"$f":"IF(D171=\"\", \"\", IF(D171+100<='Basic Input'!$Q$14+'Basic Input'!$Q$9, D171+100, \"\"))","v":""},{"$f":"IF(D172=\"\", \"\",IF(D172=0, 'Basic Input'!$C$5, IF('Basic Input'!$C$7=\"Increasing\", 'Basic Input'!$C$5+(D172/5280), 'Basic Input'!$C$5-(D172/5280))))","v":""}]
[5,171,"",{"$f":"IF(D172=\"\", \"\", IF(D172+100<='Basic Input'!$Q$14+'Basic Input'!$Q$9, D172+100, \"\"))","v":""},{"$f":"IF(D173=\"\", \"\",IF(D173=0, 'Basic Input'!$C$5, IF('Basic Input'!$C$7=\"Increasing\", 'Basic Input'!$C$5+(D173/5280), 'Basic Input'!$C$5-(D173/5280))))","v":""}]
[5,172,"",{"$f":"IF(D173=\"\", \"\", IF(D173+100<='Basic Input'!$Q$14+'Basic Input'!$Q$9, D173+100, \"\"))","v":""},{"$f":"IF(D174=\"\", \"\",IF(D174=0, 'Basic Input'!$C$5, IF('Basic Input'!$C$7=\"Increasing\", 'Basic Input'!$C$5+(D174/5280), 'Basic Input'!$C$5-(D174/5280))))","v":""}]
[5,173,"",{"$f":"IF(D174=\"\", \"\", IF(D174+100<='Basic Input'!$Q$14+'Basic Input'!$Q$9, D174+100, \"\"))","v":""},{"$f":"IF(D175=\"\", \"\",IF(D175=0, 'Basic Input'!$C$5, IF('Basic Input'!$C$7=\"Increasing\", 'Basic Input'!$C$5+(D175/5280), 'Basic Input'!$C$5-(D175/5280))))","v":""}]
[5,174,"",{"$f":"IF(D175=\"\", \"\", IF(D175+100<='Basic Input'!$Q$14+'Basic Input'!$Q$9, D175+100, \"\"))","v":""},{"$f":"IF(D176=\"\", \"\",IF(D176=0, 'Basic Input'!$C$5, IF('Basic Input'!$C$7=\"Increasing\", 'Basic Input'!$C$5+(D176/5280), 'Basic Input'!$C$5-(D176/5280))))","v":""}]
[5,175,"",{"$f":"IF(D176=\"\", \"\", IF(D176+100<='Basic Input'!$Q$14+'Basic Input'!$Q$9, D176+100, \"\"))","v":""},{"$f":"IF(D177=\"\", \"\",IF(D177=0, 'Basic Input'!$C$5, IF('Basic Input'!$C$7=\"Increasing\", 'Basic Input'!$C$5+(D177/5280), 'Basic Input'!$C$5-(D177/5280))))","v":""}]
[5,176,"",{"$f":"IF(D177=\"\", \"\", IF(D177+100<='Basic Input'!$Q$14+'Basic Input'!$Q$9, D177+100, \"\"))","v":""},{"$f":"IF(D178=\"\", \"\",IF(D178=0, 'Basic Input'!$C$5, IF('Basic Input'!$C$7=\"Increasing\", 'Basic Input'!$C$5+(D178/5280), 'Basic Input'!$C$5-(D178/5280))))","v":""}]
[5,177,"",{"$f":"IF(D178=\"\", \"\", IF(D178+100<='Basic Input'!$Q$14+'Basic Input'!$Q$9, D178+100, \"\"))","v":""},{"$f":"IF(D179=\"\", \"\",IF(D179=0, 'Basic Input'!$C$5, IF('Basic Input'!$C$7=\"Increasing\", 'Basic Input'!$C$5+(D179/5280), 'Basic Input'!$C$5-(D179/5280))))","v":""}]
[5,178,"",{"$f":"IF(D179=\"\", \"\", IF(D179+100<='Basic Input'!$Q$14+'Basic Input'!$Q$9, D179+100, \"\"))","v":""},{"$f":"IF(D180=\"\", \"\",IF(D180=0, 'Basic Input'!$C$5, IF('Basic Input'!$C$7=\"Increasing\", 'Basic Input'!$C$5+(D180/5280), 'Basic Input'!$C$5-(D180/5280))))","v":""}]
[5,179,"",{"$f":"IF(D180=\"\", \"\", IF(D180+100<='Basic Input'!$Q$14+'Basic Input'!$Q$9, D180+100, \"\"))","v":""},{"$f":"IF(D181=\"\", \"\",IF(D181=0, 'Basic Input'!$C$5, IF('Basic Input'!$C$7=\"Increasing\", 'Basic Input'!$C$5+(D181/5280), 'Basic Input'!$C$5-(D181/5280))))","v":""}]
[5,180,"",{"$f":"IF(D181=\"\", \"\", IF(D181+100<='Basic Input'!$Q$14+'Basic Input'!$Q$9, D181+100, \"\"))","v":""},{"$f":"IF(D182=\"\", \"\",IF(D182=0, 'Basic Input'!$C$5, IF('Basic Input'!$C$7=\"Increasing\", 'Basic Input'!$C$5+(D182/5280), 'Basic Input'!$C$5-(D182/5280))))","v":""}]
[5,181,"",{"$f":"IF(D182=\"\", \"\", IF(D182+100<='Basic Input'!$Q$14+'Basic Input'!$Q$9, D182+100, \"\"))","v":""},{"$f":"IF(D183=\"\", \"\",IF(D183=0, 'Basic Input'!$C$5, IF('Basic Input'!$C$7=\"Increasing\", 'Basic Input'!$C$5+(D183/5280), 'Basic Input'!$C$5-(D183/5280))))","v":""}]
[5,182,"",{"$f":"IF(D183=\"\", \"\", IF(D183+100<='Basic Input'!$Q$14+'Basic Input'!$Q$9, D183+100, \"\"))","v":""},{"$f":"IF(D184=\"\", \"\",IF(D184=0, 'Basic Input'!$C$5, IF('Basic Input'!$C$7=\"Increasing\", 'Basic Input'!$C$5+(D184/5280), 'Basic Input'!$C$5-(D184/5280))))","v":""}]
[5,183,"",{"$f":"IF(D184=\"\", \"\", IF(D184+100<='Basic Input'!$Q$14+'Basic Input'!$Q$9, D184+100, \"\"))","v":""},{"$f":"IF(D185=\"\", \"\",IF(D185=0, 'Basic Input'!$C$5, IF('Basic Input'!$C$7=\"Increasing\", 'Basic Input'!$C$5+(D185/5280), 'Basic Input'!$C$5-(D185/5280))))","v":""}]
[5,184,"",{"$f":"IF(D185=\"\", \"\", IF(D185+100<='Basic Input'!$Q$14+'Basic Input'!$Q$9, D185+100, \"\"))","v":""},{"$f":"IF(D186=\"\", \"\",IF(D186=0, 'Basic Input'!$C$5, IF('Basic Input'!$C$7=\"Increasing\", 'Basic Input'!$C$5+(D186/5280), 'Basic Input'!$C$5-(D186/5280))))","v":""}]
[5,185,"",{"$f":"IF(D186=\"\", \"\", IF(D186+100<='Basic Input'!$Q$14+'Basic Input'!$Q$9, D186+100, \"\"))","v":""},{"$f":"IF(D187=\"\", \"\",IF(D187=0, 'Basic Input'!$C$5, IF('Basic Input'!$C$7=\"Increasing\", 'Basic Input'!$C$5+(D187/5280), 'Basic Input'!$C$5-(D187/5280))))","v":""}]
[5,186,"",{"$f":"IF(D187=\"\", \"\", IF(D187+100<='Basic Input'!$Q$14+'Basic Input'!$Q$9, D187+100, \"\"))","v":""},{"$f":"IF(D188=\"\", \"\",IF(D188=0, 'Basic Input'!$C$5, IF('Basic Input'!$C$7=\"Increasing\", 'Basic Input'!$C$5+(D188/5280), 'Basic Input'!$C$5-(D188/5280))))","v":""}]
[5,187,"",{"$f":"IF(D188=\"\", \"\", IF(D188+100<='Basic Input'!$Q$14+'Basic Input'!$Q$9, D188+100, \"\"))","v":""},{"$f":"IF(D189=\"\", \"\",IF(D189=0, 'Basic Input'!$C$5, IF('Basic Input'!$C$7=\"Increasing\", 'Basic Input'!$C$5+(D189/5280), 'Basic Input'!$C$5-(D189/5280))))","v":""}]
[5,188,"",{"$f":"IF(D189=\"\", \"\", IF(D189+100<='Basic Input'!$Q$14+'Basic Input'!$Q$9, D189+100, \"\"))","v":""},{"$f":"IF(D190=\"\", \"\",IF(D190=0, 'Basic Input'!$C$5, IF('Basic Input'!$C$7=\"Increasing\", 'Basic Input'!$C$5+(D190/5280), 'Basic Input'!$C$5-(D190/5280))))","v":""}]
[5,189,"",{"$f":"IF(D190=\"\", \"\", IF(D190+100<='Basic Input'!$Q$14+'Basic Input'!$Q$9, D190+100, \"\"))","v":""},{"$f":"IF(D191=\"\", \"\",IF(D191=0, 'Basic Input'!$C$5, IF('Basic Input'!$C$7=\"Increasing\", 'Basic Input'!$C$5+(D191/5280), 'Basic Input'!$C$5-(D191/5280))))","v":""}]
[5,190,"",{"$f":"IF(D191=\"\", \"\", IF(D191+100<='Basic Input'!$Q$14+'Basic Input'!$Q$9, D191+100, \"\"))","v":""},{"$f":"IF(D192=\"\", \"\",IF(D192=0, 'Basic Input'!$C$5, IF('Basic Input'!$C$7=\"Increasing\", 'Basic Input'!$C$5+(D192/5280), 'Basic Input'!$C$5-(D192/5280))))","v":""}]
[5,191,"",{"$f":"IF(D192=\"\", \"\", IF(D192+100<='Basic Input'!$Q$14+'Basic Input'!$Q$9, D192+100, \"\"))","v":""},{"$f":"IF(D193=\"\", \"\",IF(D193=0, 'Basic Input'!$C$5, IF('Basic Input'!$C$7=\"Increasing\", 'Basic Input'!$C$5+(D193/5280), 'Basic Input'!$C$5-(D193/5280))))","v":""}]
[5,192,"",{"$f":"IF(D193=\"\", \"\", IF(D193+100<='Basic Input'!$Q$14+'Basic Input'!$Q$9, D193+100, \"\"))","v":""},{"$f":"IF(D194=\"\", \"\",IF(D194=0, 'Basic Input'!$C$5, IF('Basic Input'!$C$7=\"Increasing\", 'Basic Input'!$C$5+(D194/5280), 'Basic Input'!$C$5-(D194/5280))))","v":""}]
[5,193,"",{"$f":"IF(D194=\"\", \"\", IF(D194+100<='Basic Input'!$Q$14+'Basic Input'!$Q$9, D194+100, \"\"))","v":""},{"$f":"IF(D195=\"\", \"\",IF(D195=0, 'Basic Input'!$C$5, IF('Basic Input'!$C$7=\"Increasing\", 'Basic Input'!$C$5+(D195/5280), 'Basic Input'!$C$5-(D195/5280))))","v":""}]
[5,194,"",{"$f":"IF(D195=\"\", \"\", IF(D195+100<='Basic Input'!$Q$14+'Basic Input'!$Q$9, D195+100, \"\"))","v":""},{"$f":"IF(D196=\"\", \"\",IF(D196=0, 'Basic Input'!$C$5, IF('Basic Input'!$C$7=\"Increasing\", 'Basic Input'!$C$5+(D196/5280), 'Basic Input'!$C$5-(D196/5280))))","v":""}]
[5,195,"",{"$f":"IF(D196=\"\", \"\", IF(D196+100<='Basic Input'!$Q$14+'Basic Input'!$Q$9, D196+100, \"\"))","v":""},{"$f":"IF(D197=\"\", \"\",IF(D197=0, 'Basic Input'!$C$5, IF('Basic Input'!$C$7=\"Increasing\", 'Basic Input'!$C$5+(D197/5280), 'Basic Input'!$C$5-(D197/5280))))","v":""}]
[{"$f":"IF(H198<>\"\", A197+1, A197)","v":5},196,{"$f":"IF(D198=\"\", \"\", D198*0.0001893939)","v":""},{"$f":"IF(D197=\"\", \"\", IF(D197+100<='Basic Input'!$Q$14+'Basic Input'!$Q$9, D197+100, \"\"))","v":""},{"$f":"IF(D198=\"\", \"\",IF(D198=0, 'Basic Input'!$C$5, IF('Basic Input'!$C$7=\"Increasing\", 'Basic Input'!$C$5+(D198/5280), 'Basic Input'!$C$5-(D198/5280))))","v":""}]
[5,{"$f":"IF(F198=\"\", B198+1, B198+2)","v":197},"",{"$f":"IF(D198=\"\", \"\", IF(D198+100<='Basic Input'!$Q$14+'Basic Input'!$Q$9, D198+100, \"\"))","v":""},{"$f":"IF(D199=\"\", \"\",IF(D199=0, 'Basic Input'!$C$5, IF('Basic Input'!$C$7=\"Increasing\", 'Basic Input'!$C$5+(D199/5280), 'Basic Input'!$C$5-(D199/5280))))","v":""}]
[5,198,"",{"$f":"IF(D199=\"\", \"\", IF(D199+100<='Basic Input'!$Q$14+'Basic Input'!$Q$9, D199+100, \"\"))","v":""},{"$f":"IF(D200=\"\", \"\",IF(D200=0, 'Basic Input'!$C$5, IF('Basic Input'!$C$7=\"Increasing\", 'Basic Input'!$C$5+(D200/5280), 'Basic Input'!$C$5-(D200/5280))))","v":""}]
[5,199,"",{"$f":"IF(D200=\"\", \"\", IF(D200+100<='Basic Input'!$Q$14+'Basic Input'!$Q$9, D200+100, \"\"))","v":""},{"$f":"IF(D201=\"\", \"\",IF(D201=0, 'Basic Input'!$C$5, IF('Basic Input'!$C$7=\"Increasing\", 'Basic Input'!$C$5+(D201/5280), 'Basic Input'!$C$5-(D201/5280))))","v":""}]
[5,200,"",{"$f":"IF(D201=\"\", \"\", IF(D201+100<='Basic Input'!$Q$14+'Basic Input'!$Q$9, D201+100, \"\"))","v":""},{"$f":"IF(D202=\"\", \"\",IF(D202=0, 'Basic Input'!$C$5, IF('Basic Input'!$C$7=\"Increasing\", 'Basic Input'!$C$5+(D202/5280), 'Basic Input'!$C$5-(D202/5280))))","v":""}]
[5,201,"",{"$f":"IF(D202=\"\", \"\", IF(D202+100<='Basic Input'!$Q$14+'Basic Input'!$Q$9, D202+100, \"\"))","v":""},{"$f":"IF(D203=\"\", \"\",IF(D203=0, 'Basic Input'!$C$5, IF('Basic Input'!$C$7=\"Increasing\", 'Basic Input'!$C$5+(D203/5280), 'Basic Input'!$C$5-(D203/5280))))","v":""}]
[5,202,"",{"$f":"IF(D203=\"\", \"\", IF(D203+100<='Basic Input'!$Q$14+'Basic Input'!$Q$9, D203+100, \"\"))","v":""},{"$f":"IF(D204=\"\", \"\",IF(D204=0, 'Basic Input'!$C$5, IF('Basic Input'!$C$7=\"Increasing\", 'Basic Input'!$C$5+(D204/5280), 'Basic Input'!$C$5-(D204/5280))))","v":""}]
[5,203,"",{"$f":"IF(D204=\"\", \"\", IF(D204+100<='Basic Input'!$Q$14+'Basic Input'!$Q$9, D204+100, \"\"))","v":""},{"$f":"IF(D205=\"\", \"\",IF(D205=0, 'Basic Input'!$C$5, IF('Basic Input'!$C$7=\"Increasing\", 'Basic Input'!$C$5+(D205/5280), 'Basic Input'!$C$5-(D205/5280))))","v":""}]
[5,204,"",{"$f":"IF(D205=\"\", \"\", IF(D205+100<='Basic Input'!$Q$14+'Basic Input'!$Q$9, D205+100, \"\"))","v":""},{"$f":"IF(D206=\"\", \"\",IF(D206=0, 'Basic Input'!$C$5, IF('Basic Input'!$C$7=\"Increasing\", 'Basic Input'!$C$5+(D206/5280), 'Basic Input'!$C$5-(D206/5280))))","v":""}]

{"sheet":"Straight-Line Diagram","index":2,"n_rows":45,"n_cols":15,"rows_kept":45,"cut":false,"hidden":false,"merged":[[6,14,10,14]]}
[]
[]
[]
[]
[]
[null,null,null,null,null,null,null,null,null,null,null,null,null,null,"Graphic"]
[null,null,null,null,null,null,null,null,null,null,null,null,null,null,"Place an aerial photo at the top of the diagram.  Make sure to line up the reference point and the Adjust the vertical lines that designate the transition zone boundaries."]
[]
[]
[]
[]
[]
[]
[]
[]
[]
[]
[]
[]
[]
[]
[]
[]
[]
[]
[]
[]
[]
[]
[]
[]
[]
[]
[]
[]
[]
[]
[]
[]
[]
[]
[]
[]
[null,null,null,null,null,null,null,null,null,null,null,null,null,null,"Land Use"]
[null,null,null,null,null,null,null,null,null,null,null,null,null,null,"Use text boxes to graphically draw land use."]

{"sheet":"Working Data","index":3,"n_rows":84,"n_cols":56,"rows_kept":84,"cut":false,"hidden":true,"merged":[[2,27,2,30],[2,16,2,19]]}
[null,"WORKING DATA -- DO NOT MODIFY"]
[null,null,null,null,null,null,null,null,null,null,"Speeds"]
[null,null,null,null,null,null,null,null,null,null,null,null,null,null,null,null,"Crashes (2006-2010)",null,null,null,null,null,null,null,null,"per mile",null,"Geometry"]
[null,null,"Distance (miles)","Distance (feet)","Mile Post","Key Locations",null,"Inserted Speed","85% Observed Speeds","Mean Speed","Posted Speed Limit","85th Percentile Speed","Median","85%>Posted+5mph","Data Locations",null,"Property Damage Only","Injury","Fatality","Total","Sliding Window Crash Rate","Avg. Rate for Similar Roads","Threshold Rate",null,"Access Points","Access Density",null,"Vertical Elevation","Grade","Horizontal Profile","Horizontal Curvature",null,"Volume",null,null,null,null,null,null,null,null,null,null,null,null,null,null,null,null,null,null,null,null,"Dist","85th","Mean"]
[null,0,{"$f":"IF(D5=\"\", \"\", D5*0.0001893939)","v":-0.1893939},-1000,{"$f":"IF(D5=\"\", \"\", ROUND(VLOOKUP($C5, 'Data Inputs'!$C$5:$F$648, 3, TRUE), 2))","v":5.16},null,null,{"$f":"IF(ISNUMBER(VLOOKUP($B5, 'Data Inputs'!$B$5:$F$648, 5, FALSE))=TRUE, VLOOKUP($B5, 'Data Inputs'!$B$5:$F$648, 5, FALSE), \"\")","v":""},{"$f":"IF(ISNUMBER(VLOOKUP($B5, 'Data Inputs'!$B$5:$H$648, 6, FALSE))=TRUE, VLOOKUP($B5, 'Data Inputs'!$B$5:$H$648, 6, FALSE), \"\")","v":""},{"$f":"IF(ISNUMBER(VLOOKUP($B5, 'Data Inputs'!$B$5:$H$648, 7, FALSE))=TRUE, VLOOKUP($B5, 'Data Inputs'!$B$5:$H$648, 7, FALSE), \"\")","v":""},{"$f":"MIN('Data Inputs'!$F$5:$F$206)","v":30},{"$f":"IF($D5=\"\",\"\",(IF($D5<=$BB$5,$BC$5,IF($D5=$BB$6,$BC$6,IF($D5=$BB$7,$BC$7,IF($D5=$BB$8,$BC$8,IF(AND($BA$6=\"N\",$D5>$BB$5)=TRUE,$BC$5,IF(AND($BA$7=\"N\",$D5>$BB$6)=TRUE,$BC$6,IF(AND($BA$8=\"N\",$D5>$BB$7)=TRUE,$BC$7,IF(AND($BA$9=\"N\",$D5>$BB$8)=TRUE,$BC$8,IF($BA$6=\"Y\",IF(AND($D5>$BB$5,$D5<$BB$6)=TRUE,(($D5-$BB$5)/($BB$5-$BB$6)*(BC$5-BC$6))+MIN(BC$6,BC$5),IF($BA$7=\"Y\",IF(AND($D5>$BB$6,$D5<$BB$7)=TRUE,(($D5-$BB$6)/($BB$6-$BB$7)*(BC$6-BC$7))+MIN(BC$7,BC$6),IF($BA$8=\"Y\",IF(AND($D5>$BB$7,$D5<$BB$8)=TRUE,(($D5-$BB$7)/($BB$7-$BB$8)*(BC$7-BC$8))+MIN(BC$8,BC$7),IF($BA$9=\"Y\",IF(AND($D5>$BB$8,$D5<$BB$9)=TRUE,(($D5-$BB$8)/($BB$8-$BB$9)*(BC$8-BC$9))+MIN(BC$9,BC$8),IF($D5>=$BB$9,$BC$9,\"\")))))))))))))))))))","v":34},{"$f":"IF($D5=\"\",\"\",(IF($D5<=$BB$5,$BD$5,IF($D5=$BB$6,$BD$6,IF($D5=$BB$7,$BD$7,IF($D5=$BB$8,$BD$8,IF(AND($BA$6=\"N\",$D5>$BB$5)=TRUE,$BD$5,IF(AND($BA$7=\"N\",$D5>$BB$6)=TRUE,$BD$6,IF(AND($BA$8=\"N\",$D5>$BB$7)=TRUE,$BD$7,IF(AND($BA$9=\"N\",$D5>$BB$8)=TRUE,$BD$8,IF($BA$6=\"Y\",IF(AND($D5>$BB$5,$D5<$BB$6)=TRUE,(($D5-$BB$5)/($BB$5-$BB$6)*(BD$5-BD$6))+MIN(BD$6,BD$5),IF($BA$7=\"Y\",IF(AND($D5>$BB$6,$D5<$BB$7)=TRUE,(($D5-$BB$6)/($BB$6-$BB$7)*(BD$6-BD$7))+MIN(BD$7,BD$6),IF($BA$8=\"Y\",IF(AND($D5>$BB$7,$D5<$BB$8)=TRUE,(($D5-$BB$7)/($BB$7-$BB$8)*(BD$7-BD$8))+MIN(BD$8,BD$7),IF($BA$9=\"Y\",IF(AND($D5>$BB$8,$D5<$BB$9)=TRUE,(($D5-$BB$8)/($BB$8-$BB$9)*(BD$8-BD$9))+MIN(BD$9,BD$8),IF($D5>=$BB$9,$BD$9,\"\")))))))))))))))))))","v":30},{"$f":"IF($D5=\"\", \"\", IF(L5>(K5+5),15,NA()))","v":{"$error":"#N/A"}},null,null,{"$f":"IF(ISNUMBER(VLOOKUP($B5, 'Data Inputs'!$B$5:$K$648, 8, FALSE))=TRUE, VLOOKUP($B5, 'Data Inputs'!$B$5:$K$648, 8, FALSE), \"\")","v":""},{"$f":"IF(ISNUMBER(VLOOKUP($B5, 'Data Inputs'!$B$5:$K$648, 9, FALSE))=TRUE, VLOOKUP($B5, 'Data Inputs'!$B$5:$K$648, 9, FALSE), \"\")","v":""},{"$f":"IF(ISNUMBER(VLOOKUP($B5, 'Data Inputs'!$B$5:$K$648, 10, FALSE))=TRUE, VLOOKUP($B5, 'Data Inputs'!$B$5:$K$648, 10, FALSE), \"\")","v":""},{"$f":"SUM(Q5:S5)","v":0},null,{"$f":"IF(U5=\"\", \"\", 'Basic Input'!$C$12)","v":""},null,null,{"$f":"IF(ISNUMBER(VLOOKUP($B5, 'Data Inputs'!$B$5:$L$648, 11, FALSE))=TRUE, VLOOKUP($B5, 'Data Inputs'!$B$5:$L$648, 11, FALSE), \"\")","v":""},null,null,null,null,null,null,null,{"$f":"VLOOKUP(D5,'Working Data - Vol'!D5:G71,4,TRUE)","v":4310},null,null,null,null,null,null,null,null,null,null,null,null,null,null,null,null,null,null,1,{"$f":"IF(ISNUMBER(BB5)=TRUE, \"Y\", \"N\")","v":"Y"},{"$f":"IF(ISNUMBER(VLOOKUP($AZ5, 'Data Inputs'!$A$5:$H$206, 4, FALSE)), VLOOKUP($AZ5, 'Data Inputs'!$A$5:$H$206, 4, FALSE), \"\")","v":100},{"$f":"IF(ISNUMBER(VLOOKUP($AZ5, 'Data Inputs'!$A$5:$H$206, 7, FALSE)), VLOOKUP($AZ5, 'Data Inputs'!$A$5:$H$206, 7, FALSE), \"\")","v":34},{"$f":"IF(ISNUMBER(VLOOKUP($AZ5, 'Data Inputs'!$A$5:$H$206, 8, FALSE)), VLOOKUP($AZ5, 'Data Inputs'!$A$5:$H$206, 8, FALSE), \"\")","v":30}]
[null,1,{"$f":"IF(D6=\"\", \"\", D6*0.0001893939)","v":-0.17045451},{"$f":"D5+100","v":-900},{"$f":"IF(D6=\"\", \"\", ROUND(VLOOKUP($C6, 'Data Inputs'!$C$5:$F$648, 3, TRUE), 2))","v":5.18},null,null,{"$f":"IF(ISNUMBER(VLOOKUP($B6, 'Data Inputs'!$B$5:$F$648, 5, FALSE))=TRUE, VLOOKUP($B6, 'Data Inputs'!$B$5:$F$648, 5, FALSE), \"\")","v":""},{"$f":"IF(ISNUMBER(VLOOKUP($B6, 'Data Inputs'!$B$5:$H$648, 6, FALSE))=TRUE, VLOOKUP($B6, 'Data Inputs'!$B$5:$H$648, 6, FALSE), \"\")","v":""},{"$f":"IF(ISNUMBER(VLOOKUP($B6, 'Data Inputs'!$B$5:$H$648, 7, FALSE))=TRUE, VLOOKUP($B6, 'Data Inputs'!$B$5:$H$648, 7, FALSE), \"\")","v":""},{"$f":"IF(D6=\"\", $K$69, IF(H6<>\"\", H6, K7))","v":30},{"$f":"IF(D6=\"\",\"\",(IF(D6<=$BB$5,$BC$5,IF(D6=$BB$6,$BC$6,IF(D6=$BB$7,$BC$7,IF(D6=$BB$8,$BC$8,IF(AND($BA$6=\"N\",D6>$BB$5)=TRUE,$BC$5,IF(AND($BA$7=\"N\",D6>$BB$6)=TRUE,$BC$6,IF(AND($BA$8=\"N\",D6>$BB$7)=TRUE,$BC$7,IF(AND($BA$9=\"N\",D6>$BB$8)=TRUE,$BC$8,IF($BA$6=\"Y\",IF(AND(D6>$BB$5,D6<$BB$6)=TRUE,(($D6-$BB$5)/($BB$5-$BB$6)*(BC$5-BC$6))+MIN(BC$6,BC$5),IF($BA$7=\"Y\",IF(AND(D6>$BB$6,D6<$BB$7)=TRUE,(($D6-$BB$6)/($BB$6-$BB$7)*(BC$6-BC$7))+MIN(BC$7,BC$6),IF($BA$8=\"Y\",IF(AND(D6>$BB$7,D6<$BB$8)=TRUE,(($D6-$BB$7)/($BB$7-$BB$8)*(BC$7-BC$8))+MIN(BC$8,BC$7),IF($BA$9=\"Y\",IF(AND(D6>$BB$8,D6<$BB$9)=TRUE,(($D6-$BB$8)/($BB$8-$BB$9)*(BC$8-BC$9))+MIN(BC$9,BC$8),IF(D6>=$BB$9,$BC$9,\"\")))))))))))))))))))","v":34},30,{"$f":"IF($D6=\"\", \"\", IF(L6>(K6+5),15,NA()))","v":{"$error":"#N/A"}},null,null,{"$f":"IF(ISNUMBER(VLOOKUP($B6, 'Data Inputs'!$B$5:$K$648, 8, FALSE))=TRUE, VLOOKUP($B6, 'Data Inputs'!$B$5:$K$648, 8, FALSE), \"\")","v":""},{"$f":"IF(ISNUMBER(VLOOKUP($B6, 'Data Inputs'!$B$5:$K$648, 9, FALSE))=TRUE, VLOOKUP($B6, 'Data Inputs'!$B$5:$K$648, 9, FALSE), \"\")","v":""},{"$f":"IF(ISNUMBER(VLOOKUP($B6, 'Data Inputs'!$B$5:$K$648, 10, FALSE))=TRUE, VLOOKUP($B6, 'Data Inputs'!$B$5:$K$648, 10, FALSE), \"\")","v":""},0,null,{"$f":"IF(U6=\"\", \"\", 'Basic Input'!$C$12)","v":""},null,null,{"$f":"IF(ISNUMBER(VLOOKUP($B6, 'Data Inputs'!$B$5:$L$648, 11, FALSE))=TRUE, VLOOKUP($B6, 'Data Inputs'!$B$5:$L$648, 11, FALSE), \"\")","v":""},null,null,null,null,null,null,null,{"$f":"VLOOKUP(D6,'Working Data - Vol'!D6:G72,4,TRUE)","v":4310},null,null,null,null,null,null,null,null,null,null,null,null,null,null,null,null,null,null,2,{"$f":"IF(ISNUMBER(BB6)=TRUE, \"Y\", \"N\")","v":"Y"},{"$f":"IF(ISNUMBER(VLOOKUP($AZ6, 'Data Inputs'!$A$5:$H$206, 4, FALSE)), VLOOKUP($AZ6, 'Data Inputs'!$A$5:$H$206, 4, FALSE), \"\")","v":500},{"$f":"IF(ISNUMBER(VLOOKUP($AZ6, 'Data Inputs'!$A$5:$H$206, 7, FALSE)), VLOOKUP($AZ6, 'Data Inputs'!$A$5:$H$206, 7, FALSE), \"\")","v":38},{"$f":"IF(ISNUMBER(VLOOKUP($AZ6, 'Data Inputs'!$A$5:$H$206, 8, FALSE)), VLOOKUP($AZ6, 'Data Inputs'!$A$5:$H$206, 8, FALSE), \"\")","v":33}]
[null,2,-0.15151512,{"$f":"D6+100","v":-800},{"$f":"IF(D7=\"\", \"\", ROUND(VLOOKUP($C7, 'Data Inputs'!$C$5:$F$648, 3, TRUE), 2))","v":5.2},null,null,{"$f":"IF(ISNUMBER(VLOOKUP($B7, 'Data Inputs'!$B$5:$F$648, 5, FALSE))=TRUE, VLOOKUP($B7, 'Data Inputs'!$B$5:$F$648, 5, FALSE), \"\")","v":""},{"$f":"IF(ISNUMBER(VLOOKUP($B7, 'Data Inputs'!$B$5:$H$648, 6, FALSE))=TRUE, VLOOKUP($B7, 'Data Inputs'!$B$5:$H$648, 6, FALSE), \"\")","v":""},{"$f":"IF(ISNUMBER(VLOOKUP($B7, 'Data Inputs'!$B$5:$H$648, 7, FALSE))=TRUE, VLOOKUP($B7, 'Data Inputs'!$B$5:$H$648, 7, FALSE), \"\")","v":""},{"$f":"IF(D7=\"\", $K$69, IF(H7<>\"\", H7, K8))","v":30},34,30,{"$error":"#N/A"},null,null,{"$f":"IF(ISNUMBER(VLOOKUP($B7, 'Data Inputs'!$B$5:$K$648, 8, FALSE))=TRUE, VLOOKUP($B7, 'Data Inputs'!$B$5:$K$648, 8, FALSE), \"\")","v":""},{"$f":"IF(ISNUMBER(VLOOKUP($B7, 'Data Inputs'!$B$5:$K$648, 9, FALSE))=TRUE, VLOOKUP($B7, 'Data Inputs'!$B$5:$K$648, 9, FALSE), \"\")","v":""},{"$f":"IF(ISNUMBER(VLOOKUP($B7, 'Data Inputs'!$B$5:$K$648, 10, FALSE))=TRUE, VLOOKUP($B7, 'Data Inputs'!$B$5:$K$648, 10, FALSE), \"\")","v":""},0,null,{"$f":"IF(U7=\"\", \"\", 'Basic Input'!$C$12)","v":""},null,null,{"$f":"IF(ISNUMBER(VLOOKUP($B7, 'Data Inputs'!$B$5:$L$648, 11, FALSE))=TRUE, VLOOKUP($B7, 'Data Inputs'!$B$5:$L$648, 11, FALSE), \"\")","v":""},null,null,null,null,null,null,null,{"$f":"VLOOKUP(D7,'Working Data - Vol'!D7:G73,4,TRUE)","v":4310},null,null,null,null,null,null,null,null,null,null,null,null,null,null,null,null,{"$f":"-AC7","v":0},null,3,"Y",{"$f":"IF(ISNUMBER(VLOOKUP($AZ7, 'Data Inputs'!$A$5:$H$206, 4, FALSE)), VLOOKUP($AZ7, 'Data Inputs'!$A$5:$H$206, 4, FALSE), \"\")","v":1200},{"$f":"IF(ISNUMBER(VLOOKUP($AZ7, 'Data Inputs'!$A$5:$H$206, 7, FALSE)), VLOOKUP($AZ7, 'Data Inputs'!$A$5:$H$206, 7, FALSE), \"\")","v":""},{"$f":"IF(ISNUMBER(VLOOKUP($AZ7, 'Data Inputs'!$A$5:$H$206, 8, FALSE)), VLOOKUP($AZ7, 'Data Inputs'!$A$5:$H$206, 8, FALSE), \"\")","v":42.071199999999997}]
[null,3,-0.13257573,-700,{"$f":"IF(D8=\"\", \"\", ROUND(VLOOKUP($C8, 'Data Inputs'!$C$5:$F$648, 3, TRUE), 2))","v":5.22},null,null,{"$f":"IF(ISNUMBER(VLOOKUP($B8, 'Data Inputs'!$B$5:$F$648, 5, FALSE))=TRUE, VLOOKUP($B8, 'Data Inputs'!$B$5:$F$648, 5, FALSE), \"\")","v":""},{"$f":"IF(ISNUMBER(VLOOKUP($B8, 'Data Inputs'!$B$5:$H$648, 6, FALSE))=TRUE, VLOOKUP($B8, 'Data Inputs'!$B$5:$H$648, 6, FALSE), \"\")","v":""},{"$f":"IF(ISNUMBER(VLOOKUP($B8, 'Data Inputs'!$B$5:$H$648, 7, FALSE))=TRUE, VLOOKUP($B8, 'Data Inputs'!$B$5:$H$648, 7, FALSE), \"\")","v":""},30,34,30,{"$error":"#N/A"},null,null,{"$f":"IF(ISNUMBER(VLOOKUP($B8, 'Data Inputs'!$B$5:$K$648, 8, FALSE))=TRUE, VLOOKUP($B8, 'Data Inputs'!$B$5:$K$648, 8, FALSE), \"\")","v":""},{"$f":"IF(ISNUMBER(VLOOKUP($B8, 'Data Inputs'!$B$5:$K$648, 9, FALSE))=TRUE, VLOOKUP($B8, 'Data Inputs'!$B$5:$K$648, 9, FALSE), \"\")","v":""},{"$f":"IF(ISNUMBER(VLOOKUP($B8, 'Data Inputs'!$B$5:$K$648, 10, FALSE))=TRUE, VLOOKUP($B8, 'Data Inputs'!$B$5:$K$648, 10, FALSE), \"\")","v":""},0,null,{"$f":"'Basic Input'!$C$12","v":1.1040000000000001},{"$f":"IF('Basic Input'!$C$14=\"\",\"\",'Basic Input'!$C$14)","v":""},null,{"$f":"IF(ISNUMBER(VLOOKUP($B8, 'Data Inputs'!$B$5:$L$648, 11, FALSE))=TRUE, VLOOKUP($B8, 'Data Inputs'!$B$5:$L$648, 11, FALSE), \"\")","v":""},null,null,null,null,null,null,null,{"$f":"VLOOKUP(D8,'Working Data - Vol'!D8:G74,4,TRUE)","v":4310},null,null,null,null,null,null,null,null,null,null,null,null,null,null,null,null,{"$f":"-AC8","v":0},null,4,"Y",{"$f":"IF(ISNUMBER(VLOOKUP($AZ8, 'Data Inputs'!$A$5:$H$206, 4, FALSE)), VLOOKUP($AZ8, 'Data Inputs'!$A$5:$H$206, 4, FALSE), \"\")","v":1600},{"$f":"IF(ISNUMBER(VLOOKUP($AZ8, 'Data Inputs'!$A$5:$H$206, 7, FALSE)), VLOOKUP($AZ8, 'Data Inputs'!$A$5:$H$206, 7, FALSE), \"\")","v":""},{"$f":"IF(ISNUMBER(VLOOKUP($AZ8, 'Data Inputs'!$A$5:$H$206, 8, FALSE)), VLOOKUP($AZ8, 'Data Inputs'!$A$5:$H$206, 8, FALSE), \"\")","v":48.978700000000003}]
[null,4,-0.11363634,-600,{"$f":"IF(D9=\"\", \"\", ROUND(VLOOKUP($C9, 'Data Inputs'!$C$5:$F$648, 3, TRUE), 2))","v":5.24},null,null,{"$f":"IF(ISNUMBER(VLOOKUP($B9, 'Data Inputs'!$B$5:$F$648, 5, FALSE))=TRUE, VLOOKUP($B9, 'Data Inputs'!$B$5:$F$648, 5, FALSE), \"\")","v":""},{"$f":"IF(ISNUMBER(VLOOKUP($B9, 'Data Inputs'!$B$5:$H$648, 6, FALSE))=TRUE, VLOOKUP($B9, 'Data Inputs'!$B$5:$H$648, 6, FALSE), \"\")","v":""},{"$f":"IF(ISNUMBER(VLOOKUP($B9, 'Data Inputs'!$B$5:$H$648, 7, FALSE))=TRUE, VLOOKUP($B9, 'Data Inputs'!$B$5:$H$648, 7, FALSE), \"\")","v":""},30,34,30,{"$error":"#N/A"},null,null,{"$f":"IF(ISNUMBER(VLOOKUP($B9, 'Data Inputs'!$B$5:$K$648, 8, FALSE))=TRUE, VLOOKUP($B9, 'Data Inputs'!$B$5:$K$648, 8, FALSE), \"\")","v":""},{"$f":"IF(ISNUMBER(VLOOKUP($B9, 'Data Inputs'!$B$5:$K$648, 9, FALSE))=TRUE, VLOOKUP($B9, 'Data Inputs'!$B$5:$K$648, 9, FALSE), \"\")","v":""},{"$f":"IF(ISNUMBER(VLOOKUP($B9, 'Data Inputs'!$B$5:$K$648, 10, FALSE))=TRUE, VLOOKUP($B9, 'Data Inputs'!$B$5:$K$648, 10, FALSE), \"\")","v":""},0,null,{"$f":"'Basic Input'!$C$12","v":1.1040000000000001},{"$f":"IF('Basic Input'!$C$14=\"\",\"\",'Basic Input'!$C$14)","v":""},null,{"$f":"IF(ISNUMBER(VLOOKUP($B9, 'Data Inputs'!$B$5:$L$648, 11, FALSE))=TRUE, VLOOKUP($B9, 'Data Inputs'!$B$5:$L$648, 11, FALSE), \"\")","v":""},{"$f":"IF(D9=\"\", \"\",SUM(Y5:Y14)*(5280/1000))","v":26.400000000000002},null,null,null,null,null,null,{"$f":"VLOOKUP(D9,'Working Data - Vol'!D9:G75,4,TRUE)","v":4310},null,null,null,null,null,null,null,null,null,null,null,null,null,null,null,null,{"$f":"-AC9","v":0},null,5,"Y",{"$f":"IF(ISNUMBER(VLOOKUP($AZ9, 'Data Inputs'!$A$5:$H$206, 4, FALSE)), VLOOKUP($AZ9, 'Data Inputs'!$A$5:$H$206, 4, FALSE), \"\")","v":2500},{"$f":"IF(ISNUMBER(VLOOKUP($AZ9, 'Data Inputs'!$A$5:$H$206, 7, FALSE)), VLOOKUP($AZ9, 'Data Inputs'!$A$5:$H$206, 7, FALSE), \"\")","v":64},{"$f":"IF(ISNUMBER(VLOOKUP($AZ9, 'Data Inputs'!$A$5:$H$206, 8, FALSE)), VLOOKUP($AZ9, 'Data Inputs'!$A$5:$H$206, 8, FALSE), \"\")","v":58}]
[null,5,-9.4696950000000002E-2,-500,{"$f":"IF(D10=\"\", \"\", ROUND(VLOOKUP($C10, 'Data Inputs'!$C$5:$F$648, 3, TRUE), 2))","v":5.26},null,null,{"$f":"IF(ISNUMBER(VLOOKUP($B10, 'Data Inputs'!$B$5:$F$648, 5, FALSE))=TRUE, VLOOKUP($B10, 'Data Inputs'!$B$5:$F$648, 5, FALSE), \"\")","v":""},{"$f":"IF(ISNUMBER(VLOOKUP($B10, 'Data Inputs'!$B$5:$H$648, 6, FALSE))=TRUE, VLOOKUP($B10, 'Data Inputs'!$B$5:$H$648, 6, FALSE), \"\")","v":""},{"$f":"IF(ISNUMBER(VLOOKUP($B10, 'Data Inputs'!$B$5:$H$648, 7, FALSE))=TRUE, VLOOKUP($B10, 'Data Inputs'!$B$5:$H$648, 7, FALSE), \"\")","v":""},30,34,30,{"$error":"#N/A"},null,null,{"$f":"IF(ISNUMBER(VLOOKUP($B10, 'Data Inputs'!$B$5:$K$648, 8, FALSE))=TRUE, VLOOKUP($B10, 'Data Inputs'!$B$5:$K$648, 8, FALSE), \"\")","v":3},{"$f":"IF(ISNUMBER(VLOOKUP($B10, 'Data Inputs'!$B$5:$K$648, 9, FALSE))=TRUE, VLOOKUP($B10, 'Data Inputs'!$B$5:$K$648, 9, FALSE), \"\")","v":""},{"$f":"IF(ISNUMBER(VLOOKUP($B10, 'Data Inputs'!$B$5:$K$648, 10, FALSE))=TRUE, VLOOKUP($B10, 'Data Inputs'!$B$5:$K$648, 10, FALSE), \"\")","v":""},3,null,{"$f":"'Basic Input'!$C$12","v":1.1040000000000001},{"$f":"IF('Basic Input'!$C$14=\"\",\"\",'Basic Input'!$C$14)","v":""},null,{"$f":"IF(ISNUMBER(VLOOKUP($B10, 'Data Inputs'!$B$5:$L$648, 11, FALSE))=TRUE, VLOOKUP($B10, 'Data Inputs'!$B$5:$L$648, 11, FALSE), \"\")","v":2},36.96,null,930.8,-3.7878787878788014E-3,null,null,null,{"$f":"VLOOKUP(D10,'Working Data - Vol'!D10:G76,4,TRUE)","v":4310},null,null,null,null,null,null,null,null,null,null,null,null,null,null,null,null,3.7878787878788014E-3]
[null,6,-7.5757560000000002E-2,-400,{"$f":"IF(D11=\"\", \"\", ROUND(VLOOKUP($C11, 'Data Inputs'!$C$5:$F$648, 3, TRUE), 2))","v":5.27},null,null,{"$f":"IF(ISNUMBER(VLOOKUP($B11, 'Data Inputs'!$B$5:$F$648, 5, FALSE))=TRUE, VLOOKUP($B11, 'Data Inputs'!$B$5:$F$648, 5, FALSE), \"\")","v":""},{"$f":"IF(ISNUMBER(VLOOKUP($B11, 'Data Inputs'!$B$5:$H$648, 6, FALSE))=TRUE, VLOOKUP($B11, 'Data Inputs'!$B$5:$H$648, 6, FALSE), \"\")","v":""},{"$f":"IF(ISNUMBER(VLOOKUP($B11, 'Data Inputs'!$B$5:$H$648, 7, FALSE))=TRUE, VLOOKUP($B11, 'Data Inputs'!$B$5:$H$648, 7, FALSE), \"\")","v":""},30,34,30,{"$error":"#N/A"},null,null,{"$f":"IF(ISNUMBER(VLOOKUP($B11, 'Data Inputs'!$B$5:$K$648, 8, FALSE))=TRUE, VLOOKUP($B11, 'Data Inputs'!$B$5:$K$648, 8, FALSE), \"\")","v":""},{"$f":"IF(ISNUMBER(VLOOKUP($B11, 'Data Inputs'!$B$5:$K$648, 9, FALSE))=TRUE, VLOOKUP($B11, 'Data Inputs'!$B$5:$K$648, 9, FALSE), \"\")","v":""},{"$f":"IF(ISNUMBER(VLOOKUP($B11, 'Data Inputs'!$B$5:$K$648, 10, FALSE))=TRUE, VLOOKUP($B11, 'Data Inputs'!$B$5:$K$648, 10, FALSE), \"\")","v":""},0,null,{"$f":"'Basic Input'!$C$12","v":1.1040000000000001},{"$f":"IF('Basic Input'!$C$14=\"\",\"\",'Basic Input'!$C$14)","v":""},null,{"$f":"IF(ISNUMBER(VLOOKUP($B11, 'Data Inputs'!$B$5:$L$648, 11, FALSE))=TRUE, VLOOKUP($B11, 'Data Inputs'!$B$5:$L$648, 11, FALSE), \"\")","v":1},36.96,null,930.6,-3.7878787878788014E-3,null,null,null,{"$f":"VLOOKUP(D11,'Working Data - Vol'!D11:G77,4,TRUE)","v":4310},null,null,null,null,null,null,null,null,null,null,null,null,null,null,null,null,3.7878787878788014E-3]
[null,7,-5.6818170000000001E-2,-300,{"$f":"IF(D12=\"\", \"\", ROUND(VLOOKUP($C12, 'Data Inputs'!$C$5:$F$648, 3, TRUE), 2))","v":5.29},null,null,{"$f":"IF(ISNUMBER(VLOOKUP($B12, 'Data Inputs'!$B$5:$F$648, 5, FALSE))=TRUE, VLOOKUP($B12, 'Data Inputs'!$B$5:$F$648, 5, FALSE), \"\")","v":""},{"$f":"IF(ISNUMBER(VLOOKUP($B12, 'Data Inputs'!$B$5:$H$648, 6, FALSE))=TRUE, VLOOKUP($B12, 'Data Inputs'!$B$5:$H$648, 6, FALSE), \"\")","v":""},{"$f":"IF(ISNUMBER(VLOOKUP($B12, 'Data Inputs'!$B$5:$H$648, 7, FALSE))=TRUE, VLOOKUP($B12, 'Data Inputs'!$B$5:$H$648, 7, FALSE), \"\")","v":""},30,34,30,{"$f":"IF($D12=\"\", \"\", IF(L12>(K12+5),15,NA()))","v":{"$error":"#N/A"}},null,null,{"$f":"IF(ISNUMBER(VLOOKUP($B12, 'Data Inputs'!$B$5:$K$648, 8, FALSE))=TRUE, VLOOKUP($B12, 'Data Inputs'!$B$5:$K$648, 8, FALSE), \"\")","v":""},{"$f":"IF(ISNUMBER(VLOOKUP($B12, 'Data Inputs'!$B$5:$K$648, 9, FALSE))=TRUE, VLOOKUP($B12, 'Data Inputs'!$B$5:$K$648, 9, FALSE), \"\")","v":""},{"$f":"IF(ISNUMBER(VLOOKUP($B12, 'Data Inputs'!$B$5:$K$648, 10, FALSE))=TRUE, VLOOKUP($B12, 'Data Inputs'!$B$5:$K$648, 10, FALSE), \"\")","v":""},0,{"$f":"IF(D12=\"\", \"\",(1000000*SUM(T5:T20))/(365*'Basic Input'!$C$10*AG12))","v":0.88993420843530491},{"$f":"'Basic Input'!$C$12","v":1.1040000000000001},{"$f":"IF('Basic Input'!$C$14=\"\",\"\",'Basic Input'!$C$14)","v":""},null,{"$f":"IF(ISNUMBER(VLOOKUP($B12, 'Data Inputs'!$B$5:$L$648, 11, FALSE))=TRUE, VLOOKUP($B12, 'Data Inputs'!$B$5:$L$648, 11, FALSE), \"\")","v":""},42.24,null,930.2,-3.7878787878788014E-3,null,null,null,{"$f":"VLOOKUP(D12,'Working Data - Vol'!D12:G78,4,TRUE)","v":4310},null,null,null,null,null,null,null,null,null,null,null,null,null,null,null,null,3.7878787878788014E-3]
[null,8,-3.7878780000000001E-2,-200,{"$f":"IF(D13=\"\", \"\", ROUND(VLOOKUP($C13, 'Data Inputs'!$C$5:$F$648, 3, TRUE), 2))","v":5.31},null,null,{"$f":"IF(ISNUMBER(VLOOKUP($B13, 'Data Inputs'!$B$5:$F$648, 5, FALSE))=TRUE, VLOOKUP($B13, 'Data Inputs'!$B$5:$F$648, 5, FALSE), \"\")","v":""},{"$f":"IF(ISNUMBER(VLOOKUP($B13, 'Data Inputs'!$B$5:$H$648, 6, FALSE))=TRUE, VLOOKUP($B13, 'Data Inputs'!$B$5:$H$648, 6, FALSE), \"\")","v":""},{"$f":"IF(ISNUMBER(VLOOKUP($B13, 'Data Inputs'!$B$5:$H$648, 7, FALSE))=TRUE, VLOOKUP($B13, 'Data Inputs'!$B$5:$H$648, 7, FALSE), \"\")","v":""},30,34,30,{"$error":"#N/A"},null,null,{"$f":"IF(ISNUMBER(VLOOKUP($B13, 'Data Inputs'!$B$5:$K$648, 8, FALSE))=TRUE, VLOOKUP($B13, 'Data Inputs'!$B$5:$K$648, 8, FALSE), \"\")","v":""},{"$f":"IF(ISNUMBER(VLOOKUP($B13, 'Data Inputs'!$B$5:$K$648, 9, FALSE))=TRUE, VLOOKUP($B13, 'Data Inputs'!$B$5:$K$648, 9, FALSE), \"\")","v":""},{"$f":"IF(ISNUMBER(VLOOKUP($B13, 'Data Inputs'!$B$5:$K$648, 10, FALSE))=TRUE, VLOOKUP($B13, 'Data Inputs'!$B$5:$K$648, 10, FALSE), \"\")","v":""},0,{"$f":"IF(D13=\"\", \"\",(1000000*SUM(T6:T21))/(365*'Basic Input'!$C$10*AG13))","v":0.88993420843530491},{"$f":"'Basic Input'!$C$12","v":1.1040000000000001},{"$f":"IF('Basic Input'!$C$14=\"\",\"\",'Basic Input'!$C$14)","v":""},null,{"$f":"IF(ISNUMBER(VLOOKUP($B13, 'Data Inputs'!$B$5:$L$648, 11, FALSE))=TRUE, VLOOKUP($B13, 'Data Inputs'!$B$5:$L$648, 11, FALSE), \"\")","v":1},42.24,null,929.8,-3.7878787878788014E-3,null,null,null,{"$f":"VLOOKUP(D13,'Working Data - Vol'!D13:G79,4,TRUE)","v":4310},null,null,null,null,null,null,null,null,null,null,null,null,null,null,null,null,3.7878787878788014E-3]
[null,9,-1.893939E-2,-100,{"$f":"IF(D14=\"\", \"\", ROUND(VLOOKUP($C14, 'Data Inputs'!$C$5:$F$648, 3, TRUE), 2))","v":5.33},null,null,{"$f":"IF(ISNUMBER(VLOOKUP($B14, 'Data Inputs'!$B$5:$F$648, 5, FALSE))=TRUE, VLOOKUP($B14, 'Data Inputs'!$B$5:$F$648, 5, FALSE), \"\")","v":""},{"$f":"IF(ISNUMBER(VLOOKUP($B14, 'Data Inputs'!$B$5:$H$648, 6, FALSE))=TRUE, VLOOKUP($B14, 'Data Inputs'!$B$5:$H$648, 6, FALSE), \"\")","v":""},{"$f":"IF(ISNUMBER(VLOOKUP($B14, 'Data Inputs'!$B$5:$H$648, 7, FALSE))=TRUE, VLOOKUP($B14, 'Data Inputs'!$B$5:$H$648, 7, FALSE), \"\")","v":""},30,34,30,{"$error":"#N/A"},null,null,{"$f":"IF(ISNUMBER(VLOOKUP($B14, 'Data Inputs'!$B$5:$K$648, 8, FALSE))=TRUE, VLOOKUP($B14, 'Data Inputs'!$B$5:$K$648, 8, FALSE), \"\")","v":""},{"$f":"IF(ISNUMBER(VLOOKUP($B14, 'Data Inputs'!$B$5:$K$648, 9, FALSE))=TRUE, VLOOKUP($B14, 'Data Inputs'!$B$5:$K$648, 9, FALSE), \"\")","v":""},{"$f":"IF(ISNUMBER(VLOOKUP($B14, 'Data Inputs'!$B$5:$K$648, 10, FALSE))=TRUE, VLOOKUP($B14, 'Data Inputs'!$B$5:$K$648, 10, FALSE), \"\")","v":""},{"$f":"SUM(Q14:S14)","v":0},{"$f":"IF(D14=\"\", \"\",(1000000*SUM(T7:T22))/(365*'Basic Input'!$C$10*AG14))","v":0.88993420843530491},{"$f":"'Basic Input'!$C$12","v":1.1040000000000001},{"$f":"IF('Basic Input'!$C$14=\"\",\"\",'Basic Input'!$C$14)","v":""},null,{"$f":"IF(ISNUMBER(VLOOKUP($B14, 'Data Inputs'!$B$5:$L$648, 11, FALSE))=TRUE, VLOOKUP($B14, 'Data Inputs'!$B$5:$L$648, 11, FALSE), \"\")","v":1},47.52,null,929.4,-3.7878787878788014E-3,null,null,null,{"$f":"VLOOKUP(D14,'Working Data - Vol'!D14:G80,4,TRUE)","v":4310},null,null,null,null,null,null,null,null,null,null,null,null,null,null,null,null,3.7878787878788014E-3]
[null,10,0,0,{"$f":"IF(D15=\"\", \"\", ROUND(VLOOKUP($C15, 'Data Inputs'!$C$5:$F$648, 3, TRUE), 2))","v":5.35},null,null,{"$f":"IF(ISNUMBER(VLOOKUP($B15, 'Data Inputs'!$B$5:$F$648, 5, FALSE))=TRUE, VLOOKUP($B15, 'Data Inputs'!$B$5:$F$648, 5, FALSE), \"\")","v":""},{"$f":"IF(ISNUMBER(VLOOKUP($B15, 'Data Inputs'!$B$5:$H$648, 6, FALSE))=TRUE, VLOOKUP($B15, 'Data Inputs'!$B$5:$H$648, 6, FALSE), \"\")","v":""},{"$f":"IF(ISNUMBER(VLOOKUP($B15, 'Data Inputs'!$B$5:$H$648, 7, FALSE))=TRUE, VLOOKUP($B15, 'Data Inputs'!$B$5:$H$648, 7, FALSE), \"\")","v":""},30,34,30,{"$error":"#N/A"},null,null,{"$f":"IF(ISNUMBER(VLOOKUP($B15, 'Data Inputs'!$B$5:$K$648, 8, FALSE))=TRUE, VLOOKUP($B15, 'Data Inputs'!$B$5:$K$648, 8, FALSE), \"\")","v":1},{"$f":"IF(ISNUMBER(VLOOKUP($B15, 'Data Inputs'!$B$5:$K$648, 9, FALSE))=TRUE, VLOOKUP($B15, 'Data Inputs'!$B$5:$K$648, 9, FALSE), \"\")","v":2},{"$f":"IF(ISNUMBER(VLOOKUP($B15, 'Data Inputs'!$B$5:$K$648, 10, FALSE))=TRUE, VLOOKUP($B15, 'Data Inputs'!$B$5:$K$648, 10, FALSE), \"\")","v":""},{"$f":"SUM(Q15:S15)","v":3},{"$f":"IF(D15=\"\", \"\",(1000000*SUM(T8:T23))/(365*'Basic Input'!$C$10*AG15))","v":1.0170676667832057},{"$f":"'Basic Input'!$C$12","v":1.1040000000000001},{"$f":"IF('Basic Input'!$C$14=\"\",\"\",'Basic Input'!$C$14)","v":""},null,{"$f":"IF(ISNUMBER(VLOOKUP($B15, 'Data Inputs'!$B$5:$L$648, 11, FALSE))=TRUE, VLOOKUP($B15, 'Data Inputs'!$B$5:$L$648, 11, FALSE), \"\")","v":2},36.96,null,929,1.8939393939393669E-3,null,null,null,{"$f":"VLOOKUP(D15,'Working Data - Vol'!D15:G81,4,TRUE)","v":4310},null,null,null,null,null,null,null,null,null,null,null,null,null,null,null,null,-1.8939393939393669E-3]
[null,11,1.893939E-2,100,{"$f":"IF(D16=\"\", \"\", ROUND(VLOOKUP($C16, 'Data Inputs'!$C$5:$F$648, 3, TRUE), 2))","v":5.37},null,null,{"$f":"IF(ISNUMBER(VLOOKUP($B16, 'Data Inputs'!$B$5:$F$648, 5, FALSE))=TRUE, VLOOKUP($B16, 'Data Inputs'!$B$5:$F$648, 5, FALSE), \"\")","v":""},{"$f":"IF(ISNUMBER(VLOOKUP($B16, 'Data Inputs'!$B$5:$H$648, 6, FALSE))=TRUE, VLOOKUP($B16, 'Data Inputs'!$B$5:$H$648, 6, FALSE), \"\")","v":34},{"$f":"IF(ISNUMBER(VLOOKUP($B16, 'Data Inputs'!$B$5:$H$648, 7, FALSE))=TRUE, VLOOKUP($B16, 'Data Inputs'!$B$5:$H$648, 7, FALSE), \"\")","v":30},30,34,30,{"$error":"#N/A"},null,null,{"$f":"IF(ISNUMBER(VLOOKUP($B16, 'Data Inputs'!$B$5:$K$648, 8, FALSE))=TRUE, VLOOKUP($B16, 'Data Inputs'!$B$5:$K$648, 8, FALSE), \"\")","v":""},{"$f":"IF(ISNUMBER(VLOOKUP($B16, 'Data Inputs'!$B$5:$K$648, 9, FALSE))=TRUE, VLOOKUP($B16, 'Data Inputs'!$B$5:$K$648, 9, FALSE), \"\")","v":""},{"$f":"IF(ISNUMBER(VLOOKUP($B16, 'Data Inputs'!$B$5:$K$648, 10, FALSE))=TRUE, VLOOKUP($B16, 'Data Inputs'!$B$5:$K$648, 10, FALSE), \"\")","v":""},0,{"$f":"IF(D16=\"\", \"\",(1000000*SUM(T9:T24))/(365*'Basic Input'!$C$10*AG16))","v":1.0170676667832057},{"$f":"'Basic Input'!$C$12","v":1.1040000000000001},{"$f":"IF('Basic Input'!$C$14=\"\",\"\",'Basic Input'!$C$14)","v":""},null,{"$f":"IF(ISNUMBER(VLOOKUP($B16, 'Data Inputs'!$B$5:$L$648, 11, FALSE))=TRUE, VLOOKUP($B16, 'Data Inputs'!$B$5:$L$648, 11, FALSE), \"\")","v":""},31.68,null,929.80000000000007,7.5757575757575352E-3,null,null,null,{"$f":"VLOOKUP(D16,'Working Data - Vol'!D16:G82,4,TRUE)","v":4310},null,null,null,null,null,null,null,null,null,null,null,null,null,null,null,null,-7.5757575757575352E-3]
[null,12,3.7878780000000001E-2,200,{"$f":"IF(D17=\"\", \"\", ROUND(VLOOKUP($C17, 'Data Inputs'!$C$5:$F$648, 3, TRUE), 2))","v":5.39},null,null,{"$f":"IF(ISNUMBER(VLOOKUP($B17, 'Data Inputs'!$B$5:$F$648, 5, FALSE))=TRUE, VLOOKUP($B17, 'Data Inputs'!$B$5:$F$648, 5, FALSE), \"\")","v":""},{"$f":"IF(ISNUMBER(VLOOKUP($B17, 'Data Inputs'!$B$5:$H$648, 6, FALSE))=TRUE, VLOOKUP($B17, 'Data Inputs'!$B$5:$H$648, 6, FALSE), \"\")","v":""},{"$f":"IF(ISNUMBER(VLOOKUP($B17, 'Data Inputs'!$B$5:$H$648, 7, FALSE))=TRUE, VLOOKUP($B17, 'Data Inputs'!$B$5:$H$648, 7, FALSE), \"\")","v":""},30,35,30.75,{"$error":"#N/A"},null,null,{"$f":"IF(ISNUMBER(VLOOKUP($B17, 'Data Inputs'!$B$5:$K$648, 8, FALSE))=TRUE, VLOOKUP($B17, 'Data Inputs'!$B$5:$K$648, 8, FALSE), \"\")","v":""},{"$f":"IF(ISNUMBER(VLOOKUP($B17, 'Data Inputs'!$B$5:$K$648, 9, FALSE))=TRUE, VLOOKUP($B17, 'Data Inputs'!$B$5:$K$648, 9, FALSE), \"\")","v":""},{"$f":"IF(ISNUMBER(VLOOKUP($B17, 'Data Inputs'!$B$5:$K$648, 10, FALSE))=TRUE, VLOOKUP($B17, 'Data Inputs'!$B$5:$K$648, 10, FALSE), \"\")","v":""},0,{"$f":"IF(D17=\"\", \"\",(1000000*SUM(T10:T25))/(365*'Basic Input'!$C$10*AG17))","v":1.0170676667832057},{"$f":"'Basic Input'!$C$12","v":1.1040000000000001},{"$f":"IF('Basic Input'!$C$14=\"\",\"\",'Basic Input'!$C$14)","v":""},null,{"$f":"IF(ISNUMBER(VLOOKUP($B17, 'Data Inputs'!$B$5:$L$648, 11, FALSE))=TRUE, VLOOKUP($B17, 'Data Inputs'!$B$5:$L$648, 11, FALSE), \"\")","v":1},31.68,null,930.6,7.5757575757575352E-3,null,null,null,{"$f":"VLOOKUP(D17,'Working Data - Vol'!D17:G83,4,TRUE)","v":4310},null,null,null,null,null,null,null,null,null,null,null,null,null,null,null,null,-7.5757575757575352E-3]
[null,13,5.6818170000000001E-2,300,{"$f":"IF(D18=\"\", \"\", ROUND(VLOOKUP($C18, 'Data Inputs'!$C$5:$F$648, 3, TRUE), 2))","v":5.41},null,null,{"$f":"IF(ISNUMBER(VLOOKUP($B18, 'Data Inputs'!$B$5:$F$648, 5, FALSE))=TRUE, VLOOKUP($B18, 'Data Inputs'!$B$5:$F$648, 5, FALSE), \"\")","v":""},{"$f":"IF(ISNUMBER(VLOOKUP($B18, 'Data Inputs'!$B$5:$H$648, 6, FALSE))=TRUE, VLOOKUP($B18, 'Data Inputs'!$B$5:$H$648, 6, FALSE), \"\")","v":""},{"$f":"IF(ISNUMBER(VLOOKUP($B18, 'Data Inputs'!$B$5:$H$648, 7, FALSE))=TRUE, VLOOKUP($B18, 'Data Inputs'!$B$5:$H$648, 7, FALSE), \"\")","v":""},30,36,31.5,15,null,null,{"$f":"IF(ISNUMBER(VLOOKUP($B18, 'Data Inputs'!$B$5:$K$648, 8, FALSE))=TRUE, VLOOKUP($B18, 'Data Inputs'!$B$5:$K$648, 8, FALSE), \"\")","v":""},{"$f":"IF(ISNUMBER(VLOOKUP($B18, 'Data Inputs'!$B$5:$K$648, 9, FALSE))=TRUE, VLOOKUP($B18, 'Data Inputs'!$B$5:$K$648, 9, FALSE), \"\")","v":""},{"$f":"IF(ISNUMBER(VLOOKUP($B18, 'Data Inputs'!$B$5:$K$648, 10, FALSE))=TRUE, VLOOKUP($B18, 'Data Inputs'!$B$5:$K$648, 10, FALSE), \"\")","v":""},0,{"$f":"IF(D18=\"\", \"\",(1000000*SUM(T11:T26))/(365*'Basic Input'!$C$10*AG18))","v":0.63566729173950354},{"$f":"'Basic Input'!$C$12","v":1.1040000000000001},{"$f":"IF('Basic Input'!$C$14=\"\",\"\",'Basic Input'!$C$14)","v":""},null,{"$f":"IF(ISNUMBER(VLOOKUP($B18, 'Data Inputs'!$B$5:$L$648, 11, FALSE))=TRUE, VLOOKUP($B18, 'Data Inputs'!$B$5:$L$648, 11, FALSE), \"\")","v":""},31.68,null,931.4,7.5757575757575352E-3,null,null,null,{"$f":"VLOOKUP(D18,'Working Data - Vol'!D18:G84,4,TRUE)","v":4310},null,null,null,null,null,null,null,null,null,null,null,null,null,null,null,null,-7.5757575757575352E-3]
[null,14,7.5757560000000002E-2,400,{"$f":"IF(D19=\"\", \"\", ROUND(VLOOKUP($C19, 'Data Inputs'!$C$5:$F$648, 3, TRUE), 2))","v":5.43},null,null,{"$f":"IF(ISNUMBER(VLOOKUP($B19, 'Data Inputs'!$B$5:$F$648, 5, FALSE))=TRUE, VLOOKUP($B19, 'Data Inputs'!$B$5:$F$648, 5, FALSE), \"\")","v":""},{"$f":"IF(ISNUMBER(VLOOKUP($B19, 'Data Inputs'!$B$5:$H$648, 6, FALSE))=TRUE, VLOOKUP($B19, 'Data Inputs'!$B$5:$H$648, 6, FALSE), \"\")","v":""},{"$f":"IF(ISNUMBER(VLOOKUP($B19, 'Data Inputs'!$B$5:$H$648, 7, FALSE))=TRUE, VLOOKUP($B19, 'Data Inputs'!$B$5:$H$648, 7, FALSE), \"\")","v":""},30,37,32.25,15,null,null,{"$f":"IF(ISNUMBER(VLOOKUP($B19, 'Data Inputs'!$B$5:$K$648, 8, FALSE))=TRUE, VLOOKUP($B19, 'Data Inputs'!$B$5:$K$648, 8, FALSE), \"\")","v":1},{"$f":"IF(ISNUMBER(VLOOKUP($B19, 'Data Inputs'!$B$5:$K$648, 9, FALSE))=TRUE, VLOOKUP($B19, 'Data Inputs'!$B$5:$K$648, 9, FALSE), \"\")","v":""},{"$f":"IF(ISNUMBER(VLOOKUP($B19, 'Data Inputs'!$B$5:$K$648, 10, FALSE))=TRUE, VLOOKUP($B19, 'Data Inputs'!$B$5:$K$648, 10, FALSE), \"\")","v":""},1,{"$f":"IF(D19=\"\", \"\",(1000000*SUM(T12:T27))/(365*'Basic Input'!$C$10*AG19))","v":0.63566729173950354},{"$f":"'Basic Input'!$C$12","v":1.1040000000000001},{"$f":"IF('Basic Input'!$C$14=\"\",\"\",'Basic Input'!$C$14)","v":""},null,{"$f":"IF(ISNUMBER(VLOOKUP($B19, 'Data Inputs'!$B$5:$L$648, 11, FALSE))=TRUE, VLOOKUP($B19, 'Data Inputs'!$B$5:$L$648, 11, FALSE), \"\")","v":1},26.400000000000002,null,932.19999999999993,7.5757575757575352E-3,null,0,null,{"$f":"VLOOKUP(D19,'Working Data - Vol'!D19:G85,4,TRUE)","v":4310},null,null,null,null,null,null,null,null,null,null,null,null,null,null,null,null,-7.5757575757575352E-3]
[null,15,9.4696950000000002E-2,500,{"$f":"IF(D20=\"\", \"\", ROUND(VLOOKUP($C20, 'Data Inputs'!$C$5:$F$648, 3, TRUE), 2))","v":5.44},null,null,{"$f":"IF(ISNUMBER(VLOOKUP($B20, 'Data Inputs'!$B$5:$F$648, 5, FALSE))=TRUE, VLOOKUP($B20, 'Data Inputs'!$B$5:$F$648, 5, FALSE), \"\")","v":""},{"$f":"IF(ISNUMBER(VLOOKUP($B20, 'Data Inputs'!$B$5:$H$648, 6, FALSE))=TRUE, VLOOKUP($B20, 'Data Inputs'!$B$5:$H$648, 6, FALSE), \"\")","v":38},{"$f":"IF(ISNUMBER(VLOOKUP($B20, 'Data Inputs'!$B$5:$H$648, 7, FALSE))=TRUE, VLOOKUP($B20, 'Data Inputs'!$B$5:$H$648, 7, FALSE), \"\")","v":33},30,38,33,15,null,null,{"$f":"IF(ISNUMBER(VLOOKUP($B20, 'Data Inputs'!$B$5:$K$648, 8, FALSE))=TRUE, VLOOKUP($B20, 'Data Inputs'!$B$5:$K$648, 8, FALSE), \"\")","v":""},{"$f":"IF(ISNUMBER(VLOOKUP($B20, 'Data Inputs'!$B$5:$K$648, 9, FALSE))=TRUE, VLOOKUP($B20, 'Data Inputs'!$B$5:$K$648, 9, FALSE), \"\")","v":""},{"$f":"IF(ISNUMBER(VLOOKUP($B20, 'Data Inputs'!$B$5:$K$648, 10, FALSE))=TRUE, VLOOKUP($B20, 'Data Inputs'!$B$5:$K$648, 10, FALSE), \"\")","v":""},0,{"$f":"IF(D20=\"\", \"\",(1000000*SUM(T13:T28))/(365*'Basic Input'!$C$10*AG20))","v":0.63566729173950354},{"$f":"'Basic Input'!$C$12","v":1.1040000000000001},{"$f":"IF('Basic Input'!$C$14=\"\",\"\",'Basic Input'!$C$14)","v":""},null,{"$f":"IF(ISNUMBER(VLOOKUP($B20, 'Data Inputs'!$B$5:$L$648, 11, FALSE))=TRUE, VLOOKUP($B20, 'Data Inputs'!$B$5:$L$648, 11, FALSE), \"\")","v":""},15.84,null,932.6,7.5757575757575352E-3,null,0,null,{"$f":"VLOOKUP(D20,'Working Data - Vol'!D20:G86,4,TRUE)","v":4310},null,null,null,null,null,null,null,null,null,null,null,null,null,null,null,null,-7.5757575757575352E-3]
[null,16,0.11363634,600,{"$f":"IF(D21=\"\", \"\", ROUND(VLOOKUP($C21, 'Data Inputs'!$C$5:$F$648, 3, TRUE), 2))","v":5.46},null,null,{"$f":"IF(ISNUMBER(VLOOKUP($B21, 'Data Inputs'!$B$5:$F$648, 5, FALSE))=TRUE, VLOOKUP($B21, 'Data Inputs'!$B$5:$F$648, 5, FALSE), \"\")","v":""},{"$f":"IF(ISNUMBER(VLOOKUP($B21, 'Data Inputs'!$B$5:$H$648, 6, FALSE))=TRUE, VLOOKUP($B21, 'Data Inputs'!$B$5:$H$648, 6, FALSE), \"\")","v":""},{"$f":"IF(ISNUMBER(VLOOKUP($B21, 'Data Inputs'!$B$5:$H$648, 7, FALSE))=TRUE, VLOOKUP($B21, 'Data Inputs'!$B$5:$H$648, 7, FALSE), \"\")","v":""},30,{"$error":"#VALUE!"},34.295885714285717,{"$error":"#VALUE!"},null,null,{"$f":"IF(ISNUMBER(VLOOKUP($B21, 'Data Inputs'!$B$5:$K$648, 8, FALSE))=TRUE, VLOOKUP($B21, 'Data Inputs'!$B$5:$K$648, 8, FALSE), \"\")","v":""},{"$f":"IF(ISNUMBER(VLOOKUP($B21, 'Data Inputs'!$B$5:$K$648, 9, FALSE))=TRUE, VLOOKUP($B21, 'Data Inputs'!$B$5:$K$648, 9, FALSE), \"\")","v":""},{"$f":"IF(ISNUMBER(VLOOKUP($B21, 'Data Inputs'!$B$5:$K$648, 10, FALSE))=TRUE, VLOOKUP($B21, 'Data Inputs'!$B$5:$K$648, 10, FALSE), \"\")","v":""},0,{"$f":"IF(D21=\"\", \"\",(1000000*SUM(T14:T29))/(365*'Basic Input'!$C$10*AG21))","v":0.63566729173950354},{"$f":"'Basic Input'!$C$12","v":1.1040000000000001},{"$f":"IF('Basic Input'!$C$14=\"\",\"\",'Basic Input'!$C$14)","v":""},null,{"$f":"IF(ISNUMBER(VLOOKUP($B21, 'Data Inputs'!$B$5:$L$648, 11, FALSE))=TRUE, VLOOKUP($B21, 'Data Inputs'!$B$5:$L$648, 11, FALSE), \"\")","v":""},15.84,null,932.66666666666663,-6.313131313131261E-3,null,0,null,{"$f":"VLOOKUP(D21,'Working Data - Vol'!D21:G87,4,TRUE)","v":4310},null,null,null,null,null,null,null,null,null,null,null,null,null,null,null,null,6.313131313131261E-3]
[null,17,0.13257573,700,{"$f":"IF(D22=\"\", \"\", ROUND(VLOOKUP($C22, 'Data Inputs'!$C$5:$F$648, 3, TRUE), 2))","v":5.48},null,null,{"$f":"IF(ISNUMBER(VLOOKUP($B22, 'Data Inputs'!$B$5:$F$648, 5, FALSE))=TRUE, VLOOKUP($B22, 'Data Inputs'!$B$5:$F$648, 5, FALSE), \"\")","v":""},{"$f":"IF(ISNUMBER(VLOOKUP($B22, 'Data Inputs'!$B$5:$H$648, 6, FALSE))=TRUE, VLOOKUP($B22, 'Data Inputs'!$B$5:$H$648, 6, FALSE), \"\")","v":""},{"$f":"IF(ISNUMBER(VLOOKUP($B22, 'Data Inputs'!$B$5:$H$648, 7, FALSE))=TRUE, VLOOKUP($B22, 'Data Inputs'!$B$5:$H$648, 7, FALSE), \"\")","v":""},30,{"$error":"#VALUE!"},35.591771428571427,{"$error":"#VALUE!"},20,null,{"$f":"IF(ISNUMBER(VLOOKUP($B22, 'Data Inputs'!$B$5:$K$648, 8, FALSE))=TRUE, VLOOKUP($B22, 'Data Inputs'!$B$5:$K$648, 8, FALSE), \"\")","v":""},{"$f":"IF(ISNUMBER(VLOOKUP($B22, 'Data Inputs'!$B$5:$K$648, 9, FALSE))=TRUE, VLOOKUP($B22, 'Data Inputs'!$B$5:$K$648, 9, FALSE), \"\")","v":""},{"$f":"IF(ISNUMBER(VLOOKUP($B22, 'Data Inputs'!$B$5:$K$648, 10, FALSE))=TRUE, VLOOKUP($B22, 'Data Inputs'!$B$5:$K$648, 10, FALSE), \"\")","v":""},0,{"$f":"IF(D22=\"\", \"\",(1000000*SUM(T15:T30))/(365*'Basic Input'!$C$10*AG22))","v":0.63566729173950354},{"$f":"'Basic Input'!$C$12","v":1.1040000000000001},{"$f":"IF('Basic Input'!$C$14=\"\",\"\",'Basic Input'!$C$14)","v":""},null,{"$f":"IF(ISNUMBER(VLOOKUP($B22, 'Data Inputs'!$B$5:$L$648, 11, FALSE))=TRUE, VLOOKUP($B22, 'Data Inputs'!$B$5:$L$648, 11, FALSE), \"\")","v":""},10.56,null,932,3.156565656565817E-3,null,0,null,{"$f":"VLOOKUP(D22,'Working Data - Vol'!D22:G88,4,TRUE)","v":4310},null,null,null,null,null,null,null,null,null,null,null,null,null,null,null,null,-3.156565656565817E-3]
[null,18,0.15151512,800,{"$f":"IF(D23=\"\", \"\", ROUND(VLOOKUP($C23, 'Data Inputs'!$C$5:$F$648, 3, TRUE), 2))","v":5.5},null,null,{"$f":"IF(ISNUMBER(VLOOKUP($B23, 'Data Inputs'!$B$5:$F$648, 5, FALSE))=TRUE, VLOOKUP($B23, 'Data Inputs'!$B$5:$F$648, 5, FALSE), \"\")","v":""},{"$f":"IF(ISNUMBER(VLOOKUP($B23, 'Data Inputs'!$B$5:$H$648, 6, FALSE))=TRUE, VLOOKUP($B23, 'Data Inputs'!$B$5:$H$648, 6, FALSE), \"\")","v":""},{"$f":"IF(ISNUMBER(VLOOKUP($B23, 'Data Inputs'!$B$5:$H$648, 7, FALSE))=TRUE, VLOOKUP($B23, 'Data Inputs'!$B$5:$H$648, 7, FALSE), \"\")","v":""},30,{"$error":"#VALUE!"},36.887657142857144,{"$error":"#VALUE!"},null,null,{"$f":"IF(ISNUMBER(VLOOKUP($B23, 'Data Inputs'!$B$5:$K$648, 8, FALSE))=TRUE, VLOOKUP($B23, 'Data Inputs'!$B$5:$K$648, 8, FALSE), \"\")","v":1},{"$f":"IF(ISNUMBER(VLOOKUP($B23, 'Data Inputs'!$B$5:$K$648, 9, FALSE))=TRUE, VLOOKUP($B23, 'Data Inputs'!$B$5:$K$648, 9, FALSE), \"\")","v":""},{"$f":"IF(ISNUMBER(VLOOKUP($B23, 'Data Inputs'!$B$5:$K$648, 10, FALSE))=TRUE, VLOOKUP($B23, 'Data Inputs'!$B$5:$K$648, 10, FALSE), \"\")","v":""},1,{"$f":"IF(D23=\"\", \"\",(1000000*SUM(T16:T31))/(365*'Basic Input'!$C$10*AG23))","v":0.25426691669580143},{"$f":"'Basic Input'!$C$12","v":1.1040000000000001},{"$f":"IF('Basic Input'!$C$14=\"\",\"\",'Basic Input'!$C$14)","v":""},null,{"$f":"IF(ISNUMBER(VLOOKUP($B23, 'Data Inputs'!$B$5:$L$648, 11, FALSE))=TRUE, VLOOKUP($B23, 'Data Inputs'!$B$5:$L$648, 11, FALSE), \"\")","v":1},10.56,null,933.33333333333337,1.2626262626262895E-2,null,0,null,{"$f":"VLOOKUP(D23,'Working Data - Vol'!D23:G89,4,TRUE)","v":4310},null,null,null,null,null,null,null,null,null,null,null,null,null,null,null,null,-1.2626262626262895E-2]
[null,19,0.17045451,900,{"$f":"IF(D24=\"\", \"\", ROUND(VLOOKUP($C24, 'Data Inputs'!$C$5:$F$648, 3, TRUE), 2))","v":5.52},null,null,{"$f":"IF(ISNUMBER(VLOOKUP($B24, 'Data Inputs'!$B$5:$F$648, 5, FALSE))=TRUE, VLOOKUP($B24, 'Data Inputs'!$B$5:$F$648, 5, FALSE), \"\")","v":30},{"$f":"IF(ISNUMBER(VLOOKUP($B24, 'Data Inputs'!$B$5:$H$648, 6, FALSE))=TRUE, VLOOKUP($B24, 'Data Inputs'!$B$5:$H$648, 6, FALSE), \"\")","v":""},{"$f":"IF(ISNUMBER(VLOOKUP($B24, 'Data Inputs'!$B$5:$H$648, 7, FALSE))=TRUE, VLOOKUP($B24, 'Data Inputs'!$B$5:$H$648, 7, FALSE), \"\")","v":""},30,{"$error":"#VALUE!"},38.183542857142854,{"$error":"#VALUE!"},null,null,{"$f":"IF(ISNUMBER(VLOOKUP($B24, 'Data Inputs'!$B$5:$K$648, 8, FALSE))=TRUE, VLOOKUP($B24, 'Data Inputs'!$B$5:$K$648, 8, FALSE), \"\")","v":""},{"$f":"IF(ISNUMBER(VLOOKUP($B24, 'Data Inputs'!$B$5:$K$648, 9, FALSE))=TRUE, VLOOKUP($B24, 'Data Inputs'!$B$5:$K$648, 9, FALSE), \"\")","v":""},{"$f":"IF(ISNUMBER(VLOOKUP($B24, 'Data Inputs'!$B$5:$K$648, 10, FALSE))=TRUE, VLOOKUP($B24, 'Data Inputs'!$B$5:$K$648, 10, FALSE), \"\")","v":""},0,{"$f":"IF(D24=\"\", \"\",(1000000*SUM(T17:T32))/(365*'Basic Input'!$C$10*AG24))","v":0.25426691669580143},{"$f":"'Basic Input'!$C$12","v":1.1040000000000001},{"$f":"IF('Basic Input'!$C$14=\"\",\"\",'Basic Input'!$C$14)","v":""},null,{"$f":"IF(ISNUMBER(VLOOKUP($B24, 'Data Inputs'!$B$5:$L$648, 11, FALSE))=TRUE, VLOOKUP($B24, 'Data Inputs'!$B$5:$L$648, 11, FALSE), \"\")","v":""},10.56,null,933.5,-9.4696969696969613E-3,null,0,null,{"$f":"VLOOKUP(D24,'Working Data - Vol'!D24:G90,4,TRUE)","v":4310},null,null,null,null,null,null,null,null,null,null,null,null,null,null,null,null,9.4696969696969613E-3]
[null,20,0.1893939,1000,{"$f":"IF(D25=\"\", \"\", ROUND(VLOOKUP($C25, 'Data Inputs'!$C$5:$F$648, 3, TRUE), 2))","v":5.54},null,null,{"$f":"IF(ISNUMBER(VLOOKUP($B25, 'Data Inputs'!$B$5:$F$648, 5, FALSE))=TRUE, VLOOKUP($B25, 'Data Inputs'!$B$5:$F$648, 5, FALSE), \"\")","v":""},{"$f":"IF(ISNUMBER(VLOOKUP($B25, 'Data Inputs'!$B$5:$H$648, 6, FALSE))=TRUE, VLOOKUP($B25, 'Data Inputs'!$B$5:$H$648, 6, FALSE), \"\")","v":""},{"$f":"IF(ISNUMBER(VLOOKUP($B25, 'Data Inputs'!$B$5:$H$648, 7, FALSE))=TRUE, VLOOKUP($B25, 'Data Inputs'!$B$5:$H$648, 7, FALSE), \"\")","v":""},50,{"$error":"#VALUE!"},39.479428571428571,{"$error":"#VALUE!"},null,null,{"$f":"IF(ISNUMBER(VLOOKUP($B25, 'Data Inputs'!$B$5:$K$648, 8, FALSE))=TRUE, VLOOKUP($B25, 'Data Inputs'!$B$5:$K$648, 8, FALSE), \"\")","v":""},{"$f":"IF(ISNUMBER(VLOOKUP($B25, 'Data Inputs'!$B$5:$K$648, 9, FALSE))=TRUE, VLOOKUP($B25, 'Data Inputs'!$B$5:$K$648, 9, FALSE), \"\")","v":""},{"$f":"IF(ISNUMBER(VLOOKUP($B25, 'Data Inputs'!$B$5:$K$648, 10, FALSE))=TRUE, VLOOKUP($B25, 'Data Inputs'!$B$5:$K$648, 10, FALSE), \"\")","v":""},0,{"$f":"IF(D25=\"\", \"\",(1000000*SUM(T18:T33))/(365*'Basic Input'!$C$10*AG25))","v":0.25426691669580143},{"$f":"'Basic Input'!$C$12","v":1.1040000000000001},{"$f":"IF('Basic Input'!$C$14=\"\",\"\",'Basic Input'!$C$14)","v":""},null,{"$f":"IF(ISNUMBER(VLOOKUP($B25, 'Data Inputs'!$B$5:$L$648, 11, FALSE))=TRUE, VLOOKUP($B25, 'Data Inputs'!$B$5:$L$648, 11, FALSE), \"\")","v":""},{"$f":"IF(D25=\"\", \"\",SUM(Y21:Y30)*(5280/1000))","v":10.56},null,932.5,-9.4696969696969613E-3,null,-0.01,null,{"$f":"VLOOKUP(D25,'Working Data - Vol'!D25:G91,4,TRUE)","v":4310},null,null,null,null,null,null,null,null,null,null,null,null,null,null,null,null,9.4696969696969613E-3]
[null,21,0.20833329,1100,{"$f":"IF(D26=\"\", \"\", ROUND(VLOOKUP($C26, 'Data Inputs'!$C$5:$F$648, 3, TRUE), 2))","v":5.56},null,null,{"$f":"IF(ISNUMBER(VLOOKUP($B26, 'Data Inputs'!$B$5:$F$648, 5, FALSE))=TRUE, VLOOKUP($B26, 'Data Inputs'!$B$5:$F$648, 5, FALSE), \"\")","v":""},{"$f":"IF(ISNUMBER(VLOOKUP($B26, 'Data Inputs'!$B$5:$H$648, 6, FALSE))=TRUE, VLOOKUP($B26, 'Data Inputs'!$B$5:$H$648, 6, FALSE), \"\")","v":""},{"$f":"IF(ISNUMBER(VLOOKUP($B26, 'Data Inputs'!$B$5:$H$648, 7, FALSE))=TRUE, VLOOKUP($B26, 'Data Inputs'!$B$5:$H$648, 7, FALSE), \"\")","v":""},50,{"$error":"#VALUE!"},40.775314285714281,{"$error":"#VALUE!"},null,null,{"$f":"IF(ISNUMBER(VLOOKUP($B26, 'Data Inputs'!$B$5:$K$648, 8, FALSE))=TRUE, VLOOKUP($B26, 'Data Inputs'!$B$5:$K$648, 8, FALSE), \"\")","v":""},{"$f":"IF(ISNUMBER(VLOOKUP($B26, 'Data Inputs'!$B$5:$K$648, 9, FALSE))=TRUE, VLOOKUP($B26, 'Data Inputs'!$B$5:$K$648, 9, FALSE), \"\")","v":""},{"$f":"IF(ISNUMBER(VLOOKUP($B26, 'Data Inputs'!$B$5:$K$648, 10, FALSE))=TRUE, VLOOKUP($B26, 'Data Inputs'!$B$5:$K$648, 10, FALSE), \"\")","v":""},0,{"$f":"IF(D26=\"\", \"\",(1000000*SUM(T19:T34))/(365*'Basic Input'!$C$10*AG26))","v":0.25426691669580143},{"$f":"'Basic Input'!$C$12","v":1.1040000000000001},{"$f":"IF('Basic Input'!$C$14=\"\",\"\",'Basic Input'!$C$14)","v":""},null,{"$f":"IF(ISNUMBER(VLOOKUP($B26, 'Data Inputs'!$B$5:$L$648, 11, FALSE))=TRUE, VLOOKUP($B26, 'Data Inputs'!$B$5:$L$648, 11, FALSE), \"\")","v":""},10.56,null,932,0,null,-0.01,null,{"$f":"VLOOKUP(D26,'Working Data - Vol'!D26:G92,4,TRUE)","v":4310},null,null,null,null,null,null,null,null,null,null,null,null,null,null,null,null,0]
[null,22,0.22727268,1200,{"$f":"IF(D27=\"\", \"\", ROUND(VLOOKUP($C27, 'Data Inputs'!$C$5:$F$648, 3, TRUE), 2))","v":5.58},null,null,{"$f":"IF(ISNUMBER(VLOOKUP($B27, 'Data Inputs'!$B$5:$F$648, 5, FALSE))=TRUE, VLOOKUP($B27, 'Data Inputs'!$B$5:$F$648, 5, FALSE), \"\")","v":""},{"$f":"IF(ISNUMBER(VLOOKUP($B27, 'Data Inputs'!$B$5:$H$648, 6, FALSE))=TRUE, VLOOKUP($B27, 'Data Inputs'!$B$5:$H$648, 6, FALSE), \"\")","v":""},{"$f":"IF(ISNUMBER(VLOOKUP($B27, 'Data Inputs'!$B$5:$H$648, 7, FALSE))=TRUE, VLOOKUP($B27, 'Data Inputs'!$B$5:$H$648, 7, FALSE), \"\")","v":""},50,"",42.071199999999997,15,null,null,{"$f":"IF(ISNUMBER(VLOOKUP($B27, 'Data Inputs'!$B$5:$K$648, 8, FALSE))=TRUE, VLOOKUP($B27, 'Data Inputs'!$B$5:$K$648, 8, FALSE), \"\")","v":""},{"$f":"IF(ISNUMBER(VLOOKUP($B27, 'Data Inputs'!$B$5:$K$648, 9, FALSE))=TRUE, VLOOKUP($B27, 'Data Inputs'!$B$5:$K$648, 9, FALSE), \"\")","v":""},{"$f":"IF(ISNUMBER(VLOOKUP($B27, 'Data Inputs'!$B$5:$K$648, 10, FALSE))=TRUE, VLOOKUP($B27, 'Data Inputs'!$B$5:$K$648, 10, FALSE), \"\")","v":""},0,{"$f":"IF(D27=\"\", \"\",(1000000*SUM(T20:T35))/(365*'Basic Input'!$C$10*AG27))","v":0.12713345834790071},{"$f":"'Basic Input'!$C$12","v":1.1040000000000001},{"$f":"IF('Basic Input'!$C$14=\"\",\"\",'Basic Input'!$C$14)","v":""},null,{"$f":"IF(ISNUMBER(VLOOKUP($B27, 'Data Inputs'!$B$5:$L$648, 11, FALSE))=TRUE, VLOOKUP($B27, 'Data Inputs'!$B$5:$L$648, 11, FALSE), \"\")","v":""},10.56,null,932,0,null,-0.01,null,{"$f":"VLOOKUP(D27,'Working Data - Vol'!D27:G93,4,TRUE)","v":4310},null,null,null,null,null,null,null,null,null,null,null,null,null,null,null,null,0]
[null,23,0.24621207000000001,1300,{"$f":"IF(D28=\"\", \"\", ROUND(VLOOKUP($C28, 'Data Inputs'!$C$5:$F$648, 3, TRUE), 2))","v":5.6},null,null,{"$f":"IF(ISNUMBER(VLOOKUP($B28, 'Data Inputs'!$B$5:$F$648, 5, FALSE))=TRUE, VLOOKUP($B28, 'Data Inputs'!$B$5:$F$648, 5, FALSE), \"\")","v":""},{"$f":"IF(ISNUMBER(VLOOKUP($B28, 'Data Inputs'!$B$5:$H$648, 6, FALSE))=TRUE, VLOOKUP($B28, 'Data Inputs'!$B$5:$H$648, 6, FALSE), \"\")","v":""},{"$f":"IF(ISNUMBER(VLOOKUP($B28, 'Data Inputs'!$B$5:$H$648, 7, FALSE))=TRUE, VLOOKUP($B28, 'Data Inputs'!$B$5:$H$648, 7, FALSE), \"\")","v":42.071199999999997},50,{"$error":"#VALUE!"},43.798074999999997,{"$error":"#VALUE!"},20,null,{"$f":"IF(ISNUMBER(VLOOKUP($B28, 'Data Inputs'!$B$5:$K$648, 8, FALSE))=TRUE, VLOOKUP($B28, 'Data Inputs'!$B$5:$K$648, 8, FALSE), \"\")","v":""},{"$f":"IF(ISNUMBER(VLOOKUP($B28, 'Data Inputs'!$B$5:$K$648, 9, FALSE))=TRUE, VLOOKUP($B28, 'Data Inputs'!$B$5:$K$648, 9, FALSE), \"\")","v":""},{"$f":"IF(ISNUMBER(VLOOKUP($B28, 'Data Inputs'!$B$5:$K$648, 10, FALSE))=TRUE, VLOOKUP($B28, 'Data Inputs'!$B$5:$K$648, 10, FALSE), \"\")","v":""},0,{"$f":"IF(D28=\"\", \"\",(1000000*SUM(T21:T36))/(365*'Basic Input'!$C$10*AG28))","v":0.12713345834790071},{"$f":"'Basic Input'!$C$12","v":1.1040000000000001},{"$f":"IF('Basic Input'!$C$14=\"\",\"\",'Basic Input'!$C$14)","v":""},null,{"$f":"IF(ISNUMBER(VLOOKUP($B28, 'Data Inputs'!$B$5:$L$648, 11, FALSE))=TRUE, VLOOKUP($B28, 'Data Inputs'!$B$5:$L$648, 11, FALSE), \"\")","v":""},5.28,null,931,-1.8939393939393923E-2,null,0,null,{"$f":"VLOOKUP(D28,'Working Data - Vol'!D28:G94,4,TRUE)","v":4310},null,null,null,null,null,null,null,null,null,null,null,null,null,null,null,null,1.8939393939393923E-2]
[null,24,0.26515146000000001,1400,{"$f":"IF(D29=\"\", \"\", ROUND(VLOOKUP($C29, 'Data Inputs'!$C$5:$F$648, 3, TRUE), 2))","v":5.62},null,null,{"$f":"IF(ISNUMBER(VLOOKUP($B29, 'Data Inputs'!$B$5:$F$648, 5, FALSE))=TRUE, VLOOKUP($B29, 'Data Inputs'!$B$5:$F$648, 5, FALSE), \"\")","v":""},{"$f":"IF(ISNUMBER(VLOOKUP($B29, 'Data Inputs'!$B$5:$H$648, 6, FALSE))=TRUE, VLOOKUP($B29, 'Data Inputs'!$B$5:$H$648, 6, FALSE), \"\")","v":""},{"$f":"IF(ISNUMBER(VLOOKUP($B29, 'Data Inputs'!$B$5:$H$648, 7, FALSE))=TRUE, VLOOKUP($B29, 'Data Inputs'!$B$5:$H$648, 7, FALSE), \"\")","v":""},50,{"$error":"#VALUE!"},45.524950000000004,{"$error":"#VALUE!"},null,null,{"$f":"IF(ISNUMBER(VLOOKUP($B29, 'Data Inputs'!$B$5:$K$648, 8, FALSE))=TRUE, VLOOKUP($B29, 'Data Inputs'!$B$5:$K$648, 8, FALSE), \"\")","v":""},{"$f":"IF(ISNUMBER(VLOOKUP($B29, 'Data Inputs'!$B$5:$K$648, 9, FALSE))=TRUE, VLOOKUP($B29, 'Data Inputs'!$B$5:$K$648, 9, FALSE), \"\")","v":""},{"$f":"IF(ISNUMBER(VLOOKUP($B29, 'Data Inputs'!$B$5:$K$648, 10, FALSE))=TRUE, VLOOKUP($B29, 'Data Inputs'!$B$5:$K$648, 10, FALSE), \"\")","v":""},0,{"$f":"IF(D29=\"\", \"\",(1000000*SUM(T22:T37))/(365*'Basic Input'!$C$10*AG29))","v":0.12713345834790071},{"$f":"'Basic Input'!$C$12","v":1.1040000000000001},{"$f":"IF('Basic Input'!$C$14=\"\",\"\",'Basic Input'!$C$14)","v":""},null,{"$f":"IF(ISNUMBER(VLOOKUP($B29, 'Data Inputs'!$B$5:$L$648, 11, FALSE))=TRUE, VLOOKUP($B29, 'Data Inputs'!$B$5:$L$648, 11, FALSE), \"\")","v":1},5.28,null,929,-1.8939393939393923E-2,null,0,null,{"$f":"VLOOKUP(D29,'Working Data - Vol'!D29:G95,4,TRUE)","v":4310},null,null,null,null,null,null,null,null,null,null,null,null,null,null,null,null,1.8939393939393923E-2]
[null,25,0.28409085000000001,1500,{"$f":"IF(D30=\"\", \"\", ROUND(VLOOKUP($C30, 'Data Inputs'!$C$5:$F$648, 3, TRUE), 2))","v":5.63},null,null,{"$f":"IF(ISNUMBER(VLOOKUP($B30, 'Data Inputs'!$B$5:$F$648, 5, FALSE))=TRUE, VLOOKUP($B30, 'Data Inputs'!$B$5:$F$648, 5, FALSE), \"\")","v":""},{"$f":"IF(ISNUMBER(VLOOKUP($B30, 'Data Inputs'!$B$5:$H$648, 6, FALSE))=TRUE, VLOOKUP($B30, 'Data Inputs'!$B$5:$H$648, 6, FALSE), \"\")","v":""},{"$f":"IF(ISNUMBER(VLOOKUP($B30, 'Data Inputs'!$B$5:$H$648, 7, FALSE))=TRUE, VLOOKUP($B30, 'Data Inputs'!$B$5:$H$648, 7, FALSE), \"\")","v":""},50,{"$error":"#VALUE!"},47.251825000000004,{"$error":"#VALUE!"},null,null,{"$f":"IF(ISNUMBER(VLOOKUP($B30, 'Data Inputs'!$B$5:$K$648, 8, FALSE))=TRUE, VLOOKUP($B30, 'Data Inputs'!$B$5:$K$648, 8, FALSE), \"\")","v":""},{"$f":"IF(ISNUMBER(VLOOKUP($B30, 'Data Inputs'!$B$5:$K$648, 9, FALSE))=TRUE, VLOOKUP($B30, 'Data Inputs'!$B$5:$K$648, 9, FALSE), \"\")","v":""},{"$f":"IF(ISNUMBER(VLOOKUP($B30, 'Data Inputs'!$B$5:$K$648, 10, FALSE))=TRUE, VLOOKUP($B30, 'Data Inputs'!$B$5:$K$648, 10, FALSE), \"\")","v":""},0,{"$f":"IF(D30=\"\", \"\",(1000000*SUM(T23:T38))/(365*'Basic Input'!$C$10*AG30))","v":0.25426691669580143},{"$f":"'Basic Input'!$C$12","v":1.1040000000000001},{"$f":"IF('Basic Input'!$C$14=\"\",\"\",'Basic Input'!$C$14)","v":""},null,{"$f":"IF(ISNUMBER(VLOOKUP($B30, 'Data Inputs'!$B$5:$L$648, 11, FALSE))=TRUE, VLOOKUP($B30, 'Data Inputs'!$B$5:$L$648, 11, FALSE), \"\")","v":""},5.28,null,928,-8.1168831168831144E-3,null,0,null,{"$f":"VLOOKUP(D30,'Working Data - Vol'!D30:G96,4,TRUE)","v":4310},null,null,null,null,null,null,null,null,null,null,null,null,null,null,null,null,8.1168831168831144E-3]
[null,26,0.30303024000000001,1600,{"$f":"IF(D31=\"\", \"\", ROUND(VLOOKUP($C31, 'Data Inputs'!$C$5:$F$648, 3, TRUE), 2))","v":5.65},null,null,{"$f":"IF(ISNUMBER(VLOOKUP($B31, 'Data Inputs'!$B$5:$F$648, 5, FALSE))=TRUE, VLOOKUP($B31, 'Data Inputs'!$B$5:$F$648, 5, FALSE), \"\")","v":""},{"$f":"IF(ISNUMBER(VLOOKUP($B31, 'Data Inputs'!$B$5:$H$648, 6, FALSE))=TRUE, VLOOKUP($B31, 'Data Inputs'!$B$5:$H$648, 6, FALSE), \"\")","v":""},{"$f":"IF(ISNUMBER(VLOOKUP($B31, 'Data Inputs'!$B$5:$H$648, 7, FALSE))=TRUE, VLOOKUP($B31, 'Data Inputs'!$B$5:$H$648, 7, FALSE), \"\")","v":""},50,"",48.978700000000003,15,20,null,{"$f":"IF(ISNUMBER(VLOOKUP($B31, 'Data Inputs'!$B$5:$K$648, 8, FALSE))=TRUE, VLOOKUP($B31, 'Data Inputs'!$B$5:$K$648, 8, FALSE), \"\")","v":""},{"$f":"IF(ISNUMBER(VLOOKUP($B31, 'Data Inputs'!$B$5:$K$648, 9, FALSE))=TRUE, VLOOKUP($B31, 'Data Inputs'!$B$5:$K$648, 9, FALSE), \"\")","v":""},{"$f":"IF(ISNUMBER(VLOOKUP($B31, 'Data Inputs'!$B$5:$K$648, 10, FALSE))=TRUE, VLOOKUP($B31, 'Data Inputs'!$B$5:$K$648, 10, FALSE), \"\")","v":""},0,{"$f":"IF(D31=\"\", \"\",(1000000*SUM(T24:T39))/(365*'Basic Input'!$C$10*AG31))","v":0.12713345834790071},{"$f":"'Basic Input'!$C$12","v":1.1040000000000001},{"$f":"IF('Basic Input'!$C$14=\"\",\"\",'Basic Input'!$C$14)","v":""},null,{"$f":"IF(ISNUMBER(VLOOKUP($B31, 'Data Inputs'!$B$5:$L$648, 11, FALSE))=TRUE, VLOOKUP($B31, 'Data Inputs'!$B$5:$L$648, 11, FALSE), \"\")","v":""},5.28,null,928.28571428571433,2.7056277056276947E-3,null,0.01,null,{"$f":"VLOOKUP(D31,'Working Data - Vol'!D31:G97,4,TRUE)","v":4310},null,null,null,null,null,null,null,null,null,null,null,null,null,null,null,null,-2.7056277056276947E-3]
[null,27,0.32196963000000001,1700,{"$f":"IF(D32=\"\", \"\", ROUND(VLOOKUP($C32, 'Data Inputs'!$C$5:$F$648, 3, TRUE), 2))","v":5.67},null,null,{"$f":"IF(ISNUMBER(VLOOKUP($B32, 'Data Inputs'!$B$5:$F$648, 5, FALSE))=TRUE, VLOOKUP($B32, 'Data Inputs'!$B$5:$F$648, 5, FALSE), \"\")","v":""},{"$f":"IF(ISNUMBER(VLOOKUP($B32, 'Data Inputs'!$B$5:$H$648, 6, FALSE))=TRUE, VLOOKUP($B32, 'Data Inputs'!$B$5:$H$648, 6, FALSE), \"\")","v":""},{"$f":"IF(ISNUMBER(VLOOKUP($B32, 'Data Inputs'!$B$5:$H$648, 7, FALSE))=TRUE, VLOOKUP($B32, 'Data Inputs'!$B$5:$H$648, 7, FALSE), \"\")","v":48.978700000000003},50,{"$error":"#VALUE!"},49.981066666666671,{"$error":"#VALUE!"},null,null,{"$f":"IF(ISNUMBER(VLOOKUP($B32, 'Data Inputs'!$B$5:$K$648, 8, FALSE))=TRUE, VLOOKUP($B32, 'Data Inputs'!$B$5:$K$648, 8, FALSE), \"\")","v":""},{"$f":"IF(ISNUMBER(VLOOKUP($B32, 'Data Inputs'!$B$5:$K$648, 9, FALSE))=TRUE, VLOOKUP($B32, 'Data Inputs'!$B$5:$K$648, 9, FALSE), \"\")","v":""},{"$f":"IF(ISNUMBER(VLOOKUP($B32, 'Data Inputs'!$B$5:$K$648, 10, FALSE))=TRUE, VLOOKUP($B32, 'Data Inputs'!$B$5:$K$648, 10, FALSE), \"\")","v":""},0,{"$f":"IF(D32=\"\", \"\",(1000000*SUM(T25:T40))/(365*'Basic Input'!$C$10*AG32))","v":0.12713345834790071},{"$f":"'Basic Input'!$C$12","v":1.1040000000000001},{"$f":"IF('Basic Input'!$C$14=\"\",\"\",'Basic Input'!$C$14)","v":""},null,{"$f":"IF(ISNUMBER(VLOOKUP($B32, 'Data Inputs'!$B$5:$L$648, 11, FALSE))=TRUE, VLOOKUP($B32, 'Data Inputs'!$B$5:$L$648, 11, FALSE), \"\")","v":""},5.28,null,928.57142857142856,2.7056277056276947E-3,null,0.01,null,{"$f":"VLOOKUP(D32,'Working Data - Vol'!D32:G98,4,TRUE)","v":4310},null,null,null,null,null,null,null,null,null,null,null,null,null,null,null,null,-2.7056277056276947E-3]
[null,28,0.34090902000000001,1800,{"$f":"IF(D33=\"\", \"\", ROUND(VLOOKUP($C33, 'Data Inputs'!$C$5:$F$648, 3, TRUE), 2))","v":5.69},null,null,{"$f":"IF(ISNUMBER(VLOOKUP($B33, 'Data Inputs'!$B$5:$F$648, 5, FALSE))=TRUE, VLOOKUP($B33, 'Data Inputs'!$B$5:$F$648, 5, FALSE), \"\")","v":""},{"$f":"IF(ISNUMBER(VLOOKUP($B33, 'Data Inputs'!$B$5:$H$648, 6, FALSE))=TRUE, VLOOKUP($B33, 'Data Inputs'!$B$5:$H$648, 6, FALSE), \"\")","v":""},{"$f":"IF(ISNUMBER(VLOOKUP($B33, 'Data Inputs'!$B$5:$H$648, 7, FALSE))=TRUE, VLOOKUP($B33, 'Data Inputs'!$B$5:$H$648, 7, FALSE), \"\")","v":""},50,{"$error":"#VALUE!"},50.983433333333338,{"$error":"#VALUE!"},null,null,{"$f":"IF(ISNUMBER(VLOOKUP($B33, 'Data Inputs'!$B$5:$K$648, 8, FALSE))=TRUE, VLOOKUP($B33, 'Data Inputs'!$B$5:$K$648, 8, FALSE), \"\")","v":""},{"$f":"IF(ISNUMBER(VLOOKUP($B33, 'Data Inputs'!$B$5:$K$648, 9, FALSE))=TRUE, VLOOKUP($B33, 'Data Inputs'!$B$5:$K$648, 9, FALSE), \"\")","v":""},{"$f":"IF(ISNUMBER(VLOOKUP($B33, 'Data Inputs'!$B$5:$K$648, 10, FALSE))=TRUE, VLOOKUP($B33, 'Data Inputs'!$B$5:$K$648, 10, FALSE), \"\")","v":""},0,{"$f":"IF(D33=\"\", \"\",(1000000*SUM(T26:T41))/(365*'Basic Input'!$C$10*AG33))","v":0.12713345834790071},{"$f":"'Basic Input'!$C$12","v":1.1040000000000001},{"$f":"IF('Basic Input'!$C$14=\"\",\"\",'Basic Input'!$C$14)","v":""},null,{"$f":"IF(ISNUMBER(VLOOKUP($B33, 'Data Inputs'!$B$5:$L$648, 11, FALSE))=TRUE, VLOOKUP($B33, 'Data Inputs'!$B$5:$L$648, 11, FALSE), \"\")","v":""},5.28,null,928.85714285714289,2.7056277056276947E-3,null,0.02,null,{"$f":"VLOOKUP(D33,'Working Data - Vol'!D33:G99,4,TRUE)","v":4310},null,null,null,null,null,null,null,null,null,null,null,null,null,null,null,null,-2.7056277056276947E-3]
[null,29,0.35984841000000001,1900,{"$f":"IF(D34=\"\", \"\", ROUND(VLOOKUP($C34, 'Data Inputs'!$C$5:$F$648, 3, TRUE), 2))","v":5.71},null,null,{"$f":"IF(ISNUMBER(VLOOKUP($B34, 'Data Inputs'!$B$5:$F$648, 5, FALSE))=TRUE, VLOOKUP($B34, 'Data Inputs'!$B$5:$F$648, 5, FALSE), \"\")","v":""},{"$f":"IF(ISNUMBER(VLOOKUP($B34, 'Data Inputs'!$B$5:$H$648, 6, FALSE))=TRUE, VLOOKUP($B34, 'Data Inputs'!$B$5:$H$648, 6, FALSE), \"\")","v":""},{"$f":"IF(ISNUMBER(VLOOKUP($B34, 'Data Inputs'!$B$5:$H$648, 7, FALSE))=TRUE, VLOOKUP($B34, 'Data Inputs'!$B$5:$H$648, 7, FALSE), \"\")","v":""},50,{"$error":"#VALUE!"},51.985800000000005,{"$error":"#VALUE!"},null,null,{"$f":"IF(ISNUMBER(VLOOKUP($B34, 'Data Inputs'!$B$5:$K$648, 8, FALSE))=TRUE, VLOOKUP($B34, 'Data Inputs'!$B$5:$K$648, 8, FALSE), \"\")","v":""},{"$f":"IF(ISNUMBER(VLOOKUP($B34, 'Data Inputs'!$B$5:$K$648, 9, FALSE))=TRUE, VLOOKUP($B34, 'Data Inputs'!$B$5:$K$648, 9, FALSE), \"\")","v":""},{"$f":"IF(ISNUMBER(VLOOKUP($B34, 'Data Inputs'!$B$5:$K$648, 10, FALSE))=TRUE, VLOOKUP($B34, 'Data Inputs'!$B$5:$K$648, 10, FALSE), \"\")","v":""},0,{"$f":"IF(D34=\"\", \"\",(1000000*SUM(T27:T42))/(365*'Basic Input'!$C$10*AG34))","v":0.12713345834790071},{"$f":"'Basic Input'!$C$12","v":1.1040000000000001},{"$f":"IF('Basic Input'!$C$14=\"\",\"\",'Basic Input'!$C$14)","v":""},null,{"$f":"IF(ISNUMBER(VLOOKUP($B34, 'Data Inputs'!$B$5:$L$648, 11, FALSE))=TRUE, VLOOKUP($B34, 'Data Inputs'!$B$5:$L$648, 11, FALSE), \"\")","v":""},0,null,929.125,2.3674242424242403E-3,null,0.02,null,{"$f":"VLOOKUP(D34,'Working Data - Vol'!D34:G100,4,TRUE)","v":4310},null,null,null,null,null,null,null,null,null,null,null,null,null,null,null,null,-2.3674242424242403E-3]
[null,30,0.37878780000000001,2000,{"$f":"IF(D35=\"\", \"\", ROUND(VLOOKUP($C35, 'Data Inputs'!$C$5:$F$648, 3, TRUE), 2))","v":5.73},null,null,{"$f":"IF(ISNUMBER(VLOOKUP($B35, 'Data Inputs'!$B$5:$F$648, 5, FALSE))=TRUE, VLOOKUP($B35, 'Data Inputs'!$B$5:$F$648, 5, FALSE), \"\")","v":""},{"$f":"IF(ISNUMBER(VLOOKUP($B35, 'Data Inputs'!$B$5:$H$648, 6, FALSE))=TRUE, VLOOKUP($B35, 'Data Inputs'!$B$5:$H$648, 6, FALSE), \"\")","v":""},{"$f":"IF(ISNUMBER(VLOOKUP($B35, 'Data Inputs'!$B$5:$H$648, 7, FALSE))=TRUE, VLOOKUP($B35, 'Data Inputs'!$B$5:$H$648, 7, FALSE), \"\")","v":""},50,{"$error":"#VALUE!"},52.988166666666672,{"$error":"#VALUE!"},null,null,{"$f":"IF(ISNUMBER(VLOOKUP($B35, 'Data Inputs'!$B$5:$K$648, 8, FALSE))=TRUE, VLOOKUP($B35, 'Data Inputs'!$B$5:$K$648, 8, FALSE), \"\")","v":""},{"$f":"IF(ISNUMBER(VLOOKUP($B35, 'Data Inputs'!$B$5:$K$648, 9, FALSE))=TRUE, VLOOKUP($B35, 'Data Inputs'!$B$5:$K$648, 9, FALSE), \"\")","v":""},{"$f":"IF(ISNUMBER(VLOOKUP($B35, 'Data Inputs'!$B$5:$K$648, 10, FALSE))=TRUE, VLOOKUP($B35, 'Data Inputs'!$B$5:$K$648, 10, FALSE), \"\")","v":""},0,{"$f":"IF(D35=\"\", \"\",(1000000*SUM(T28:T43))/(365*'Basic Input'!$C$10*AG35))","v":0.12713345834790071},{"$f":"'Basic Input'!$C$12","v":1.1040000000000001},{"$f":"IF('Basic Input'!$C$14=\"\",\"\",'Basic Input'!$C$14)","v":""},null,{"$f":"IF(ISNUMBER(VLOOKUP($B35, 'Data Inputs'!$B$5:$L$648, 11, FALSE))=TRUE, VLOOKUP($B35, 'Data Inputs'!$B$5:$L$648, 11, FALSE), \"\")","v":""},0,null,929.375,2.3674242424242403E-3,null,0.02,null,{"$f":"VLOOKUP(D35,'Working Data - Vol'!D35:G101,4,TRUE)","v":4310},null,null,null,null,null,null,null,null,null,null,null,null,null,null,null,null,-2.3674242424242403E-3]
[null,31,0.39772719000000001,2100,{"$f":"IF(D36=\"\", \"\", ROUND(VLOOKUP($C36, 'Data Inputs'!$C$5:$F$648, 3, TRUE), 2))","v":5.75},null,null,{"$f":"IF(ISNUMBER(VLOOKUP($B36, 'Data Inputs'!$B$5:$F$648, 5, FALSE))=TRUE, VLOOKUP($B36, 'Data Inputs'!$B$5:$F$648, 5, FALSE), \"\")","v":""},{"$f":"IF(ISNUMBER(VLOOKUP($B36, 'Data Inputs'!$B$5:$H$648, 6, FALSE))=TRUE, VLOOKUP($B36, 'Data Inputs'!$B$5:$H$648, 6, FALSE), \"\")","v":""},{"$f":"IF(ISNUMBER(VLOOKUP($B36, 'Data Inputs'!$B$5:$H$648, 7, FALSE))=TRUE, VLOOKUP($B36, 'Data Inputs'!$B$5:$H$648, 7, FALSE), \"\")","v":""},50,{"$error":"#VALUE!"},53.990533333333332,{"$error":"#VALUE!"},20,null,{"$f":"IF(ISNUMBER(VLOOKUP($B36, 'Data Inputs'!$B$5:$K$648, 8, FALSE))=TRUE, VLOOKUP($B36, 'Data Inputs'!$B$5:$K$648, 8, FALSE), \"\")","v":""},{"$f":"IF(ISNUMBER(VLOOKUP($B36, 'Data Inputs'!$B$5:$K$648, 9, FALSE))=TRUE, VLOOKUP($B36, 'Data Inputs'!$B$5:$K$648, 9, FALSE), \"\")","v":""},{"$f":"IF(ISNUMBER(VLOOKUP($B36, 'Data Inputs'!$B$5:$K$648, 10, FALSE))=TRUE, VLOOKUP($B36, 'Data Inputs'!$B$5:$K$648, 10, FALSE), \"\")","v":""},0,{"$f":"IF(D36=\"\", \"\",(1000000*SUM(T29:T44))/(365*'Basic Input'!$C$10*AG36))","v":0.12713345834790071},{"$f":"'Basic Input'!$C$12","v":1.1040000000000001},{"$f":"IF('Basic Input'!$C$14=\"\",\"\",'Basic Input'!$C$14)","v":""},null,{"$f":"IF(ISNUMBER(VLOOKUP($B36, 'Data Inputs'!$B$5:$L$648, 11, FALSE))=TRUE, VLOOKUP($B36, 'Data Inputs'!$B$5:$L$648, 11, FALSE), \"\")","v":""},0,null,929.625,2.3674242424242403E-3,null,0.01,null,{"$f":"VLOOKUP(D36,'Working Data - Vol'!D36:G102,4,TRUE)","v":4310},null,null,null,null,null,null,null,null,null,null,null,null,null,null,null,null,-2.3674242424242403E-3]
[null,32,0.41666658000000001,2200,{"$f":"IF(D37=\"\", \"\", ROUND(VLOOKUP($C37, 'Data Inputs'!$C$5:$F$648, 3, TRUE), 2))","v":5.77},null,null,{"$f":"IF(ISNUMBER(VLOOKUP($B37, 'Data Inputs'!$B$5:$F$648, 5, FALSE))=TRUE, VLOOKUP($B37, 'Data Inputs'!$B$5:$F$648, 5, FALSE), \"\")","v":""},{"$f":"IF(ISNUMBER(VLOOKUP($B37, 'Data Inputs'!$B$5:$H$648, 6, FALSE))=TRUE, VLOOKUP($B37, 'Data Inputs'!$B$5:$H$648, 6, FALSE), \"\")","v":""},{"$f":"IF(ISNUMBER(VLOOKUP($B37, 'Data Inputs'!$B$5:$H$648, 7, FALSE))=TRUE, VLOOKUP($B37, 'Data Inputs'!$B$5:$H$648, 7, FALSE), \"\")","v":""},50,{"$error":"#VALUE!"},{"$f":"IF($D37=\"\",\"\",(IF($D37<=$BB$5,$BD$5,IF($D37=$BB$6,$BD$6,IF($D37=$BB$7,$BD$7,IF($D37=$BB$8,$BD$8,IF(AND($BA$6=\"N\",$D37>$BB$5)=TRUE,$BD$5,IF(AND($BA$7=\"N\",$D37>$BB$6)=TRUE,$BD$6,IF(AND($BA$8=\"N\",$D37>$BB$7)=TRUE,$BD$7,IF(AND($BA$9=\"N\",$D37>$BB$8)=TRUE,$BD$8,IF($BA$6=\"Y\",IF(AND($D37>$BB$5,$D37<$BB$6)=TRUE,(($D37-$BB$5)/($BB$5-$BB$6)*(BD$5-BD$6))+MIN(BD$6,BD$5),IF($BA$7=\"Y\",IF(AND($D37>$BB$6,$D37<$BB$7)=TRUE,(($D37-$BB$6)/($BB$6-$BB$7)*(BD$6-BD$7))+MIN(BD$7,BD$6),IF($BA$8=\"Y\",IF(AND($D37>$BB$7,$D37<$BB$8)=TRUE,(($D37-$BB$7)/($BB$7-$BB$8)*(BD$7-BD$8))+MIN(BD$8,BD$7),IF($BA$9=\"Y\",IF(AND($D37>$BB$8,$D37<$BB$9)=TRUE,(($D37-$BB$8)/($BB$8-$BB$9)*(BD$8-BD$9))+MIN(BD$9,BD$8),IF($D37>=$BB$9,$BD$9,\"\")))))))))))))))))))","v":54.992899999999999},{"$error":"#VALUE!"},null,null,{"$f":"IF(ISNUMBER(VLOOKUP($B37, 'Data Inputs'!$B$5:$K$648, 8, FALSE))=TRUE, VLOOKUP($B37, 'Data Inputs'!$B$5:$K$648, 8, FALSE), \"\")","v":""},{"$f":"IF(ISNUMBER(VLOOKUP($B37, 'Data Inputs'!$B$5:$K$648, 9, FALSE))=TRUE, VLOOKUP($B37, 'Data Inputs'!$B$5:$K$648, 9, FALSE), \"\")","v":""},{"$f":"IF(ISNUMBER(VLOOKUP($B37, 'Data Inputs'!$B$5:$K$648, 10, FALSE))=TRUE, VLOOKUP($B37, 'Data Inputs'!$B$5:$K$648, 10, FALSE), \"\")","v":""},0,{"$f":"IF(D37=\"\", \"\",(1000000*SUM(T30:T45))/(365*'Basic Input'!$C$10*AG37))","v":0.12713345834790071},{"$f":"'Basic Input'!$C$12","v":1.1040000000000001},{"$f":"IF('Basic Input'!$C$14=\"\",\"\",'Basic Input'!$C$14)","v":""},null,{"$f":"IF(ISNUMBER(VLOOKUP($B37, 'Data Inputs'!$B$5:$L$648, 11, FALSE))=TRUE, VLOOKUP($B37, 'Data Inputs'!$B$5:$L$648, 11, FALSE), \"\")","v":""},0,null,929.875,2.3674242424242403E-3,null,0.01,null,{"$f":"VLOOKUP(D37,'Working Data - Vol'!D37:G103,4,TRUE)","v":4310},null,null,null,null,null,null,null,null,null,null,null,null,null,null,null,null,{"$f":"-AC37","v":-2.3674242424242403E-3}]
[null,33,0.43560597000000001,2300,{"$f":"IF(D38=\"\", \"\", ROUND(VLOOKUP($C38, 'Data Inputs'!$C$5:$F$648, 3, TRUE), 2))","v":5.79},null,null,{"$f":"IF(ISNUMBER(VLOOKUP($B38, 'Data Inputs'!$B$5:$F$648, 5, FALSE))=TRUE, VLOOKUP($B38, 'Data Inputs'!$B$5:$F$648, 5, FALSE), \"\")","v":50},{"$f":"IF(ISNUMBER(VLOOKUP($B38, 'Data Inputs'!$B$5:$H$648, 6, FALSE))=TRUE, VLOOKUP($B38, 'Data Inputs'!$B$5:$H$648, 6, FALSE), \"\")","v":""},{"$f":"IF(ISNUMBER(VLOOKUP($B38, 'Data Inputs'!$B$5:$H$648, 7, FALSE))=TRUE, VLOOKUP($B38, 'Data Inputs'!$B$5:$H$648, 7, FALSE), \"\")","v":""},50,{"$f":"IF(D38=\"\",\"\",(IF(D38<=$BB$5,$BC$5,IF(D38=$BB$6,$BC$6,IF(D38=$BB$7,$BC$7,IF(D38=$BB$8,$BC$8,IF(AND($BA$6=\"N\",D38>$BB$5)=TRUE,$BC$5,IF(AND($BA$7=\"N\",D38>$BB$6)=TRUE,$BC$6,IF(AND($BA$8=\"N\",D38>$BB$7)=TRUE,$BC$7,IF(AND($BA$9=\"N\",D38>$BB$8)=TRUE,$BC$8,IF($BA$6=\"Y\",IF(AND(D38>$BB$5,D38<$BB$6)=TRUE,(($D38-$BB$5)/($BB$5-$BB$6)*(BC$5-BC$6))+MIN(BC$6,BC$5),IF($BA$7=\"Y\",IF(AND(D38>$BB$6,D38<$BB$7)=TRUE,(($D38-$BB$6)/($BB$6-$BB$7)*(BC$6-BC$7))+MIN(BC$7,BC$6),IF($BA$8=\"Y\",IF(AND(D38>$BB$7,D38<$BB$8)=TRUE,(($D38-$BB$7)/($BB$7-$BB$8)*(BC$7-BC$8))+MIN(BC$8,BC$7),IF($BA$9=\"Y\",IF(AND(D38>$BB$8,D38<$BB$9)=TRUE,(($D38-$BB$8)/($BB$8-$BB$9)*(BC$8-BC$9))+MIN(BC$9,BC$8),IF(D38>=$BB$9,$BC$9,\"\")))))))))))))))))))","v":{"$error":"#VALUE!"}},55.995266666666666,{"$error":"#VALUE!"},null,null,{"$f":"IF(ISNUMBER(VLOOKUP($B38, 'Data Inputs'!$B$5:$K$648, 8, FALSE))=TRUE, VLOOKUP($B38, 'Data Inputs'!$B$5:$K$648, 8, FALSE), \"\")","v":1},{"$f":"IF(ISNUMBER(VLOOKUP($B38, 'Data Inputs'!$B$5:$K$648, 9, FALSE))=TRUE, VLOOKUP($B38, 'Data Inputs'!$B$5:$K$648, 9, FALSE), \"\")","v":""},{"$f":"IF(ISNUMBER(VLOOKUP($B38, 'Data Inputs'!$B$5:$K$648, 10, FALSE))=TRUE, VLOOKUP($B38, 'Data Inputs'!$B$5:$K$648, 10, FALSE), \"\")","v":""},1,{"$f":"IF(D38=\"\", \"\",(1000000*SUM(T31:T46))/(365*'Basic Input'!$C$10*AG38))","v":0.12713345834790071},{"$f":"'Basic Input'!$C$12","v":1.1040000000000001},{"$f":"IF('Basic Input'!$C$14=\"\",\"\",'Basic Input'!$C$14)","v":""},null,{"$f":"IF(ISNUMBER(VLOOKUP($B38, 'Data Inputs'!$B$5:$L$648, 11, FALSE))=TRUE, VLOOKUP($B38, 'Data Inputs'!$B$5:$L$648, 11, FALSE), \"\")","v":""},0,null,929.85714285714289,-2.7056277056277289E-3,null,0,null,{"$f":"VLOOKUP(D38,'Working Data - Vol'!D38:G104,4,TRUE)","v":4310},null,null,null,null,null,null,null,null,null,null,null,null,null,null,null,null,{"$f":"-AC38","v":2.7056277056277289E-3}]
[null,34,0.45454536000000001,2400,{"$f":"IF(D39=\"\", \"\", ROUND(VLOOKUP($C39, 'Data Inputs'!$C$5:$F$648, 3, TRUE), 2))","v":5.8},null,null,{"$f":"IF(ISNUMBER(VLOOKUP($B39, 'Data Inputs'!$B$5:$F$648, 5, FALSE))=TRUE, VLOOKUP($B39, 'Data Inputs'!$B$5:$F$648, 5, FALSE), \"\")","v":""},{"$f":"IF(ISNUMBER(VLOOKUP($B39, 'Data Inputs'!$B$5:$H$648, 6, FALSE))=TRUE, VLOOKUP($B39, 'Data Inputs'!$B$5:$H$648, 6, FALSE), \"\")","v":""},{"$f":"IF(ISNUMBER(VLOOKUP($B39, 'Data Inputs'!$B$5:$H$648, 7, FALSE))=TRUE, VLOOKUP($B39, 'Data Inputs'!$B$5:$H$648, 7, FALSE), \"\")","v":""},65,{"$error":"#VALUE!"},56.997633333333333,{"$error":"#VALUE!"},null,null,{"$f":"IF(ISNUMBER(VLOOKUP($B39, 'Data Inputs'!$B$5:$K$648, 8, FALSE))=TRUE, VLOOKUP($B39, 'Data Inputs'!$B$5:$K$648, 8, FALSE), \"\")","v":""},{"$f":"IF(ISNUMBER(VLOOKUP($B39, 'Data Inputs'!$B$5:$K$648, 9, FALSE))=TRUE, VLOOKUP($B39, 'Data Inputs'!$B$5:$K$648, 9, FALSE), \"\")","v":""},{"$f":"IF(ISNUMBER(VLOOKUP($B39, 'Data Inputs'!$B$5:$K$648, 10, FALSE))=TRUE, VLOOKUP($B39, 'Data Inputs'!$B$5:$K$648, 10, FALSE), \"\")","v":""},0,{"$f":"IF(D39=\"\", \"\",(1000000*SUM(T32:T47))/(365*'Basic Input'!$C$10*AG39))","v":0.12713345834790071},{"$f":"'Basic Input'!$C$12","v":1.1040000000000001},{"$f":"IF('Basic Input'!$C$14=\"\",\"\",'Basic Input'!$C$14)","v":""},null,{"$f":"IF(ISNUMBER(VLOOKUP($B39, 'Data Inputs'!$B$5:$L$648, 11, FALSE))=TRUE, VLOOKUP($B39, 'Data Inputs'!$B$5:$L$648, 11, FALSE), \"\")","v":""},5.28,null,929.71428571428567,-2.7056277056277289E-3,null,0,null,{"$f":"VLOOKUP(D39,'Working Data - Vol'!D39:G105,4,TRUE)","v":4310},null,null,null,null,null,null,null,null,null,null,null,null,null,null,null,null,{"$f":"-AC39","v":2.7056277056277289E-3}]
[null,35,0.47348475000000001,2500,{"$f":"IF(D40=\"\", \"\", ROUND(VLOOKUP($C40, 'Data Inputs'!$C$5:$F$648, 3, TRUE), 2))","v":5.82},null,null,{"$f":"IF(ISNUMBER(VLOOKUP($B40, 'Data Inputs'!$B$5:$F$648, 5, FALSE))=TRUE, VLOOKUP($B40, 'Data Inputs'!$B$5:$F$648, 5, FALSE), \"\")","v":""},{"$f":"IF(ISNUMBER(VLOOKUP($B40, 'Data Inputs'!$B$5:$H$648, 6, FALSE))=TRUE, VLOOKUP($B40, 'Data Inputs'!$B$5:$H$648, 6, FALSE), \"\")","v":""},{"$f":"IF(ISNUMBER(VLOOKUP($B40, 'Data Inputs'!$B$5:$H$648, 7, FALSE))=TRUE, VLOOKUP($B40, 'Data Inputs'!$B$5:$H$648, 7, FALSE), \"\")","v":""},65,64,58,{"$error":"#N/A"},null,null,{"$f":"IF(ISNUMBER(VLOOKUP($B40, 'Data Inputs'!$B$5:$K$648, 8, FALSE))=TRUE, VLOOKUP($B40, 'Data Inputs'!$B$5:$K$648, 8, FALSE), \"\")","v":""},{"$f":"IF(ISNUMBER(VLOOKUP($B40, 'Data Inputs'!$B$5:$K$648, 9, FALSE))=TRUE, VLOOKUP($B40, 'Data Inputs'!$B$5:$K$648, 9, FALSE), \"\")","v":""},{"$f":"IF(ISNUMBER(VLOOKUP($B40, 'Data Inputs'!$B$5:$K$648, 10, FALSE))=TRUE, VLOOKUP($B40, 'Data Inputs'!$B$5:$K$648, 10, FALSE), \"\")","v":""},0,{"$f":"IF(D40=\"\", \"\",(1000000*SUM(T33:T48))/(365*'Basic Input'!$C$10*AG40))","v":0.12713345834790071},{"$f":"'Basic Input'!$C$12","v":1.1040000000000001},{"$f":"IF('Basic Input'!$C$14=\"\",\"\",'Basic Input'!$C$14)","v":""},null,{"$f":"IF(ISNUMBER(VLOOKUP($B40, 'Data Inputs'!$B$5:$L$648, 11, FALSE))=TRUE, VLOOKUP($B40, 'Data Inputs'!$B$5:$L$648, 11, FALSE), \"\")","v":""},5.28,null,929.42857142857144,-2.7056277056277289E-3,null,0,null,{"$f":"VLOOKUP(D40,'Working Data - Vol'!D40:G106,4,TRUE)","v":4310},null,null,null,null,null,null,null,null,null,null,null,null,null,null,null,null,2.7056277056277289E-3]
[null,36,0.49242414000000001,2600,{"$f":"IF(D41=\"\", \"\", ROUND(VLOOKUP($C41, 'Data Inputs'!$C$5:$F$648, 3, TRUE), 2))","v":5.84},null,null,{"$f":"IF(ISNUMBER(VLOOKUP($B41, 'Data Inputs'!$B$5:$F$648, 5, FALSE))=TRUE, VLOOKUP($B41, 'Data Inputs'!$B$5:$F$648, 5, FALSE), \"\")","v":""},{"$f":"IF(ISNUMBER(VLOOKUP($B41, 'Data Inputs'!$B$5:$H$648, 6, FALSE))=TRUE, VLOOKUP($B41, 'Data Inputs'!$B$5:$H$648, 6, FALSE), \"\")","v":""},{"$f":"IF(ISNUMBER(VLOOKUP($B41, 'Data Inputs'!$B$5:$H$648, 7, FALSE))=TRUE, VLOOKUP($B41, 'Data Inputs'!$B$5:$H$648, 7, FALSE), \"\")","v":""},65,64,58,{"$error":"#N/A"},20,null,{"$f":"IF(ISNUMBER(VLOOKUP($B41, 'Data Inputs'!$B$5:$K$648, 8, FALSE))=TRUE, VLOOKUP($B41, 'Data Inputs'!$B$5:$K$648, 8, FALSE), \"\")","v":""},{"$f":"IF(ISNUMBER(VLOOKUP($B41, 'Data Inputs'!$B$5:$K$648, 9, FALSE))=TRUE, VLOOKUP($B41, 'Data Inputs'!$B$5:$K$648, 9, FALSE), \"\")","v":""},{"$f":"IF(ISNUMBER(VLOOKUP($B41, 'Data Inputs'!$B$5:$K$648, 10, FALSE))=TRUE, VLOOKUP($B41, 'Data Inputs'!$B$5:$K$648, 10, FALSE), \"\")","v":""},0,{"$f":"IF(D41=\"\", \"\",(1000000*SUM(T34:T49))/(365*'Basic Input'!$C$10*AG41))","v":0.12713345834790071},{"$f":"'Basic Input'!$C$12","v":1.1040000000000001},{"$f":"IF('Basic Input'!$C$14=\"\",\"\",'Basic Input'!$C$14)","v":""},null,{"$f":"IF(ISNUMBER(VLOOKUP($B41, 'Data Inputs'!$B$5:$L$648, 11, FALSE))=TRUE, VLOOKUP($B41, 'Data Inputs'!$B$5:$L$648, 11, FALSE), \"\")","v":""},5.28,null,929.14285714285711,-2.7056277056277289E-3,null,0,null,{"$f":"VLOOKUP(D41,'Working Data - Vol'!D41:G107,4,TRUE)","v":4310},null,null,null,null,null,null,null,null,null,null,null,null,null,null,null,null,2.7056277056277289E-3]
[null,37,0.51136353000000001,2700,{"$f":"IF(D42=\"\", \"\", ROUND(VLOOKUP($C42, 'Data Inputs'!$C$5:$F$648, 3, TRUE), 2))","v":5.86},null,null,{"$f":"IF(ISNUMBER(VLOOKUP($B42, 'Data Inputs'!$B$5:$F$648, 5, FALSE))=TRUE, VLOOKUP($B42, 'Data Inputs'!$B$5:$F$648, 5, FALSE), \"\")","v":""},{"$f":"IF(ISNUMBER(VLOOKUP($B42, 'Data Inputs'!$B$5:$H$648, 6, FALSE))=TRUE, VLOOKUP($B42, 'Data Inputs'!$B$5:$H$648, 6, FALSE), \"\")","v":64},{"$f":"IF(ISNUMBER(VLOOKUP($B42, 'Data Inputs'!$B$5:$H$648, 7, FALSE))=TRUE, VLOOKUP($B42, 'Data Inputs'!$B$5:$H$648, 7, FALSE), \"\")","v":58},65,64,58,{"$error":"#N/A"},null,null,{"$f":"IF(ISNUMBER(VLOOKUP($B42, 'Data Inputs'!$B$5:$K$648, 8, FALSE))=TRUE, VLOOKUP($B42, 'Data Inputs'!$B$5:$K$648, 8, FALSE), \"\")","v":""},{"$f":"IF(ISNUMBER(VLOOKUP($B42, 'Data Inputs'!$B$5:$K$648, 9, FALSE))=TRUE, VLOOKUP($B42, 'Data Inputs'!$B$5:$K$648, 9, FALSE), \"\")","v":""},{"$f":"IF(ISNUMBER(VLOOKUP($B42, 'Data Inputs'!$B$5:$K$648, 10, FALSE))=TRUE, VLOOKUP($B42, 'Data Inputs'!$B$5:$K$648, 10, FALSE), \"\")","v":""},0,{"$f":"IF(D42=\"\", \"\",(1000000*SUM(T35:T50))/(365*'Basic Input'!$C$10*AG42))","v":0.12713345834790071},{"$f":"'Basic Input'!$C$12","v":1.1040000000000001},{"$f":"IF('Basic Input'!$C$14=\"\",\"\",'Basic Input'!$C$14)","v":""},null,{"$f":"IF(ISNUMBER(VLOOKUP($B42, 'Data Inputs'!$B$5:$L$648, 11, FALSE))=TRUE, VLOOKUP($B42, 'Data Inputs'!$B$5:$L$648, 11, FALSE), \"\")","v":""},5.28,null,929.25,4.7348484848484806E-3,null,0,null,{"$f":"VLOOKUP(D42,'Working Data - Vol'!D42:G108,4,TRUE)","v":4310},null,null,null,null,null,null,null,null,null,null,null,null,null,null,null,null,-4.7348484848484806E-3]
[null,38,0.53030292000000001,2800,{"$f":"IF(D43=\"\", \"\", ROUND(VLOOKUP($C43, 'Data Inputs'!$C$5:$F$648, 3, TRUE), 2))","v":5.88},null,null,{"$f":"IF(ISNUMBER(VLOOKUP($B43, 'Data Inputs'!$B$5:$F$648, 5, FALSE))=TRUE, VLOOKUP($B43, 'Data Inputs'!$B$5:$F$648, 5, FALSE), \"\")","v":""},{"$f":"IF(ISNUMBER(VLOOKUP($B43, 'Data Inputs'!$B$5:$H$648, 6, FALSE))=TRUE, VLOOKUP($B43, 'Data Inputs'!$B$5:$H$648, 6, FALSE), \"\")","v":""},{"$f":"IF(ISNUMBER(VLOOKUP($B43, 'Data Inputs'!$B$5:$H$648, 7, FALSE))=TRUE, VLOOKUP($B43, 'Data Inputs'!$B$5:$H$648, 7, FALSE), \"\")","v":""},65,64,58,{"$error":"#N/A"},null,null,{"$f":"IF(ISNUMBER(VLOOKUP($B43, 'Data Inputs'!$B$5:$K$648, 8, FALSE))=TRUE, VLOOKUP($B43, 'Data Inputs'!$B$5:$K$648, 8, FALSE), \"\")","v":""},{"$f":"IF(ISNUMBER(VLOOKUP($B43, 'Data Inputs'!$B$5:$K$648, 9, FALSE))=TRUE, VLOOKUP($B43, 'Data Inputs'!$B$5:$K$648, 9, FALSE), \"\")","v":""},{"$f":"IF(ISNUMBER(VLOOKUP($B43, 'Data Inputs'!$B$5:$K$648, 10, FALSE))=TRUE, VLOOKUP($B43, 'Data Inputs'!$B$5:$K$648, 10, FALSE), \"\")","v":""},0,null,{"$f":"'Basic Input'!$C$12","v":1.1040000000000001},{"$f":"IF('Basic Input'!$C$14=\"\",\"\",'Basic Input'!$C$14)","v":""},null,{"$f":"IF(ISNUMBER(VLOOKUP($B43, 'Data Inputs'!$B$5:$L$648, 11, FALSE))=TRUE, VLOOKUP($B43, 'Data Inputs'!$B$5:$L$648, 11, FALSE), \"\")","v":""},5.28,null,929.75,4.7348484848484806E-3,null,0,null,{"$f":"VLOOKUP(D43,'Working Data - Vol'!D43:G109,4,TRUE)","v":4310},null,null,null,null,null,null,null,null,null,null,null,null,null,null,null,null,-4.7348484848484806E-3]
[null,39,0.54924231000000001,2900,{"$f":"IF(D44=\"\", \"\", ROUND(VLOOKUP($C44, 'Data Inputs'!$C$5:$F$648, 3, TRUE), 2))","v":5.9},null,null,{"$f":"IF(ISNUMBER(VLOOKUP($B44, 'Data Inputs'!$B$5:$F$648, 5, FALSE))=TRUE, VLOOKUP($B44, 'Data Inputs'!$B$5:$F$648, 5, FALSE), \"\")","v":""},{"$f":"IF(ISNUMBER(VLOOKUP($B44, 'Data Inputs'!$B$5:$H$648, 6, FALSE))=TRUE, VLOOKUP($B44, 'Data Inputs'!$B$5:$H$648, 6, FALSE), \"\")","v":""},{"$f":"IF(ISNUMBER(VLOOKUP($B44, 'Data Inputs'!$B$5:$H$648, 7, FALSE))=TRUE, VLOOKUP($B44, 'Data Inputs'!$B$5:$H$648, 7, FALSE), \"\")","v":""},65,64,58,{"$error":"#N/A"},null,null,{"$f":"IF(ISNUMBER(VLOOKUP($B44, 'Data Inputs'!$B$5:$K$648, 8, FALSE))=TRUE, VLOOKUP($B44, 'Data Inputs'!$B$5:$K$648, 8, FALSE), \"\")","v":""},{"$f":"IF(ISNUMBER(VLOOKUP($B44, 'Data Inputs'!$B$5:$K$648, 9, FALSE))=TRUE, VLOOKUP($B44, 'Data Inputs'!$B$5:$K$648, 9, FALSE), \"\")","v":""},{"$f":"IF(ISNUMBER(VLOOKUP($B44, 'Data Inputs'!$B$5:$K$648, 10, FALSE))=TRUE, VLOOKUP($B44, 'Data Inputs'!$B$5:$K$648, 10, FALSE), \"\")","v":""},0,null,{"$f":"'Basic Input'!$C$12","v":1.1040000000000001},{"$f":"IF('Basic Input'!$C$14=\"\",\"\",'Basic Input'!$C$14)","v":""},null,{"$f":"IF(ISNUMBER(VLOOKUP($B44, 'Data Inputs'!$B$5:$L$648, 11, FALSE))=TRUE, VLOOKUP($B44, 'Data Inputs'!$B$5:$L$648, 11, FALSE), \"\")","v":1},5.28,null,null,null,null,1,null,{"$f":"VLOOKUP(D44,'Working Data - Vol'!D44:G110,4,TRUE)","v":4310},null,null,null,null,null,null,null,null,null,null,null,null,null,null,null,null,0]
[null,40,0.56818170000000001,3000,{"$f":"IF(D45=\"\", \"\", ROUND(VLOOKUP($C45, 'Data Inputs'!$C$5:$F$648, 3, TRUE), 2))","v":5.92},null,null,{"$f":"IF(ISNUMBER(VLOOKUP($B45, 'Data Inputs'!$B$5:$F$648, 5, FALSE))=TRUE, VLOOKUP($B45, 'Data Inputs'!$B$5:$F$648, 5, FALSE), \"\")","v":""},{"$f":"IF(ISNUMBER(VLOOKUP($B45, 'Data Inputs'!$B$5:$H$648, 6, FALSE))=TRUE, VLOOKUP($B45, 'Data Inputs'!$B$5:$H$648, 6, FALSE), \"\")","v":""},{"$f":"IF(ISNUMBER(VLOOKUP($B45, 'Data Inputs'!$B$5:$H$648, 7, FALSE))=TRUE, VLOOKUP($B45, 'Data Inputs'!$B$5:$H$648, 7, FALSE), \"\")","v":""},65,64,58,{"$error":"#N/A"},null,null,{"$f":"IF(ISNUMBER(VLOOKUP($B45, 'Data Inputs'!$B$5:$K$648, 8, FALSE))=TRUE, VLOOKUP($B45, 'Data Inputs'!$B$5:$K$648, 8, FALSE), \"\")","v":""},{"$f":"IF(ISNUMBER(VLOOKUP($B45, 'Data Inputs'!$B$5:$K$648, 9, FALSE))=TRUE, VLOOKUP($B45, 'Data Inputs'!$B$5:$K$648, 9, FALSE), \"\")","v":""},{"$f":"IF(ISNUMBER(VLOOKUP($B45, 'Data Inputs'!$B$5:$K$648, 10, FALSE))=TRUE, VLOOKUP($B45, 'Data Inputs'!$B$5:$K$648, 10, FALSE), \"\")","v":""},0,null,{"$f":"'Basic Input'!$C$12","v":1.1040000000000001},{"$f":"IF('Basic Input'!$C$14=\"\",\"\",'Basic Input'!$C$14)","v":""},null,{"$f":"IF(ISNUMBER(VLOOKUP($B45, 'Data Inputs'!$B$5:$L$648, 11, FALSE))=TRUE, VLOOKUP($B45, 'Data Inputs'!$B$5:$L$648, 11, FALSE), \"\")","v":""},5.28,null,null,null,null,null,null,{"$f":"VLOOKUP(D45,'Working Data - Vol'!D45:G111,4,TRUE)","v":4310},null,null,null,null,null,null,null,null,null,null,null,null,null,null,null,null,0]
[null,41,0.58712109000000001,3100,{"$f":"IF(D46=\"\", \"\", ROUND(VLOOKUP($C46, 'Data Inputs'!$C$5:$F$648, 3, TRUE), 2))","v":5.94},null,null,{"$f":"IF(ISNUMBER(VLOOKUP($B46, 'Data Inputs'!$B$5:$F$648, 5, FALSE))=TRUE, VLOOKUP($B46, 'Data Inputs'!$B$5:$F$648, 5, FALSE), \"\")","v":""},{"$f":"IF(ISNUMBER(VLOOKUP($B46, 'Data Inputs'!$B$5:$H$648, 6, FALSE))=TRUE, VLOOKUP($B46, 'Data Inputs'!$B$5:$H$648, 6, FALSE), \"\")","v":""},{"$f":"IF(ISNUMBER(VLOOKUP($B46, 'Data Inputs'!$B$5:$H$648, 7, FALSE))=TRUE, VLOOKUP($B46, 'Data Inputs'!$B$5:$H$648, 7, FALSE), \"\")","v":""},65,64,58,{"$error":"#N/A"},null,null,{"$f":"IF(ISNUMBER(VLOOKUP($B46, 'Data Inputs'!$B$5:$K$648, 8, FALSE))=TRUE, VLOOKUP($B46, 'Data Inputs'!$B$5:$K$648, 8, FALSE), \"\")","v":""},{"$f":"IF(ISNUMBER(VLOOKUP($B46, 'Data Inputs'!$B$5:$K$648, 9, FALSE))=TRUE, VLOOKUP($B46, 'Data Inputs'!$B$5:$K$648, 9, FALSE), \"\")","v":""},{"$f":"IF(ISNUMBER(VLOOKUP($B46, 'Data Inputs'!$B$5:$K$648, 10, FALSE))=TRUE, VLOOKUP($B46, 'Data Inputs'!$B$5:$K$648, 10, FALSE), \"\")","v":""},0,null,{"$f":"'Basic Input'!$C$12","v":1.1040000000000001},{"$f":"IF('Basic Input'!$C$14=\"\",\"\",'Basic Input'!$C$14)","v":""},null,{"$f":"IF(ISNUMBER(VLOOKUP($B46, 'Data Inputs'!$B$5:$L$648, 11, FALSE))=TRUE, VLOOKUP($B46, 'Data Inputs'!$B$5:$L$648, 11, FALSE), \"\")","v":""},null,null,null,null,null,null,null,{"$f":"VLOOKUP(D46,'Working Data - Vol'!D46:G112,4,TRUE)","v":4310},null,null,null,null,null,null,null,null,null,null,null,null,null,null,null,null,0]
[null,42,0.60606048000000001,3200,{"$f":"IF(D47=\"\", \"\", ROUND(VLOOKUP($C47, 'Data Inputs'!$C$5:$F$648, 3, TRUE), 2))","v":5.96},null,null,{"$f":"IF(ISNUMBER(VLOOKUP($B47, 'Data Inputs'!$B$5:$F$648, 5, FALSE))=TRUE, VLOOKUP($B47, 'Data Inputs'!$B$5:$F$648, 5, FALSE), \"\")","v":""},{"$f":"IF(ISNUMBER(VLOOKUP($B47, 'Data Inputs'!$B$5:$H$648, 6, FALSE))=TRUE, VLOOKUP($B47, 'Data Inputs'!$B$5:$H$648, 6, FALSE), \"\")","v":""},{"$f":"IF(ISNUMBER(VLOOKUP($B47, 'Data Inputs'!$B$5:$H$648, 7, FALSE))=TRUE, VLOOKUP($B47, 'Data Inputs'!$B$5:$H$648, 7, FALSE), \"\")","v":""},65,64,58,{"$error":"#N/A"},null,null,{"$f":"IF(ISNUMBER(VLOOKUP($B47, 'Data Inputs'!$B$5:$K$648, 8, FALSE))=TRUE, VLOOKUP($B47, 'Data Inputs'!$B$5:$K$648, 8, FALSE), \"\")","v":""},{"$f":"IF(ISNUMBER(VLOOKUP($B47, 'Data Inputs'!$B$5:$K$648, 9, FALSE))=TRUE, VLOOKUP($B47, 'Data Inputs'!$B$5:$K$648, 9, FALSE), \"\")","v":""},{"$f":"IF(ISNUMBER(VLOOKUP($B47, 'Data Inputs'!$B$5:$K$648, 10, FALSE))=TRUE, VLOOKUP($B47, 'Data Inputs'!$B$5:$K$648, 10, FALSE), \"\")","v":""},0,null,null,null,null,{"$f":"IF(ISNUMBER(VLOOKUP($B47, 'Data Inputs'!$B$5:$L$648, 11, FALSE))=TRUE, VLOOKUP($B47, 'Data Inputs'!$B$5:$L$648, 11, FALSE), \"\")","v":""},null,null,null,null,null,null,null,{"$f":"VLOOKUP(D47,'Working Data - Vol'!D47:G113,4,TRUE)","v":4310},null,null,null,null,null,null,null,null,null,null,null,null,null,null,null,null,0]
[null,43,0.62499987000000001,3300,{"$f":"IF(D48=\"\", \"\", ROUND(VLOOKUP($C48, 'Data Inputs'!$C$5:$F$648, 3, TRUE), 2))","v":5.98},null,null,{"$f":"IF(ISNUMBER(VLOOKUP($B48, 'Data Inputs'!$B$5:$F$648, 5, FALSE))=TRUE, VLOOKUP($B48, 'Data Inputs'!$B$5:$F$648, 5, FALSE), \"\")","v":65},{"$f":"IF(ISNUMBER(VLOOKUP($B48, 'Data Inputs'!$B$5:$H$648, 6, FALSE))=TRUE, VLOOKUP($B48, 'Data Inputs'!$B$5:$H$648, 6, FALSE), \"\")","v":""},{"$f":"IF(ISNUMBER(VLOOKUP($B48, 'Data Inputs'!$B$5:$H$648, 7, FALSE))=TRUE, VLOOKUP($B48, 'Data Inputs'!$B$5:$H$648, 7, FALSE), \"\")","v":""},65,64,58,{"$error":"#N/A"},null,null,{"$f":"IF(ISNUMBER(VLOOKUP($B48, 'Data Inputs'!$B$5:$K$648, 8, FALSE))=TRUE, VLOOKUP($B48, 'Data Inputs'!$B$5:$K$648, 8, FALSE), \"\")","v":""},{"$f":"IF(ISNUMBER(VLOOKUP($B48, 'Data Inputs'!$B$5:$K$648, 9, FALSE))=TRUE, VLOOKUP($B48, 'Data Inputs'!$B$5:$K$648, 9, FALSE), \"\")","v":""},{"$f":"IF(ISNUMBER(VLOOKUP($B48, 'Data Inputs'!$B$5:$K$648, 10, FALSE))=TRUE, VLOOKUP($B48, 'Data Inputs'!$B$5:$K$648, 10, FALSE), \"\")","v":""},0,null,null,null,null,{"$f":"IF(ISNUMBER(VLOOKUP($B48, 'Data Inputs'!$B$5:$L$648, 11, FALSE))=TRUE, VLOOKUP($B48, 'Data Inputs'!$B$5:$L$648, 11, FALSE), \"\")","v":""},null,null,null,null,null,null,null,{"$f":"VLOOKUP(D48,'Working Data - Vol'!D48:G114,4,TRUE)","v":4310},null,null,null,null,null,null,null,null,null,null,null,null,null,null,null,null,0]
[null,44,0.64393926000000001,3400,{"$f":"IF(D49=\"\", \"\", ROUND(VLOOKUP($C49, 'Data Inputs'!$C$5:$F$648, 3, TRUE), 2))","v":5.99},null,null,{"$f":"IF(ISNUMBER(VLOOKUP($B49, 'Data Inputs'!$B$5:$F$648, 5, FALSE))=TRUE, VLOOKUP($B49, 'Data Inputs'!$B$5:$F$648, 5, FALSE), \"\")","v":""},{"$f":"IF(ISNUMBER(VLOOKUP($B49, 'Data Inputs'!$B$5:$H$648, 6, FALSE))=TRUE, VLOOKUP($B49, 'Data Inputs'!$B$5:$H$648, 6, FALSE), \"\")","v":""},{"$f":"IF(ISNUMBER(VLOOKUP($B49, 'Data Inputs'!$B$5:$H$648, 7, FALSE))=TRUE, VLOOKUP($B49, 'Data Inputs'!$B$5:$H$648, 7, FALSE), \"\")","v":""},65,64,58,{"$error":"#N/A"},null,null,{"$f":"IF(ISNUMBER(VLOOKUP($B49, 'Data Inputs'!$B$5:$K$648, 8, FALSE))=TRUE, VLOOKUP($B49, 'Data Inputs'!$B$5:$K$648, 8, FALSE), \"\")","v":""},{"$f":"IF(ISNUMBER(VLOOKUP($B49, 'Data Inputs'!$B$5:$K$648, 9, FALSE))=TRUE, VLOOKUP($B49, 'Data Inputs'!$B$5:$K$648, 9, FALSE), \"\")","v":""},{"$f":"IF(ISNUMBER(VLOOKUP($B49, 'Data Inputs'!$B$5:$K$648, 10, FALSE))=TRUE, VLOOKUP($B49, 'Data Inputs'!$B$5:$K$648, 10, FALSE), \"\")","v":""},0,null,null,null,null,{"$f":"IF(ISNUMBER(VLOOKUP($B49, 'Data Inputs'!$B$5:$L$648, 11, FALSE))=TRUE, VLOOKUP($B49, 'Data Inputs'!$B$5:$L$648, 11, FALSE), \"\")","v":""},null,null,null,null,null,null,null,{"$f":"VLOOKUP(D49,'Working Data - Vol'!D49:G115,4,TRUE)","v":4310},null,null,null,null,null,null,null,null,null,null,null,null,null,null,null,null,0]
[null,45,0.66287865000000001,3500,{"$f":"IF(D50=\"\", \"\", ROUND(VLOOKUP($C50, 'Data Inputs'!$C$5:$F$648, 3, TRUE), 2))","v":6.01},null,null,{"$f":"IF(ISNUMBER(VLOOKUP($B50, 'Data Inputs'!$B$5:$F$648, 5, FALSE))=TRUE, VLOOKUP($B50, 'Data Inputs'!$B$5:$F$648, 5, FALSE), \"\")","v":""},{"$f":"IF(ISNUMBER(VLOOKUP($B50, 'Data Inputs'!$B$5:$H$648, 6, FALSE))=TRUE, VLOOKUP($B50, 'Data Inputs'!$B$5:$H$648, 6, FALSE), \"\")","v":""},{"$f":"IF(ISNUMBER(VLOOKUP($B50, 'Data Inputs'!$B$5:$H$648, 7, FALSE))=TRUE, VLOOKUP($B50, 'Data Inputs'!$B$5:$H$648, 7, FALSE), \"\")","v":""},65,64,58,{"$error":"#N/A"},null,null,{"$f":"IF(ISNUMBER(VLOOKUP($B50, 'Data Inputs'!$B$5:$K$648, 8, FALSE))=TRUE, VLOOKUP($B50, 'Data Inputs'!$B$5:$K$648, 8, FALSE), \"\")","v":""},{"$f":"IF(ISNUMBER(VLOOKUP($B50, 'Data Inputs'!$B$5:$K$648, 9, FALSE))=TRUE, VLOOKUP($B50, 'Data Inputs'!$B$5:$K$648, 9, FALSE), \"\")","v":""},{"$f":"IF(ISNUMBER(VLOOKUP($B50, 'Data Inputs'!$B$5:$K$648, 10, FALSE))=TRUE, VLOOKUP($B50, 'Data Inputs'!$B$5:$K$648, 10, FALSE), \"\")","v":""},0,null,null,null,null,{"$f":"IF(ISNUMBER(VLOOKUP($B50, 'Data Inputs'!$B$5:$L$648, 11, FALSE))=TRUE, VLOOKUP($B50, 'Data Inputs'!$B$5:$L$648, 11, FALSE), \"\")","v":""},null,null,null,null,null,null,null,{"$f":"VLOOKUP(D50,'Working Data - Vol'!D50:G116,4,TRUE)","v":{"$error":"#N/A"}},null,null,null,null,null,null,null,null,null,null,null,null,null,null,null,null,0]
[null,46,"",null,{"$f":"IF(D51=\"\", \"\", ROUND(VLOOKUP($C51, 'Data Inputs'!$C$5:$F$648, 3, TRUE), 2))","v":""},null,null,{"$f":"IF(ISNUMBER(VLOOKUP($B51, 'Data Inputs'!$B$5:$F$648, 5, FALSE))=TRUE, VLOOKUP($B51, 'Data Inputs'!$B$5:$F$648, 5, FALSE), \"\")","v":""},{"$f":"IF(ISNUMBER(VLOOKUP($B51, 'Data Inputs'!$B$5:$H$648, 6, FALSE))=TRUE, VLOOKUP($B51, 'Data Inputs'!$B$5:$H$648, 6, FALSE), \"\")","v":""},{"$f":"IF(ISNUMBER(VLOOKUP($B51, 'Data Inputs'!$B$5:$H$648, 7, FALSE))=TRUE, VLOOKUP($B51, 'Data Inputs'!$B$5:$H$648, 7, FALSE), \"\")","v":""},65,"","","",null,null,{"$f":"IF(ISNUMBER(VLOOKUP($B51, 'Data Inputs'!$B$5:$K$648, 8, FALSE))=TRUE, VLOOKUP($B51, 'Data Inputs'!$B$5:$K$648, 8, FALSE), \"\")","v":""},{"$f":"IF(ISNUMBER(VLOOKUP($B51, 'Data Inputs'!$B$5:$K$648, 9, FALSE))=TRUE, VLOOKUP($B51, 'Data Inputs'!$B$5:$K$648, 9, FALSE), \"\")","v":""},{"$f":"IF(ISNUMBER(VLOOKUP($B51, 'Data Inputs'!$B$5:$K$648, 10, FALSE))=TRUE, VLOOKUP($B51, 'Data Inputs'!$B$5:$K$648, 10, FALSE), \"\")","v":""},0,{"$f":"IF(D51=\"\", \"\",(1000000*SUM(T44:T59))/(365*'Basic Input'!$C$10*AG51))","v":""},null,null,null,{"$f":"IF(ISNUMBER(VLOOKUP($B51, 'Data Inputs'!$B$5:$L$648, 11, FALSE))=TRUE, VLOOKUP($B51, 'Data Inputs'!$B$5:$L$648, 11, FALSE), \"\")","v":""},""]
[null,47,"",null,{"$f":"IF(D52=\"\", \"\", ROUND(VLOOKUP($C52, 'Data Inputs'!$C$5:$F$648, 3, TRUE), 2))","v":""},null,null,{"$f":"IF(ISNUMBER(VLOOKUP($B52, 'Data Inputs'!$B$5:$F$648, 5, FALSE))=TRUE, VLOOKUP($B52, 'Data Inputs'!$B$5:$F$648, 5, FALSE), \"\")","v":""},{"$f":"IF(ISNUMBER(VLOOKUP($B52, 'Data Inputs'!$B$5:$H$648, 6, FALSE))=TRUE, VLOOKUP($B52, 'Data Inputs'!$B$5:$H$648, 6, FALSE), \"\")","v":""},{"$f":"IF(ISNUMBER(VLOOKUP($B52, 'Data Inputs'!$B$5:$H$648, 7, FALSE))=TRUE, VLOOKUP($B52, 'Data Inputs'!$B$5:$H$648, 7, FALSE), \"\")","v":""},65,"","","",null,null,{"$f":"IF(ISNUMBER(VLOOKUP($B52, 'Data Inputs'!$B$5:$K$648, 8, FALSE))=TRUE, VLOOKUP($B52, 'Data Inputs'!$B$5:$K$648, 8, FALSE), \"\")","v":""},{"$f":"IF(ISNUMBER(VLOOKUP($B52, 'Data Inputs'!$B$5:$K$648, 9, FALSE))=TRUE, VLOOKUP($B52, 'Data Inputs'!$B$5:$K$648, 9, FALSE), \"\")","v":""},{"$f":"IF(ISNUMBER(VLOOKUP($B52, 'Data Inputs'!$B$5:$K$648, 10, FALSE))=TRUE, VLOOKUP($B52, 'Data Inputs'!$B$5:$K$648, 10, FALSE), \"\")","v":""},0,{"$f":"IF(D52=\"\", \"\",(1000000*SUM(T45:T60))/(365*'Basic Input'!$C$10*AG52))","v":""},{"$f":"IF(U52=\"\", \"\", 'Basic Input'!$C$12)","v":""},null,null,{"$f":"IF(ISNUMBER(VLOOKUP($B52, 'Data Inputs'!$B$5:$L$648, 11, FALSE))=TRUE, VLOOKUP($B52, 'Data Inputs'!$B$5:$L$648, 11, FALSE), \"\")","v":""},""]
[null,48,"",null,{"$f":"IF(D53=\"\", \"\", ROUND(VLOOKUP($C53, 'Data Inputs'!$C$5:$F$648, 3, TRUE), 2))","v":""},null,null,{"$f":"IF(ISNUMBER(VLOOKUP($B53, 'Data Inputs'!$B$5:$F$648, 5, FALSE))=TRUE, VLOOKUP($B53, 'Data Inputs'!$B$5:$F$648, 5, FALSE), \"\")","v":""},{"$f":"IF(ISNUMBER(VLOOKUP($B53, 'Data Inputs'!$B$5:$H$648, 6, FALSE))=TRUE, VLOOKUP($B53, 'Data Inputs'!$B$5:$H$648, 6, FALSE), \"\")","v":""},{"$f":"IF(ISNUMBER(VLOOKUP($B53, 'Data Inputs'!$B$5:$H$648, 7, FALSE))=TRUE, VLOOKUP($B53, 'Data Inputs'!$B$5:$H$648, 7, FALSE), \"\")","v":""},65,"","","",null,null,{"$f":"IF(ISNUMBER(VLOOKUP($B53, 'Data Inputs'!$B$5:$K$648, 8, FALSE))=TRUE, VLOOKUP($B53, 'Data Inputs'!$B$5:$K$648, 8, FALSE), \"\")","v":""},{"$f":"IF(ISNUMBER(VLOOKUP($B53, 'Data Inputs'!$B$5:$K$648, 9, FALSE))=TRUE, VLOOKUP($B53, 'Data Inputs'!$B$5:$K$648, 9, FALSE), \"\")","v":""},{"$f":"IF(ISNUMBER(VLOOKUP($B53, 'Data Inputs'!$B$5:$K$648, 10, FALSE))=TRUE, VLOOKUP($B53, 'Data Inputs'!$B$5:$K$648, 10, FALSE), \"\")","v":""},0,{"$f":"IF(D53=\"\", \"\",(1000000*SUM(T46:T61))/(365*'Basic Input'!$C$10*AG53))","v":""},{"$f":"IF(U53=\"\", \"\", 'Basic Input'!$C$12)","v":""},{"$f":"IF('Basic Input'!$C$14=\"\",\"\",'Basic Input'!$C$14)","v":""},null,{"$f":"IF(ISNUMBER(VLOOKUP($B53, 'Data Inputs'!$B$5:$L$648, 11, FALSE))=TRUE, VLOOKUP($B53, 'Data Inputs'!$B$5:$L$648, 11, FALSE), \"\")","v":""},"",null,null,null,null,null,null,null,null,null,null,null,null,2500,1.7]
[null,49,"",null,{"$f":"IF(D54=\"\", \"\", ROUND(VLOOKUP($C54, 'Data Inputs'!$C$5:$F$648, 3, TRUE), 2))","v":""},null,null,{"$f":"IF(ISNUMBER(VLOOKUP($B54, 'Data Inputs'!$B$5:$F$648, 5, FALSE))=TRUE, VLOOKUP($B54, 'Data Inputs'!$B$5:$F$648, 5, FALSE), \"\")","v":""},{"$f":"IF(ISNUMBER(VLOOKUP($B54, 'Data Inputs'!$B$5:$H$648, 6, FALSE))=TRUE, VLOOKUP($B54, 'Data Inputs'!$B$5:$H$648, 6, FALSE), \"\")","v":""},{"$f":"IF(ISNUMBER(VLOOKUP($B54, 'Data Inputs'!$B$5:$H$648, 7, FALSE))=TRUE, VLOOKUP($B54, 'Data Inputs'!$B$5:$H$648, 7, FALSE), \"\")","v":""},65,"","","",null,null,{"$f":"IF(ISNUMBER(VLOOKUP($B54, 'Data Inputs'!$B$5:$K$648, 8, FALSE))=TRUE, VLOOKUP($B54, 'Data Inputs'!$B$5:$K$648, 8, FALSE), \"\")","v":""},{"$f":"IF(ISNUMBER(VLOOKUP($B54, 'Data Inputs'!$B$5:$K$648, 9, FALSE))=TRUE, VLOOKUP($B54, 'Data Inputs'!$B$5:$K$648, 9, FALSE), \"\")","v":""},{"$f":"IF(ISNUMBER(VLOOKUP($B54, 'Data Inputs'!$B$5:$K$648, 10, FALSE))=TRUE, VLOOKUP($B54, 'Data Inputs'!$B$5:$K$648, 10, FALSE), \"\")","v":""},0,{"$f":"IF(D54=\"\", \"\",(1000000*SUM(T47:T62))/(365*'Basic Input'!$C$10*AG54))","v":""},{"$f":"IF(U54=\"\", \"\", 'Basic Input'!$C$12)","v":""},{"$f":"IF('Basic Input'!$C$14=\"\",\"\",'Basic Input'!$C$14)","v":""},null,{"$f":"IF(ISNUMBER(VLOOKUP($B54, 'Data Inputs'!$B$5:$L$648, 11, FALSE))=TRUE, VLOOKUP($B54, 'Data Inputs'!$B$5:$L$648, 11, FALSE), \"\")","v":""},"",null,null,null,null,null,null,null,null,null,null,null,null,3000,{"$f":"((AM54-$AM$53)/($AM$56-$AM$53)*($AN$56-$AN$53))+$AN$53","v":1.6319999999999999}]
[null,50,"",{"$f":"VLOOKUP($B55, 'Data Inputs'!$B$5:$F$648, 3, TRUE)","v":""},{"$f":"IF(D55=\"\", \"\", ROUND(VLOOKUP($C55, 'Data Inputs'!$C$5:$F$648, 3, TRUE), 2))","v":""},null,null,{"$f":"IF(ISNUMBER(VLOOKUP($B55, 'Data Inputs'!$B$5:$F$648, 5, FALSE))=TRUE, VLOOKUP($B55, 'Data Inputs'!$B$5:$F$648, 5, FALSE), \"\")","v":""},{"$f":"IF(ISNUMBER(VLOOKUP($B55, 'Data Inputs'!$B$5:$H$648, 6, FALSE))=TRUE, VLOOKUP($B55, 'Data Inputs'!$B$5:$H$648, 6, FALSE), \"\")","v":""},{"$f":"IF(ISNUMBER(VLOOKUP($B55, 'Data Inputs'!$B$5:$H$648, 7, FALSE))=TRUE, VLOOKUP($B55, 'Data Inputs'!$B$5:$H$648, 7, FALSE), \"\")","v":""},65,"","","",null,null,{"$f":"IF(ISNUMBER(VLOOKUP($B55, 'Data Inputs'!$B$5:$K$648, 8, FALSE))=TRUE, VLOOKUP($B55, 'Data Inputs'!$B$5:$K$648, 8, FALSE), \"\")","v":""},{"$f":"IF(ISNUMBER(VLOOKUP($B55, 'Data Inputs'!$B$5:$K$648, 9, FALSE))=TRUE, VLOOKUP($B55, 'Data Inputs'!$B$5:$K$648, 9, FALSE), \"\")","v":""},{"$f":"IF(ISNUMBER(VLOOKUP($B55, 'Data Inputs'!$B$5:$K$648, 10, FALSE))=TRUE, VLOOKUP($B55, 'Data Inputs'!$B$5:$K$648, 10, FALSE), \"\")","v":""},0,{"$f":"IF(D55=\"\", \"\",(1000000*SUM(T48:T63))/(365*'Basic Input'!$C$10*AG55))","v":""},{"$f":"IF(U55=\"\", \"\", 'Basic Input'!$C$12)","v":""},{"$f":"IF('Basic Input'!$C$14=\"\",\"\",'Basic Input'!$C$14)","v":""},null,{"$f":"IF(ISNUMBER(VLOOKUP($B55, 'Data Inputs'!$B$5:$L$648, 11, FALSE))=TRUE, VLOOKUP($B55, 'Data Inputs'!$B$5:$L$648, 11, FALSE), \"\")","v":""},"",null,null,null,null,null,null,null,null,null,null,null,null,4500,{"$f":"((AM55-$AM$53)/($AM$56-$AM$53)*($AN$56-$AN$53))+$AN$53","v":1.4279999999999999}]
[null,51,"",{"$f":"VLOOKUP($B56, 'Data Inputs'!$B$5:$F$648, 3, TRUE)","v":""},{"$f":"IF(D56=\"\", \"\", ROUND(VLOOKUP($C56, 'Data Inputs'!$C$5:$F$648, 3, TRUE), 2))","v":""},null,null,{"$f":"IF(ISNUMBER(VLOOKUP($B56, 'Data Inputs'!$B$5:$F$648, 5, FALSE))=TRUE, VLOOKUP($B56, 'Data Inputs'!$B$5:$F$648, 5, FALSE), \"\")","v":""},{"$f":"IF(ISNUMBER(VLOOKUP($B56, 'Data Inputs'!$B$5:$H$648, 6, FALSE))=TRUE, VLOOKUP($B56, 'Data Inputs'!$B$5:$H$648, 6, FALSE), \"\")","v":""},{"$f":"IF(ISNUMBER(VLOOKUP($B56, 'Data Inputs'!$B$5:$H$648, 7, FALSE))=TRUE, VLOOKUP($B56, 'Data Inputs'!$B$5:$H$648, 7, FALSE), \"\")","v":""},65,"","","",null,null,{"$f":"IF(ISNUMBER(VLOOKUP($B56, 'Data Inputs'!$B$5:$K$648, 8, FALSE))=TRUE, VLOOKUP($B56, 'Data Inputs'!$B$5:$K$648, 8, FALSE), \"\")","v":""},{"$f":"IF(ISNUMBER(VLOOKUP($B56, 'Data Inputs'!$B$5:$K$648, 9, FALSE))=TRUE, VLOOKUP($B56, 'Data Inputs'!$B$5:$K$648, 9, FALSE), \"\")","v":""},{"$f":"IF(ISNUMBER(VLOOKUP($B56, 'Data Inputs'!$B$5:$K$648, 10, FALSE))=TRUE, VLOOKUP($B56, 'Data Inputs'!$B$5:$K$648, 10, FALSE), \"\")","v":""},0,{"$f":"IF(D56=\"\", \"\",(1000000*SUM(T49:T64))/(365*'Basic Input'!$C$10*AG56))","v":""},{"$f":"IF(U56=\"\", \"\", 'Basic Input'!$C$12)","v":""},{"$f":"IF('Basic Input'!$C$14=\"\",\"\",'Basic Input'!$C$14)","v":""},null,{"$f":"IF(ISNUMBER(VLOOKUP($B56, 'Data Inputs'!$B$5:$L$648, 11, FALSE))=TRUE, VLOOKUP($B56, 'Data Inputs'!$B$5:$L$648, 11, FALSE), \"\")","v":""},"",null,null,null,null,null,null,null,null,null,null,null,null,5000,1.36]
[null,52,"",{"$f":"VLOOKUP($B57, 'Data Inputs'!$B$5:$F$648, 3, TRUE)","v":""},{"$f":"IF(D57=\"\", \"\", ROUND(VLOOKUP($C57, 'Data Inputs'!$C$5:$F$648, 3, TRUE), 2))","v":""},null,null,{"$f":"IF(ISNUMBER(VLOOKUP($B57, 'Data Inputs'!$B$5:$F$648, 5, FALSE))=TRUE, VLOOKUP($B57, 'Data Inputs'!$B$5:$F$648, 5, FALSE), \"\")","v":""},{"$f":"IF(ISNUMBER(VLOOKUP($B57, 'Data Inputs'!$B$5:$H$648, 6, FALSE))=TRUE, VLOOKUP($B57, 'Data Inputs'!$B$5:$H$648, 6, FALSE), \"\")","v":""},{"$f":"IF(ISNUMBER(VLOOKUP($B57, 'Data Inputs'!$B$5:$H$648, 7, FALSE))=TRUE, VLOOKUP($B57, 'Data Inputs'!$B$5:$H$648, 7, FALSE), \"\")","v":""},65,"","","",null,null,{"$f":"IF(ISNUMBER(VLOOKUP($B57, 'Data Inputs'!$B$5:$K$648, 8, FALSE))=TRUE, VLOOKUP($B57, 'Data Inputs'!$B$5:$K$648, 8, FALSE), \"\")","v":""},{"$f":"IF(ISNUMBER(VLOOKUP($B57, 'Data Inputs'!$B$5:$K$648, 9, FALSE))=TRUE, VLOOKUP($B57, 'Data Inputs'!$B$5:$K$648, 9, FALSE), \"\")","v":""},{"$f":"IF(ISNUMBER(VLOOKUP($B57, 'Data Inputs'!$B$5:$K$648, 10, FALSE))=TRUE, VLOOKUP($B57, 'Data Inputs'!$B$5:$K$648, 10, FALSE), \"\")","v":""},0,{"$f":"IF(D57=\"\", \"\",(1000000*SUM(T50:T65))/(365*'Basic Input'!$C$10*AG57))","v":""},{"$f":"IF(U57=\"\", \"\", 'Basic Input'!$C$12)","v":""},{"$f":"IF('Basic Input'!$C$14=\"\",\"\",'Basic Input'!$C$14)","v":""},null,{"$f":"IF(ISNUMBER(VLOOKUP($B57, 'Data Inputs'!$B$5:$L$648, 11, FALSE))=TRUE, VLOOKUP($B57, 'Data Inputs'!$B$5:$L$648, 11, FALSE), \"\")","v":""},""]
[null,53,"",{"$f":"VLOOKUP($B58, 'Data Inputs'!$B$5:$F$648, 3, TRUE)","v":""},{"$f":"IF(D58=\"\", \"\", ROUND(VLOOKUP($C58, 'Data Inputs'!$C$5:$F$648, 3, TRUE), 2))","v":""},null,null,{"$f":"IF(ISNUMBER(VLOOKUP($B58, 'Data Inputs'!$B$5:$F$648, 5, FALSE))=TRUE, VLOOKUP($B58, 'Data Inputs'!$B$5:$F$648, 5, FALSE), \"\")","v":""},{"$f":"IF(ISNUMBER(VLOOKUP($B58, 'Data Inputs'!$B$5:$H$648, 6, FALSE))=TRUE, VLOOKUP($B58, 'Data Inputs'!$B$5:$H$648, 6, FALSE), \"\")","v":""},{"$f":"IF(ISNUMBER(VLOOKUP($B58, 'Data Inputs'!$B$5:$H$648, 7, FALSE))=TRUE, VLOOKUP($B58, 'Data Inputs'!$B$5:$H$648, 7, FALSE), \"\")","v":""},65,"","","",null,null,{"$f":"IF(ISNUMBER(VLOOKUP($B58, 'Data Inputs'!$B$5:$K$648, 8, FALSE))=TRUE, VLOOKUP($B58, 'Data Inputs'!$B$5:$K$648, 8, FALSE), \"\")","v":""},{"$f":"IF(ISNUMBER(VLOOKUP($B58, 'Data Inputs'!$B$5:$K$648, 9, FALSE))=TRUE, VLOOKUP($B58, 'Data Inputs'!$B$5:$K$648, 9, FALSE), \"\")","v":""},{"$f":"IF(ISNUMBER(VLOOKUP($B58, 'Data Inputs'!$B$5:$K$648, 10, FALSE))=TRUE, VLOOKUP($B58, 'Data Inputs'!$B$5:$K$648, 10, FALSE), \"\")","v":""},0,{"$f":"IF(D58=\"\", \"\",(1000000*SUM(T51:T66))/(365*'Basic Input'!$C$10*AG58))","v":""},{"$f":"IF(U58=\"\", \"\", 'Basic Input'!$C$12)","v":""},{"$f":"IF('Basic Input'!$C$14=\"\",\"\",'Basic Input'!$C$14)","v":""},null,{"$f":"IF(ISNUMBER(VLOOKUP($B58, 'Data Inputs'!$B$5:$L$648, 11, FALSE))=TRUE, VLOOKUP($B58, 'Data Inputs'!$B$5:$L$648, 11, FALSE), \"\")","v":""},""]
[null,54,"",{"$f":"VLOOKUP($B59, 'Data Inputs'!$B$5:$F$648, 3, TRUE)","v":""},{"$f":"IF(D59=\"\", \"\", ROUND(VLOOKUP($C59, 'Data Inputs'!$C$5:$F$648, 3, TRUE), 2))","v":""},null,null,{"$f":"IF(ISNUMBER(VLOOKUP($B59, 'Data Inputs'!$B$5:$F$648, 5, FALSE))=TRUE, VLOOKUP($B59, 'Data Inputs'!$B$5:$F$648, 5, FALSE), \"\")","v":""},{"$f":"IF(ISNUMBER(VLOOKUP($B59, 'Data Inputs'!$B$5:$H$648, 6, FALSE))=TRUE, VLOOKUP($B59, 'Data Inputs'!$B$5:$H$648, 6, FALSE), \"\")","v":""},{"$f":"IF(ISNUMBER(VLOOKUP($B59, 'Data Inputs'!$B$5:$H$648, 7, FALSE))=TRUE, VLOOKUP($B59, 'Data Inputs'!$B$5:$H$648, 7, FALSE), \"\")","v":""},65,"","","",null,null,{"$f":"IF(ISNUMBER(VLOOKUP($B59, 'Data Inputs'!$B$5:$K$648, 8, FALSE))=TRUE, VLOOKUP($B59, 'Data Inputs'!$B$5:$K$648, 8, FALSE), \"\")","v":""},{"$f":"IF(ISNUMBER(VLOOKUP($B59, 'Data Inputs'!$B$5:$K$648, 9, FALSE))=TRUE, VLOOKUP($B59, 'Data Inputs'!$B$5:$K$648, 9, FALSE), \"\")","v":""},{"$f":"IF(ISNUMBER(VLOOKUP($B59, 'Data Inputs'!$B$5:$K$648, 10, FALSE))=TRUE, VLOOKUP($B59, 'Data Inputs'!$B$5:$K$648, 10, FALSE), \"\")","v":""},0,{"$f":"IF(D59=\"\", \"\",(1000000*SUM(T52:T67))/(365*'Basic Input'!$C$10*AG59))","v":""},{"$f":"IF(U59=\"\", \"\", 'Basic Input'!$C$12)","v":""},{"$f":"IF('Basic Input'!$C$14=\"\",\"\",'Basic Input'!$C$14)","v":""},null,{"$f":"IF(ISNUMBER(VLOOKUP($B59, 'Data Inputs'!$B$5:$L$648, 11, FALSE))=TRUE, VLOOKUP($B59, 'Data Inputs'!$B$5:$L$648, 11, FALSE), \"\")","v":""},""]
[null,55,"",{"$f":"VLOOKUP($B60, 'Data Inputs'!$B$5:$F$648, 3, TRUE)","v":""},{"$f":"IF(D60=\"\", \"\", ROUND(VLOOKUP($C60, 'Data Inputs'!$C$5:$F$648, 3, TRUE), 2))","v":""},null,null,{"$f":"IF(ISNUMBER(VLOOKUP($B60, 'Data Inputs'!$B$5:$F$648, 5, FALSE))=TRUE, VLOOKUP($B60, 'Data Inputs'!$B$5:$F$648, 5, FALSE), \"\")","v":""},{"$f":"IF(ISNUMBER(VLOOKUP($B60, 'Data Inputs'!$B$5:$H$648, 6, FALSE))=TRUE, VLOOKUP($B60, 'Data Inputs'!$B$5:$H$648, 6, FALSE), \"\")","v":""},{"$f":"IF(ISNUMBER(VLOOKUP($B60, 'Data Inputs'!$B$5:$H$648, 7, FALSE))=TRUE, VLOOKUP($B60, 'Data Inputs'!$B$5:$H$648, 7, FALSE), \"\")","v":""},65,"","","",null,null,{"$f":"IF(ISNUMBER(VLOOKUP($B60, 'Data Inputs'!$B$5:$K$648, 8, FALSE))=TRUE, VLOOKUP($B60, 'Data Inputs'!$B$5:$K$648, 8, FALSE), \"\")","v":""},{"$f":"IF(ISNUMBER(VLOOKUP($B60, 'Data Inputs'!$B$5:$K$648, 9, FALSE))=TRUE, VLOOKUP($B60, 'Data Inputs'!$B$5:$K$648, 9, FALSE), \"\")","v":""},{"$f":"IF(ISNUMBER(VLOOKUP($B60, 'Data Inputs'!$B$5:$K$648, 10, FALSE))=TRUE, VLOOKUP($B60, 'Data Inputs'!$B$5:$K$648, 10, FALSE), \"\")","v":""},0,{"$f":"IF(D60=\"\", \"\",(1000000*SUM(T53:T68))/(365*'Basic Input'!$C$10*AG60))","v":""},{"$f":"IF(U60=\"\", \"\", 0.63)","v":""},{"$f":"IF('Basic Input'!$C$14=\"\",\"\",'Basic Input'!$C$14)","v":""},null,{"$f":"IF(ISNUMBER(VLOOKUP($B60, 'Data Inputs'!$B$5:$L$648, 11, FALSE))=TRUE, VLOOKUP($B60, 'Data Inputs'!$B$5:$L$648, 11, FALSE), \"\")","v":""},""]
[null,56,"",{"$f":"VLOOKUP($B61, 'Data Inputs'!$B$5:$F$648, 3, TRUE)","v":""},{"$f":"IF(D61=\"\", \"\", ROUND(VLOOKUP($C61, 'Data Inputs'!$C$5:$F$648, 3, TRUE), 2))","v":""},null,null,{"$f":"IF(ISNUMBER(VLOOKUP($B61, 'Data Inputs'!$B$5:$F$648, 5, FALSE))=TRUE, VLOOKUP($B61, 'Data Inputs'!$B$5:$F$648, 5, FALSE), \"\")","v":""},{"$f":"IF(ISNUMBER(VLOOKUP($B61, 'Data Inputs'!$B$5:$H$648, 6, FALSE))=TRUE, VLOOKUP($B61, 'Data Inputs'!$B$5:$H$648, 6, FALSE), \"\")","v":""},{"$f":"IF(ISNUMBER(VLOOKUP($B61, 'Data Inputs'!$B$5:$H$648, 7, FALSE))=TRUE, VLOOKUP($B61, 'Data Inputs'!$B$5:$H$648, 7, FALSE), \"\")","v":""},65,"","","",null,null,{"$f":"IF(ISNUMBER(VLOOKUP($B61, 'Data Inputs'!$B$5:$K$648, 8, FALSE))=TRUE, VLOOKUP($B61, 'Data Inputs'!$B$5:$K$648, 8, FALSE), \"\")","v":""},{"$f":"IF(ISNUMBER(VLOOKUP($B61, 'Data Inputs'!$B$5:$K$648, 9, FALSE))=TRUE, VLOOKUP($B61, 'Data Inputs'!$B$5:$K$648, 9, FALSE), \"\")","v":""},{"$f":"IF(ISNUMBER(VLOOKUP($B61, 'Data Inputs'!$B$5:$K$648, 10, FALSE))=TRUE, VLOOKUP($B61, 'Data Inputs'!$B$5:$K$648, 10, FALSE), \"\")","v":""},0,{"$f":"IF(D61=\"\", \"\",(1000000*SUM(T54:T69))/(365*'Basic Input'!$C$10*AG61))","v":""},"",{"$f":"IF('Basic Input'!$C$14=\"\",\"\",'Basic Input'!$C$14)","v":""},null,{"$f":"IF(ISNUMBER(VLOOKUP($B61, 'Data Inputs'!$B$5:$L$648, 11, FALSE))=TRUE, VLOOKUP($B61, 'Data Inputs'!$B$5:$L$648, 11, FALSE), \"\")","v":""},""]
[null,57,"",{"$f":"VLOOKUP($B62, 'Data Inputs'!$B$5:$F$648, 3, TRUE)","v":""},{"$f":"IF(D62=\"\", \"\", ROUND(VLOOKUP($C62, 'Data Inputs'!$C$5:$F$648, 3, TRUE), 2))","v":""},null,null,{"$f":"IF(ISNUMBER(VLOOKUP($B62, 'Data Inputs'!$B$5:$F$648, 5, FALSE))=TRUE, VLOOKUP($B62, 'Data Inputs'!$B$5:$F$648, 5, FALSE), \"\")","v":""},{"$f":"IF(ISNUMBER(VLOOKUP($B62, 'Data Inputs'!$B$5:$H$648, 6, FALSE))=TRUE, VLOOKUP($B62, 'Data Inputs'!$B$5:$H$648, 6, FALSE), \"\")","v":""},{"$f":"IF(ISNUMBER(VLOOKUP($B62, 'Data Inputs'!$B$5:$H$648, 7, FALSE))=TRUE, VLOOKUP($B62, 'Data Inputs'!$B$5:$H$648, 7, FALSE), \"\")","v":""},65,"","","",null,null,{"$f":"IF(ISNUMBER(VLOOKUP($B62, 'Data Inputs'!$B$5:$K$648, 8, FALSE))=TRUE, VLOOKUP($B62, 'Data Inputs'!$B$5:$K$648, 8, FALSE), \"\")","v":""},{"$f":"IF(ISNUMBER(VLOOKUP($B62, 'Data Inputs'!$B$5:$K$648, 9, FALSE))=TRUE, VLOOKUP($B62, 'Data Inputs'!$B$5:$K$648, 9, FALSE), \"\")","v":""},{"$f":"IF(ISNUMBER(VLOOKUP($B62, 'Data Inputs'!$B$5:$K$648, 10, FALSE))=TRUE, VLOOKUP($B62, 'Data Inputs'!$B$5:$K$648, 10, FALSE), \"\")","v":""},0,{"$f":"IF(D62=\"\", \"\",(1000000*SUM(T55:T70))/(365*'Basic Input'!$C$10*AG62))","v":""},"",{"$f":"IF('Basic Input'!$C$14=\"\",\"\",'Basic Input'!$C$14)","v":""},null,{"$f":"IF(ISNUMBER(VLOOKUP($B62, 'Data Inputs'!$B$5:$L$648, 11, FALSE))=TRUE, VLOOKUP($B62, 'Data Inputs'!$B$5:$L$648, 11, FALSE), \"\")","v":""},""]
[null,58,"",{"$f":"VLOOKUP($B63, 'Data Inputs'!$B$5:$F$648, 3, TRUE)","v":""},{"$f":"IF(D63=\"\", \"\", ROUND(VLOOKUP($C63, 'Data Inputs'!$C$5:$F$648, 3, TRUE), 2))","v":""},null,null,{"$f":"IF(ISNUMBER(VLOOKUP($B63, 'Data Inputs'!$B$5:$F$648, 5, FALSE))=TRUE, VLOOKUP($B63, 'Data Inputs'!$B$5:$F$648, 5, FALSE), \"\")","v":""},{"$f":"IF(ISNUMBER(VLOOKUP($B63, 'Data Inputs'!$B$5:$H$648, 6, FALSE))=TRUE, VLOOKUP($B63, 'Data Inputs'!$B$5:$H$648, 6, FALSE), \"\")","v":""},{"$f":"IF(ISNUMBER(VLOOKUP($B63, 'Data Inputs'!$B$5:$H$648, 7, FALSE))=TRUE, VLOOKUP($B63, 'Data Inputs'!$B$5:$H$648, 7, FALSE), \"\")","v":""},65,"","","",null,null,{"$f":"IF(ISNUMBER(VLOOKUP($B63, 'Data Inputs'!$B$5:$K$648, 8, FALSE))=TRUE, VLOOKUP($B63, 'Data Inputs'!$B$5:$K$648, 8, FALSE), \"\")","v":""},{"$f":"IF(ISNUMBER(VLOOKUP($B63, 'Data Inputs'!$B$5:$K$648, 9, FALSE))=TRUE, VLOOKUP($B63, 'Data Inputs'!$B$5:$K$648, 9, FALSE), \"\")","v":""},{"$f":"IF(ISNUMBER(VLOOKUP($B63, 'Data Inputs'!$B$5:$K$648, 10, FALSE))=TRUE, VLOOKUP($B63, 'Data Inputs'!$B$5:$K$648, 10, FALSE), \"\")","v":""},0,{"$f":"IF(D63=\"\", \"\",(1000000*SUM(T56:T71))/(365*'Basic Input'!$C$10*AG63))","v":""},"",{"$f":"IF('Basic Input'!$C$14=\"\",\"\",'Basic Input'!$C$14)","v":""},null,{"$f":"IF(ISNUMBER(VLOOKUP($B63, 'Data Inputs'!$B$5:$L$648, 11, FALSE))=TRUE, VLOOKUP($B63, 'Data Inputs'!$B$5:$L$648, 11, FALSE), \"\")","v":""},""]
[null,59,"",{"$f":"VLOOKUP($B64, 'Data Inputs'!$B$5:$F$648, 3, TRUE)","v":""},{"$f":"IF(D64=\"\", \"\", ROUND(VLOOKUP($C64, 'Data Inputs'!$C$5:$F$648, 3, TRUE), 2))","v":""},null,null,{"$f":"IF(ISNUMBER(VLOOKUP($B64, 'Data Inputs'!$B$5:$F$648, 5, FALSE))=TRUE, VLOOKUP($B64, 'Data Inputs'!$B$5:$F$648, 5, FALSE), \"\")","v":""},{"$f":"IF(ISNUMBER(VLOOKUP($B64, 'Data Inputs'!$B$5:$H$648, 6, FALSE))=TRUE, VLOOKUP($B64, 'Data Inputs'!$B$5:$H$648, 6, FALSE), \"\")","v":""},{"$f":"IF(ISNUMBER(VLOOKUP($B64, 'Data Inputs'!$B$5:$H$648, 7, FALSE))=TRUE, VLOOKUP($B64, 'Data Inputs'!$B$5:$H$648, 7, FALSE), \"\")","v":""},65,"","","",null,null,{"$f":"IF(ISNUMBER(VLOOKUP($B64, 'Data Inputs'!$B$5:$K$648, 8, FALSE))=TRUE, VLOOKUP($B64, 'Data Inputs'!$B$5:$K$648, 8, FALSE), \"\")","v":""},{"$f":"IF(ISNUMBER(VLOOKUP($B64, 'Data Inputs'!$B$5:$K$648, 9, FALSE))=TRUE, VLOOKUP($B64, 'Data Inputs'!$B$5:$K$648, 9, FALSE), \"\")","v":""},{"$f":"IF(ISNUMBER(VLOOKUP($B64, 'Data Inputs'!$B$5:$K$648, 10, FALSE))=TRUE, VLOOKUP($B64, 'Data Inputs'!$B$5:$K$648, 10, FALSE), \"\")","v":""},0,{"$f":"IF(D64=\"\", \"\",(1000000*SUM(T57:T72))/(365*'Basic Input'!$C$10*AG64))","v":""},"",{"$f":"IF('Basic Input'!$C$14=\"\",\"\",'Basic Input'!$C$14)","v":""},null,{"$f":"IF(ISNUMBER(VLOOKUP($B64, 'Data Inputs'!$B$5:$L$648, 11, FALSE))=TRUE, VLOOKUP($B64, 'Data Inputs'!$B$5:$L$648, 11, FALSE), \"\")","v":""},""]
[null,60,"",{"$f":"VLOOKUP($B65, 'Data Inputs'!$B$5:$F$648, 3, TRUE)","v":""},{"$f":"IF(D65=\"\", \"\", ROUND(VLOOKUP($C65, 'Data Inputs'!$C$5:$F$648, 3, TRUE), 2))","v":""},null,null,{"$f":"IF(ISNUMBER(VLOOKUP($B65, 'Data Inputs'!$B$5:$F$648, 5, FALSE))=TRUE, VLOOKUP($B65, 'Data Inputs'!$B$5:$F$648, 5, FALSE), \"\")","v":""},{"$f":"IF(ISNUMBER(VLOOKUP($B65, 'Data Inputs'!$B$5:$H$648, 6, FALSE))=TRUE, VLOOKUP($B65, 'Data Inputs'!$B$5:$H$648, 6, FALSE), \"\")","v":""},{"$f":"IF(ISNUMBER(VLOOKUP($B65, 'Data Inputs'!$B$5:$H$648, 7, FALSE))=TRUE, VLOOKUP($B65, 'Data Inputs'!$B$5:$H$648, 7, FALSE), \"\")","v":""},65,"","","",null,null,{"$f":"IF(ISNUMBER(VLOOKUP($B65, 'Data Inputs'!$B$5:$K$648, 8, FALSE))=TRUE, VLOOKUP($B65, 'Data Inputs'!$B$5:$K$648, 8, FALSE), \"\")","v":""},{"$f":"IF(ISNUMBER(VLOOKUP($B65, 'Data Inputs'!$B$5:$K$648, 9, FALSE))=TRUE, VLOOKUP($B65, 'Data Inputs'!$B$5:$K$648, 9, FALSE), \"\")","v":""},{"$f":"IF(ISNUMBER(VLOOKUP($B65, 'Data Inputs'!$B$5:$K$648, 10, FALSE))=TRUE, VLOOKUP($B65, 'Data Inputs'!$B$5:$K$648, 10, FALSE), \"\")","v":""},0,{"$f":"IF(D65=\"\", \"\",(1000000*SUM(T58:T73))/(365*'Basic Input'!$C$10*AG65))","v":""},"",{"$f":"IF('Basic Input'!$C$14=\"\",\"\",'Basic Input'!$C$14)","v":""},null,{"$f":"IF(ISNUMBER(VLOOKUP($B65, 'Data Inputs'!$B$5:$L$648, 11, FALSE))=TRUE, VLOOKUP($B65, 'Data Inputs'!$B$5:$L$648, 11, FALSE), \"\")","v":""},""]
[]
[]
[]
[null,null,null,null,null,null,null,null,null,null,{"$f":"MAX('Data Inputs'!$F$5:$F$206)","v":65}]
[]
[]
[null,"Land Use"]
[null,"Right",-0.03,-0.03]
[]
[]
[]
[]
[]
[]
[]
[]
[]
[]
[null,"Left",0.03,0.03]

{"sheet":"Working Data - 2","index":4,"n_rows":94,"n_cols":33,"rows_kept":94,"cut":false,"hidden":true,"merged":[]}
[null,"WORKING DATA -- DO NOT MODIFY"]
[null,null,null,null,null,null,null,null,null,null,"Speeds"]
[null,null,null,null,null,null,null,null,null,null,null,null,null,null,null,null,null,null,null,null,null,null,null,null,null,null,null,null,null,"Data Inputs",null,null,"For Interpolation"]
[null,null,"Distance (miles)","Distance (feet)","Mile Post","Key Locations",null,"Inserted Speed","85% Observed Speeds","Mean Speed","Posted Speed Limit","85th Percentile Speed","Mean Speed","85%>Posted+5mph","Data Locations",null,null,null,null,null,null,null,null,null,null,null,null,null,"Dist","85th","Mean",null,"85th"]
[null,0,{"$f":"VLOOKUP($B5, 'Data Inputs'!$B$5:$F$214, 2, TRUE)","v":-0.1893939},{"$f":"VLOOKUP($B5, 'Data Inputs'!$B$5:$F$648, 3, TRUE)","v":-1000},{"$f":"VLOOKUP($B5, 'Data Inputs'!$B$5:$F$648, 4, TRUE)","v":5.1606060606060602},null,null,{"$f":"IF(ISNUMBER(VLOOKUP($B5, 'Data Inputs'!$B$5:$F$648, 5, FALSE))=TRUE, VLOOKUP($B5, 'Data Inputs'!$B$5:$F$648, 5, FALSE), \"\")","v":""},{"$f":"IF(ISNUMBER(VLOOKUP($B5, 'Data Inputs'!$B$5:$H$648, 6, FALSE))=TRUE, VLOOKUP($B5, 'Data Inputs'!$B$5:$H$648, 6, FALSE), \"\")","v":""},{"$f":"IF(ISNUMBER(VLOOKUP($B5, 'Data Inputs'!$B$5:$H$648, 7, FALSE))=TRUE, VLOOKUP($B5, 'Data Inputs'!$B$5:$H$648, 7, FALSE), \"\")","v":""},{"$f":"MIN('Data Inputs'!$F$5:$F$206)","v":30},{"$f":"IF($D5=\"\",\"\",(IF($D5<=$AC$5,$AG$5,IF($D5=$AC$6,$AG$6,IF($D5=$AC$7,$AG$7,IF($D5=$AC$8,$AG$8,IF(AND($AB$6=\"N\",$D5>$AC$5)=TRUE,$AG$5,IF(AND($AB$7=\"N\",$D5>$AC$6)=TRUE,$AG$6,IF(AND($AB$8=\"N\",$D5>$AC$7)=TRUE,$AG$7,IF(AND($AB$9=\"N\",$D5>$AC$8)=TRUE,$AG$8,IF($AB$6=\"Y\",IF(AND($D5>$AC$5,$D5<$AC$6)=TRUE,(($D5-$AC$5)/($AC$5-$AC$6)*(AG$5-AG$6))+MIN(AG$6,AG$5),IF($AB$7=\"Y\",IF(AND($D5>$AC$6,$D5<$AC$7)=TRUE,(($D5-$AC$6)/($AC$6-$AC$7)*(AG$6-AG$7))+MIN(AG$7,AG$6),IF($AB$8=\"Y\",IF(AND($D5>$AC$7,$D5<$AC$8)=TRUE,(($D5-$AC$7)/($AC$7-$AC$8)*(AG$7-AG$8))+MIN(AG$8,AG$7),IF($AB$9=\"Y\",IF(AND($D5>$AC$8,$D5<$AC$9)=TRUE,(($D5-$AC$8)/($AC$8-$AC$9)*(AG$8-AG$9))+MIN(AG$9,AG$8),IF($D5>=$AC$9,$AG$9,\"\")))))))))))))))))))","v":34},{"$f":"IF($D5=\"\",\"\",(IF($D5<=$AC$5,$AE$5,IF($D5=$AC$6,$AE$6,IF($D5=$AC$7,$AE$7,IF($D5=$AC$8,$AE$8,IF(AND($AB$6=\"N\",$D5>$AC$5)=TRUE,$AE$5,IF(AND($AB$7=\"N\",$D5>$AC$6)=TRUE,$AE$6,IF(AND($AB$8=\"N\",$D5>$AC$7)=TRUE,$AE$7,IF(AND($AB$9=\"N\",$D5>$AC$8)=TRUE,$AE$8,IF($AB$6=\"Y\",IF(AND($D5>$AC$5,$D5<$AC$6)=TRUE,(($D5-$AC$5)/($AC$5-$AC$6)*(AE$5-AE$6))+MIN(AE$6,AE$5),IF($AB$7=\"Y\",IF(AND($D5>$AC$6,$D5<$AC$7)=TRUE,(($D5-$AC$6)/($AC$6-$AC$7)*(AE$6-AE$7))+MIN(AE$7,AE$6),IF($AB$8=\"Y\",IF(AND($D5>$AC$7,$D5<$AC$8)=TRUE,(($D5-$AC$7)/($AC$7-$AC$8)*(AE$7-AE$8))+MIN(AE$8,AE$7),IF($AB$9=\"Y\",IF(AND($D5>$AC$8,$D5<$AC$9)=TRUE,(($D5-$AC$8)/($AC$8-$AC$9)*(AE$8-AE$9))+MIN(AE$9,AE$8),IF($D5>=$AC$9,$AE$9,\"\")))))))))))))))))))","v":30},{"$f":"IF($D5=\"\", \"\", IF(L5>(K5+5),15,NA()))","v":{"$error":"#N/A"}},null,null,null,null,null,null,null,null,null,null,null,null,1,{"$f":"IF(ISNUMBER(AC5)=TRUE, \"Y\", \"N\")","v":"Y"},{"$f":"IF(ISNUMBER(VLOOKUP($AA5, 'Data Inputs'!$A$5:$H$206, 4, FALSE)), VLOOKUP($AA5, 'Data Inputs'!$A$5:$H$206, 4, FALSE), \"\")","v":100},{"$f":"IF(ISNUMBER(VLOOKUP($AA5, 'Data Inputs'!$A$5:$H$206, 7, FALSE)), VLOOKUP($AA5, 'Data Inputs'!$A$5:$H$206, 7, FALSE), \"\")","v":34},{"$f":"IF(ISNUMBER(VLOOKUP($AA5, 'Data Inputs'!$A$5:$H$206, 8, FALSE)), VLOOKUP($AA5, 'Data Inputs'!$A$5:$H$206, 8, FALSE), \"\")","v":30},null,{"$f":"IF(ISNUMBER(VLOOKUP($AA5, 'Data Inputs'!$A$5:$H$206, 7, FALSE)), VLOOKUP($AA5, 'Data Inputs'!$A$5:$H$206, 7, FALSE), \"\")","v":34}]
[null,1,{"$f":"VLOOKUP($B6, 'Data Inputs'!$B$5:$F$214, 2, TRUE)","v":-0.17045451},{"$f":"VLOOKUP($B6, 'Data Inputs'!$B$5:$F$648, 3, TRUE)","v":-900},{"$f":"VLOOKUP($B6, 'Data Inputs'!$B$5:$F$648, 4, TRUE)","v":5.1795454545454538},null,null,{"$f":"IF(ISNUMBER(VLOOKUP($B6, 'Data Inputs'!$B$5:$F$648, 5, FALSE))=TRUE, VLOOKUP($B6, 'Data Inputs'!$B$5:$F$648, 5, FALSE), \"\")","v":""},{"$f":"IF(ISNUMBER(VLOOKUP($B6, 'Data Inputs'!$B$5:$H$648, 6, FALSE))=TRUE, VLOOKUP($B6, 'Data Inputs'!$B$5:$H$648, 6, FALSE), \"\")","v":""},{"$f":"IF(ISNUMBER(VLOOKUP($B6, 'Data Inputs'!$B$5:$H$648, 7, FALSE))=TRUE, VLOOKUP($B6, 'Data Inputs'!$B$5:$H$648, 7, FALSE), \"\")","v":""},{"$f":"IF(D6=\"\", $K$69, IF(H6<>\"\", H6, K7))","v":30},{"$f":"IF($D6=\"\",\"\",(IF($D6<=$AC$5,$AG$5,IF($D6=$AC$6,$AG$6,IF($D6=$AC$7,$AG$7,IF($D6=$AC$8,$AG$8,IF(AND($AB$6=\"N\",$D6>$AC$5)=TRUE,$AG$5,IF(AND($AB$7=\"N\",$D6>$AC$6)=TRUE,$AG$6,IF(AND($AB$8=\"N\",$D6>$AC$7)=TRUE,$AG$7,IF(AND($AB$9=\"N\",$D6>$AC$8)=TRUE,$AG$8,IF($AB$6=\"Y\",IF(AND($D6>$AC$5,$D6<$AC$6)=TRUE,(($D6-$AC$5)/($AC$5-$AC$6)*(AG$5-AG$6))+MIN(AG$6,AG$5),IF($AB$7=\"Y\",IF(AND($D6>$AC$6,$D6<$AC$7)=TRUE,(($D6-$AC$6)/($AC$6-$AC$7)*(AG$6-AG$7))+MIN(AG$7,AG$6),IF($AB$8=\"Y\",IF(AND($D6>$AC$7,$D6<$AC$8)=TRUE,(($D6-$AC$7)/($AC$7-$AC$8)*(AG$7-AG$8))+MIN(AG$8,AG$7),IF($AB$9=\"Y\",IF(AND($D6>$AC$8,$D6<$AC$9)=TRUE,(($D6-$AC$8)/($AC$8-$AC$9)*(AG$8-AG$9))+MIN(AG$9,AG$8),IF($D6>=$AC$9,$AG$9,\"\")))))))))))))))))))","v":34},{"$f":"IF($D6=\"\",\"\",(IF($D6<=$AC$5,$AE$5,IF($D6=$AC$6,$AE$6,IF($D6=$AC$7,$AE$7,IF($D6=$AC$8,$AE$8,IF(AND($AB$6=\"N\",$D6>$AC$5)=TRUE,$AE$5,IF(AND($AB$7=\"N\",$D6>$AC$6)=TRUE,$AE$6,IF(AND($AB$8=\"N\",$D6>$AC$7)=TRUE,$AE$7,IF(AND($AB$9=\"N\",$D6>$AC$8)=TRUE,$AE$8,IF($AB$6=\"Y\",IF(AND($D6>$AC$5,$D6<$AC$6)=TRUE,(($D6-$AC$5)/($AC$5-$AC$6)*(AE$5-AE$6))+MIN(AE$6,AE$5),IF($AB$7=\"Y\",IF(AND($D6>$AC$6,$D6<$AC$7)=TRUE,(($D6-$AC$6)/($AC$6-$AC$7)*(AE$6-AE$7))+MIN(AE$7,AE$6),IF($AB$8=\"Y\",IF(AND($D6>$AC$7,$D6<$AC$8)=TRUE,(($D6-$AC$7)/($AC$7-$AC$8)*(AE$7-AE$8))+MIN(AE$8,AE$7),IF($AB$9=\"Y\",IF(AND($D6>$AC$8,$D6<$AC$9)=TRUE,(($D6-$AC$8)/($AC$8-$AC$9)*(AE$8-AE$9))+MIN(AE$9,AE$8),IF($D6>=$AC$9,$AE$9,\"\")))))))))))))))))))","v":30},{"$f":"IF($D6=\"\", \"\", IF(L6>(K6+5),15,NA()))","v":{"$error":"#N/A"}},null,null,null,null,null,null,null,null,null,null,null,null,2,{"$f":"IF(ISNUMBER(AC6)=TRUE, \"Y\", \"N\")","v":"Y"},{"$f":"IF(ISNUMBER(VLOOKUP($AA6, 'Data Inputs'!$A$5:$H$206, 4, FALSE)), VLOOKUP($AA6, 'Data Inputs'!$A$5:$H$206, 4, FALSE), \"\")","v":500},{"$f":"IF(ISNUMBER(VLOOKUP($AA6, 'Data Inputs'!$A$5:$H$206, 7, FALSE)), VLOOKUP($AA6, 'Data Inputs'!$A$5:$H$206, 7, FALSE), \"\")","v":38},{"$f":"IF(ISNUMBER(VLOOKUP($AA6, 'Data Inputs'!$A$5:$H$206, 8, FALSE)), VLOOKUP($AA6, 'Data Inputs'!$A$5:$H$206, 8, FALSE), \"\")","v":33},null,{"$f":"IF(ISNUMBER(VLOOKUP($AA6,'Data Inputs'!$A$5:$H$206,7,FALSE)),VLOOKUP($AA6,'Data Inputs'!$A$5:$H$206,7,FALSE),IF(ISNUMBER(AE6),((AC6-AC5)/(AC5-MAX(AC7:AC9)))*(AG5-MIN(AD7:AD9))+AG5))","v":38}]
[null,2,{"$f":"VLOOKUP($B7, 'Data Inputs'!$B$5:$F$214, 2, TRUE)","v":-0.15151512},{"$f":"VLOOKUP($B7, 'Data Inputs'!$B$5:$F$648, 3, TRUE)","v":-800},{"$f":"VLOOKUP($B7, 'Data Inputs'!$B$5:$F$648, 4, TRUE)","v":5.1984848484848483},null,null,{"$f":"IF(ISNUMBER(VLOOKUP($B7, 'Data Inputs'!$B$5:$F$648, 5, FALSE))=TRUE, VLOOKUP($B7, 'Data Inputs'!$B$5:$F$648, 5, FALSE), \"\")","v":""},{"$f":"IF(ISNUMBER(VLOOKUP($B7, 'Data Inputs'!$B$5:$H$648, 6, FALSE))=TRUE, VLOOKUP($B7, 'Data Inputs'!$B$5:$H$648, 6, FALSE), \"\")","v":""},{"$f":"IF(ISNUMBER(VLOOKUP($B7, 'Data Inputs'!$B$5:$H$648, 7, FALSE))=TRUE, VLOOKUP($B7, 'Data Inputs'!$B$5:$H$648, 7, FALSE), \"\")","v":""},{"$f":"IF(D7=\"\", $K$69, IF(H7<>\"\", H7, K8))","v":30},34,30,{"$error":"#N/A"},null,null,null,null,null,null,null,null,null,null,null,null,3,"Y",{"$f":"IF(ISNUMBER(VLOOKUP($AA7, 'Data Inputs'!$A$5:$H$206, 4, FALSE)), VLOOKUP($AA7, 'Data Inputs'!$A$5:$H$206, 4, FALSE), \"\")","v":1200},{"$f":"IF(ISNUMBER(VLOOKUP($AA7, 'Data Inputs'!$A$5:$H$206, 7, FALSE)), VLOOKUP($AA7, 'Data Inputs'!$A$5:$H$206, 7, FALSE), \"\")","v":""},{"$f":"IF(ISNUMBER(VLOOKUP($AA7, 'Data Inputs'!$A$5:$H$206, 8, FALSE)), VLOOKUP($AA7, 'Data Inputs'!$A$5:$H$206, 8, FALSE), \"\")","v":42.071199999999997},null,{"$f":"IF(ISNUMBER(VLOOKUP($AA7,'Data Inputs'!$A$5:$H$206,7,FALSE)),VLOOKUP($AA7,'Data Inputs'!$A$5:$H$206,7,FALSE),IF(ISNUMBER(AE7),((AC7-AC6)/(AC6-MAX(AC8:AC10)))*(AG6-MIN(AD8:AD10))+AG6))","v":47.1}]
[null,3,{"$f":"VLOOKUP($B8, 'Data Inputs'!$B$5:$F$214, 2, TRUE)","v":-0.13257573},{"$f":"VLOOKUP($B8, 'Data Inputs'!$B$5:$F$648, 3, TRUE)","v":-700},{"$f":"VLOOKUP($B8, 'Data Inputs'!$B$5:$F$648, 4, TRUE)","v":5.2174242424242419},null,null,{"$f":"IF(ISNUMBER(VLOOKUP($B8, 'Data Inputs'!$B$5:$F$648, 5, FALSE))=TRUE, VLOOKUP($B8, 'Data Inputs'!$B$5:$F$648, 5, FALSE), \"\")","v":""},{"$f":"IF(ISNUMBER(VLOOKUP($B8, 'Data Inputs'!$B$5:$H$648, 6, FALSE))=TRUE, VLOOKUP($B8, 'Data Inputs'!$B$5:$H$648, 6, FALSE), \"\")","v":""},{"$f":"IF(ISNUMBER(VLOOKUP($B8, 'Data Inputs'!$B$5:$H$648, 7, FALSE))=TRUE, VLOOKUP($B8, 'Data Inputs'!$B$5:$H$648, 7, FALSE), \"\")","v":""},30,34,{"$f":"IF($D8=\"\",\"\",(IF($D8<=$AC$5,$AE$5,IF($D8=$AC$6,$AE$6,IF($D8=$AC$7,$AE$7,IF($D8=$AC$8,$AE$8,IF(AND($AB$6=\"N\",$D8>$AC$5)=TRUE,$AE$5,IF(AND($AB$7=\"N\",$D8>$AC$6)=TRUE,$AE$6,IF(AND($AB$8=\"N\",$D8>$AC$7)=TRUE,$AE$7,IF(AND($AB$9=\"N\",$D8>$AC$8)=TRUE,$AE$8,IF($AB$6=\"Y\",IF(AND($D8>$AC$5,$D8<$AC$6)=TRUE,(($D8-$AC$5)/($AC$5-$AC$6)*(AE$5-AE$6))+MIN(AE$6,AE$5),IF($AB$7=\"Y\",IF(AND($D8>$AC$6,$D8<$AC$7)=TRUE,(($D8-$AC$6)/($AC$6-$AC$7)*(AE$6-AE$7))+MIN(AE$7,AE$6),IF($AB$8=\"Y\",IF(AND($D8>$AC$7,$D8<$AC$8)=TRUE,(($D8-$AC$7)/($AC$7-$AC$8)*(AE$7-AE$8))+MIN(AE$8,AE$7),IF($AB$9=\"Y\",IF(AND($D8>$AC$8,$D8<$AC$9)=TRUE,(($D8-$AC$8)/($AC$8-$AC$9)*(AE$8-AE$9))+MIN(AE$9,AE$8),IF($D8>=$AC$9,$AE$9,\"\")))))))))))))))))))","v":30},{"$error":"#N/A"},null,null,null,null,null,null,null,null,null,null,null,null,4,"Y",{"$f":"IF(ISNUMBER(VLOOKUP($AA8, 'Data Inputs'!$A$5:$H$206, 4, FALSE)), VLOOKUP($AA8, 'Data Inputs'!$A$5:$H$206, 4, FALSE), \"\")","v":1600},{"$f":"IF(ISNUMBER(VLOOKUP($AA8, 'Data Inputs'!$A$5:$H$206, 7, FALSE)), VLOOKUP($AA8, 'Data Inputs'!$A$5:$H$206, 7, FALSE), \"\")","v":""},{"$f":"IF(ISNUMBER(VLOOKUP($AA8, 'Data Inputs'!$A$5:$H$206, 8, FALSE)), VLOOKUP($AA8, 'Data Inputs'!$A$5:$H$206, 8, FALSE), \"\")","v":48.978700000000003},null,{"$f":"IF(ISNUMBER(VLOOKUP($AA8,'Data Inputs'!$A$5:$H$206,7,FALSE)),VLOOKUP($AA8,'Data Inputs'!$A$5:$H$206,7,FALSE),IF(ISNUMBER(AE8),((AC8-AC7)/(AC7-MAX(AC9:AC11)))*(AG7-MIN(AD9:AD11))+AG7))","v":52.300000000000004}]
[null,4,{"$f":"VLOOKUP($B9, 'Data Inputs'!$B$5:$F$214, 2, TRUE)","v":-0.11363634},{"$f":"VLOOKUP($B9, 'Data Inputs'!$B$5:$F$648, 3, TRUE)","v":-600},{"$f":"VLOOKUP($B9, 'Data Inputs'!$B$5:$F$648, 4, TRUE)","v":5.2363636363636363},null,null,{"$f":"IF(ISNUMBER(VLOOKUP($B9, 'Data Inputs'!$B$5:$F$648, 5, FALSE))=TRUE, VLOOKUP($B9, 'Data Inputs'!$B$5:$F$648, 5, FALSE), \"\")","v":""},{"$f":"IF(ISNUMBER(VLOOKUP($B9, 'Data Inputs'!$B$5:$H$648, 6, FALSE))=TRUE, VLOOKUP($B9, 'Data Inputs'!$B$5:$H$648, 6, FALSE), \"\")","v":""},{"$f":"IF(ISNUMBER(VLOOKUP($B9, 'Data Inputs'!$B$5:$H$648, 7, FALSE))=TRUE, VLOOKUP($B9, 'Data Inputs'!$B$5:$H$648, 7, FALSE), \"\")","v":""},30,34,30,{"$error":"#N/A"},null,null,null,null,null,null,null,null,null,null,null,null,5,"Y",{"$f":"IF(ISNUMBER(VLOOKUP($AA9, 'Data Inputs'!$A$5:$H$206, 4, FALSE)), VLOOKUP($AA9, 'Data Inputs'!$A$5:$H$206, 4, FALSE), \"\")","v":2500},{"$f":"IF(ISNUMBER(VLOOKUP($AA9, 'Data Inputs'!$A$5:$H$206, 7, FALSE)), VLOOKUP($AA9, 'Data Inputs'!$A$5:$H$206, 7, FALSE), \"\")","v":64},{"$f":"IF(ISNUMBER(VLOOKUP($AA9, 'Data Inputs'!$A$5:$H$206, 8, FALSE)), VLOOKUP($AA9, 'Data Inputs'!$A$5:$H$206, 8, FALSE), \"\")","v":58},null,{"$f":"IF(ISNUMBER(VLOOKUP($AA9,'Data Inputs'!$A$5:$H$206,7,FALSE)),VLOOKUP($AA9,'Data Inputs'!$A$5:$H$206,7,FALSE),IF(ISNUMBER(AE9),((AC9-AC8)/(AC8-MAX(AC10:AC12)))*(AG8-MIN(AD10:AD12))+AG8))","v":64}]
[null,5,{"$f":"VLOOKUP($B10, 'Data Inputs'!$B$5:$F$214, 2, TRUE)","v":-9.4696950000000002E-2},{"$f":"VLOOKUP($B10, 'Data Inputs'!$B$5:$F$648, 3, TRUE)","v":-500},{"$f":"VLOOKUP($B10, 'Data Inputs'!$B$5:$F$648, 4, TRUE)","v":5.2553030303030299},null,null,{"$f":"IF(ISNUMBER(VLOOKUP($B10, 'Data Inputs'!$B$5:$F$648, 5, FALSE))=TRUE, VLOOKUP($B10, 'Data Inputs'!$B$5:$F$648, 5, FALSE), \"\")","v":""},{"$f":"IF(ISNUMBER(VLOOKUP($B10, 'Data Inputs'!$B$5:$H$648, 6, FALSE))=TRUE, VLOOKUP($B10, 'Data Inputs'!$B$5:$H$648, 6, FALSE), \"\")","v":""},{"$f":"IF(ISNUMBER(VLOOKUP($B10, 'Data Inputs'!$B$5:$H$648, 7, FALSE))=TRUE, VLOOKUP($B10, 'Data Inputs'!$B$5:$H$648, 7, FALSE), \"\")","v":""},30,34,30,{"$error":"#N/A"}]
[null,6,{"$f":"VLOOKUP($B11, 'Data Inputs'!$B$5:$F$214, 2, TRUE)","v":-7.5757560000000002E-2},{"$f":"VLOOKUP($B11, 'Data Inputs'!$B$5:$F$648, 3, TRUE)","v":-400},{"$f":"VLOOKUP($B11, 'Data Inputs'!$B$5:$F$648, 4, TRUE)","v":5.2742424242424235},null,null,{"$f":"IF(ISNUMBER(VLOOKUP($B11, 'Data Inputs'!$B$5:$F$648, 5, FALSE))=TRUE, VLOOKUP($B11, 'Data Inputs'!$B$5:$F$648, 5, FALSE), \"\")","v":""},{"$f":"IF(ISNUMBER(VLOOKUP($B11, 'Data Inputs'!$B$5:$H$648, 6, FALSE))=TRUE, VLOOKUP($B11, 'Data Inputs'!$B$5:$H$648, 6, FALSE), \"\")","v":""},{"$f":"IF(ISNUMBER(VLOOKUP($B11, 'Data Inputs'!$B$5:$H$648, 7, FALSE))=TRUE, VLOOKUP($B11, 'Data Inputs'!$B$5:$H$648, 7, FALSE), \"\")","v":""},30,34,30,{"$error":"#N/A"}]
[null,7,{"$f":"VLOOKUP($B12, 'Data Inputs'!$B$5:$F$214, 2, TRUE)","v":-5.6818170000000001E-2},{"$f":"VLOOKUP($B12, 'Data Inputs'!$B$5:$F$648, 3, TRUE)","v":-300},{"$f":"VLOOKUP($B12, 'Data Inputs'!$B$5:$F$648, 4, TRUE)","v":5.293181818181818},null,null,{"$f":"IF(ISNUMBER(VLOOKUP($B12, 'Data Inputs'!$B$5:$F$648, 5, FALSE))=TRUE, VLOOKUP($B12, 'Data Inputs'!$B$5:$F$648, 5, FALSE), \"\")","v":""},{"$f":"IF(ISNUMBER(VLOOKUP($B12, 'Data Inputs'!$B$5:$H$648, 6, FALSE))=TRUE, VLOOKUP($B12, 'Data Inputs'!$B$5:$H$648, 6, FALSE), \"\")","v":""},{"$f":"IF(ISNUMBER(VLOOKUP($B12, 'Data Inputs'!$B$5:$H$648, 7, FALSE))=TRUE, VLOOKUP($B12, 'Data Inputs'!$B$5:$H$648, 7, FALSE), \"\")","v":""},30,34,30,{"$f":"IF($D12=\"\", \"\", IF(L12>(K12+5),15,NA()))","v":{"$error":"#N/A"}}]
[null,8,{"$f":"VLOOKUP($B13, 'Data Inputs'!$B$5:$F$214, 2, TRUE)","v":-3.7878780000000001E-2},{"$f":"VLOOKUP($B13, 'Data Inputs'!$B$5:$F$648, 3, TRUE)","v":-200},{"$f":"VLOOKUP($B13, 'Data Inputs'!$B$5:$F$648, 4, TRUE)","v":5.3121212121212116},null,null,{"$f":"IF(ISNUMBER(VLOOKUP($B13, 'Data Inputs'!$B$5:$F$648, 5, FALSE))=TRUE, VLOOKUP($B13, 'Data Inputs'!$B$5:$F$648, 5, FALSE), \"\")","v":""},{"$f":"IF(ISNUMBER(VLOOKUP($B13, 'Data Inputs'!$B$5:$H$648, 6, FALSE))=TRUE, VLOOKUP($B13, 'Data Inputs'!$B$5:$H$648, 6, FALSE), \"\")","v":""},{"$f":"IF(ISNUMBER(VLOOKUP($B13, 'Data Inputs'!$B$5:$H$648, 7, FALSE))=TRUE, VLOOKUP($B13, 'Data Inputs'!$B$5:$H$648, 7, FALSE), \"\")","v":""},30,34,30,{"$error":"#N/A"}]
[null,9,{"$f":"VLOOKUP($B14, 'Data Inputs'!$B$5:$F$214, 2, TRUE)","v":-1.893939E-2},{"$f":"VLOOKUP($B14, 'Data Inputs'!$B$5:$F$648, 3, TRUE)","v":-100},{"$f":"VLOOKUP($B14, 'Data Inputs'!$B$5:$F$648, 4, TRUE)","v":5.3310606060606061},null,null,{"$f":"IF(ISNUMBER(VLOOKUP($B14, 'Data Inputs'!$B$5:$F$648, 5, FALSE))=TRUE, VLOOKUP($B14, 'Data Inputs'!$B$5:$F$648, 5, FALSE), \"\")","v":""},{"$f":"IF(ISNUMBER(VLOOKUP($B14, 'Data Inputs'!$B$5:$H$648, 6, FALSE))=TRUE, VLOOKUP($B14, 'Data Inputs'!$B$5:$H$648, 6, FALSE), \"\")","v":""},{"$f":"IF(ISNUMBER(VLOOKUP($B14, 'Data Inputs'!$B$5:$H$648, 7, FALSE))=TRUE, VLOOKUP($B14, 'Data Inputs'!$B$5:$H$648, 7, FALSE), \"\")","v":""},30,34,30,{"$error":"#N/A"}]
[null,10,{"$f":"VLOOKUP($B15, 'Data Inputs'!$B$5:$F$214, 2, TRUE)","v":0},{"$f":"VLOOKUP($B15, 'Data Inputs'!$B$5:$F$648, 3, TRUE)","v":0},{"$f":"VLOOKUP($B15, 'Data Inputs'!$B$5:$F$648, 4, TRUE)","v":5.35},null,null,{"$f":"IF(ISNUMBER(VLOOKUP($B15, 'Data Inputs'!$B$5:$F$648, 5, FALSE))=TRUE, VLOOKUP($B15, 'Data Inputs'!$B$5:$F$648, 5, FALSE), \"\")","v":""},{"$f":"IF(ISNUMBER(VLOOKUP($B15, 'Data Inputs'!$B$5:$H$648, 6, FALSE))=TRUE, VLOOKUP($B15, 'Data Inputs'!$B$5:$H$648, 6, FALSE), \"\")","v":""},{"$f":"IF(ISNUMBER(VLOOKUP($B15, 'Data Inputs'!$B$5:$H$648, 7, FALSE))=TRUE, VLOOKUP($B15, 'Data Inputs'!$B$5:$H$648, 7, FALSE), \"\")","v":""},30,34,30,{"$error":"#N/A"}]
[null,11,{"$f":"VLOOKUP($B16, 'Data Inputs'!$B$5:$F$214, 2, TRUE)","v":1.893939E-2},{"$f":"VLOOKUP($B16, 'Data Inputs'!$B$5:$F$648, 3, TRUE)","v":100},{"$f":"VLOOKUP($B16, 'Data Inputs'!$B$5:$F$648, 4, TRUE)","v":5.3689393939393932},null,null,{"$f":"IF(ISNUMBER(VLOOKUP($B16, 'Data Inputs'!$B$5:$F$648, 5, FALSE))=TRUE, VLOOKUP($B16, 'Data Inputs'!$B$5:$F$648, 5, FALSE), \"\")","v":""},{"$f":"IF(ISNUMBER(VLOOKUP($B16, 'Data Inputs'!$B$5:$H$648, 6, FALSE))=TRUE, VLOOKUP($B16, 'Data Inputs'!$B$5:$H$648, 6, FALSE), \"\")","v":34},{"$f":"IF(ISNUMBER(VLOOKUP($B16, 'Data Inputs'!$B$5:$H$648, 7, FALSE))=TRUE, VLOOKUP($B16, 'Data Inputs'!$B$5:$H$648, 7, FALSE), \"\")","v":30},30,34,30,{"$error":"#N/A"}]
[null,12,{"$f":"VLOOKUP($B17, 'Data Inputs'!$B$5:$F$214, 2, TRUE)","v":3.7878780000000001E-2},{"$f":"VLOOKUP($B17, 'Data Inputs'!$B$5:$F$648, 3, TRUE)","v":200},{"$f":"VLOOKUP($B17, 'Data Inputs'!$B$5:$F$648, 4, TRUE)","v":5.3878787878787877},null,null,{"$f":"IF(ISNUMBER(VLOOKUP($B17, 'Data Inputs'!$B$5:$F$648, 5, FALSE))=TRUE, VLOOKUP($B17, 'Data Inputs'!$B$5:$F$648, 5, FALSE), \"\")","v":""},{"$f":"IF(ISNUMBER(VLOOKUP($B17, 'Data Inputs'!$B$5:$H$648, 6, FALSE))=TRUE, VLOOKUP($B17, 'Data Inputs'!$B$5:$H$648, 6, FALSE), \"\")","v":""},{"$f":"IF(ISNUMBER(VLOOKUP($B17, 'Data Inputs'!$B$5:$H$648, 7, FALSE))=TRUE, VLOOKUP($B17, 'Data Inputs'!$B$5:$H$648, 7, FALSE), \"\")","v":""},30,35,30.75,{"$error":"#N/A"}]
[null,13,{"$f":"VLOOKUP($B18, 'Data Inputs'!$B$5:$F$214, 2, TRUE)","v":5.6818170000000001E-2},{"$f":"VLOOKUP($B18, 'Data Inputs'!$B$5:$F$648, 3, TRUE)","v":300},{"$f":"VLOOKUP($B18, 'Data Inputs'!$B$5:$F$648, 4, TRUE)","v":5.4068181818181813},null,null,{"$f":"IF(ISNUMBER(VLOOKUP($B18, 'Data Inputs'!$B$5:$F$648, 5, FALSE))=TRUE, VLOOKUP($B18, 'Data Inputs'!$B$5:$F$648, 5, FALSE), \"\")","v":""},{"$f":"IF(ISNUMBER(VLOOKUP($B18, 'Data Inputs'!$B$5:$H$648, 6, FALSE))=TRUE, VLOOKUP($B18, 'Data Inputs'!$B$5:$H$648, 6, FALSE), \"\")","v":""},{"$f":"IF(ISNUMBER(VLOOKUP($B18, 'Data Inputs'!$B$5:$H$648, 7, FALSE))=TRUE, VLOOKUP($B18, 'Data Inputs'!$B$5:$H$648, 7, FALSE), \"\")","v":""},30,36,31.5,15]
[null,14,{"$f":"VLOOKUP($B19, 'Data Inputs'!$B$5:$F$214, 2, TRUE)","v":7.5757560000000002E-2},{"$f":"VLOOKUP($B19, 'Data Inputs'!$B$5:$F$648, 3, TRUE)","v":400},{"$f":"VLOOKUP($B19, 'Data Inputs'!$B$5:$F$648, 4, TRUE)","v":5.4257575757575758},null,null,{"$f":"IF(ISNUMBER(VLOOKUP($B19, 'Data Inputs'!$B$5:$F$648, 5, FALSE))=TRUE, VLOOKUP($B19, 'Data Inputs'!$B$5:$F$648, 5, FALSE), \"\")","v":""},{"$f":"IF(ISNUMBER(VLOOKUP($B19, 'Data Inputs'!$B$5:$H$648, 6, FALSE))=TRUE, VLOOKUP($B19, 'Data Inputs'!$B$5:$H$648, 6, FALSE), \"\")","v":""},{"$f":"IF(ISNUMBER(VLOOKUP($B19, 'Data Inputs'!$B$5:$H$648, 7, FALSE))=TRUE, VLOOKUP($B19, 'Data Inputs'!$B$5:$H$648, 7, FALSE), \"\")","v":""},30,37,32.25,15]
[null,15,{"$f":"VLOOKUP($B20, 'Data Inputs'!$B$5:$F$214, 2, TRUE)","v":9.4696950000000002E-2},{"$f":"VLOOKUP($B20, 'Data Inputs'!$B$5:$F$648, 3, TRUE)","v":500},{"$f":"VLOOKUP($B20, 'Data Inputs'!$B$5:$F$648, 4, TRUE)","v":5.4446969696969694},null,null,{"$f":"IF(ISNUMBER(VLOOKUP($B20, 'Data Inputs'!$B$5:$F$648, 5, FALSE))=TRUE, VLOOKUP($B20, 'Data Inputs'!$B$5:$F$648, 5, FALSE), \"\")","v":""},{"$f":"IF(ISNUMBER(VLOOKUP($B20, 'Data Inputs'!$B$5:$H$648, 6, FALSE))=TRUE, VLOOKUP($B20, 'Data Inputs'!$B$5:$H$648, 6, FALSE), \"\")","v":38},{"$f":"IF(ISNUMBER(VLOOKUP($B20, 'Data Inputs'!$B$5:$H$648, 7, FALSE))=TRUE, VLOOKUP($B20, 'Data Inputs'!$B$5:$H$648, 7, FALSE), \"\")","v":33},30,38,{"$f":"IF($D20=\"\",\"\",(IF($D20<=$AC$5,$AE$5,IF($D20=$AC$6,$AE$6,IF($D20=$AC$7,$AE$7,IF($D20=$AC$8,$AE$8,IF(AND($AB$6=\"N\",$D20>$AC$5)=TRUE,$AE$5,IF(AND($AB$7=\"N\",$D20>$AC$6)=TRUE,$AE$6,IF(AND($AB$8=\"N\",$D20>$AC$7)=TRUE,$AE$7,IF(AND($AB$9=\"N\",$D20>$AC$8)=TRUE,$AE$8,IF($AB$6=\"Y\",IF(AND($D20>$AC$5,$D20<$AC$6)=TRUE,(($D20-$AC$5)/($AC$5-$AC$6)*(AE$5-AE$6))+MIN(AE$6,AE$5),IF($AB$7=\"Y\",IF(AND($D20>$AC$6,$D20<$AC$7)=TRUE,(($D20-$AC$6)/($AC$6-$AC$7)*(AE$6-AE$7))+MIN(AE$7,AE$6),IF($AB$8=\"Y\",IF(AND($D20>$AC$7,$D20<$AC$8)=TRUE,(($D20-$AC$7)/($AC$7-$AC$8)*(AE$7-AE$8))+MIN(AE$8,AE$7),IF($AB$9=\"Y\",IF(AND($D20>$AC$8,$D20<$AC$9)=TRUE,(($D20-$AC$8)/($AC$8-$AC$9)*(AE$8-AE$9))+MIN(AE$9,AE$8),IF($D20>=$AC$9,$AE$9,\"\")))))))))))))))))))","v":33},15]
[null,16,{"$f":"VLOOKUP($B21, 'Data Inputs'!$B$5:$F$214, 2, TRUE)","v":0.11363634},{"$f":"VLOOKUP($B21, 'Data Inputs'!$B$5:$F$648, 3, TRUE)","v":600},{"$f":"VLOOKUP($B21, 'Data Inputs'!$B$5:$F$648, 4, TRUE)","v":5.463636363636363},null,null,{"$f":"IF(ISNUMBER(VLOOKUP($B21, 'Data Inputs'!$B$5:$F$648, 5, FALSE))=TRUE, VLOOKUP($B21, 'Data Inputs'!$B$5:$F$648, 5, FALSE), \"\")","v":""},{"$f":"IF(ISNUMBER(VLOOKUP($B21, 'Data Inputs'!$B$5:$H$648, 6, FALSE))=TRUE, VLOOKUP($B21, 'Data Inputs'!$B$5:$H$648, 6, FALSE), \"\")","v":""},{"$f":"IF(ISNUMBER(VLOOKUP($B21, 'Data Inputs'!$B$5:$H$648, 7, FALSE))=TRUE, VLOOKUP($B21, 'Data Inputs'!$B$5:$H$648, 7, FALSE), \"\")","v":""},30,39.299999999999997,34.295885714285717,15]
[null,17,{"$f":"VLOOKUP($B22, 'Data Inputs'!$B$5:$F$214, 2, TRUE)","v":0.13257573},{"$f":"VLOOKUP($B22, 'Data Inputs'!$B$5:$F$648, 3, TRUE)","v":700},{"$f":"VLOOKUP($B22, 'Data Inputs'!$B$5:$F$648, 4, TRUE)","v":5.4825757575757574},null,null,{"$f":"IF(ISNUMBER(VLOOKUP($B22, 'Data Inputs'!$B$5:$F$648, 5, FALSE))=TRUE, VLOOKUP($B22, 'Data Inputs'!$B$5:$F$648, 5, FALSE), \"\")","v":""},{"$f":"IF(ISNUMBER(VLOOKUP($B22, 'Data Inputs'!$B$5:$H$648, 6, FALSE))=TRUE, VLOOKUP($B22, 'Data Inputs'!$B$5:$H$648, 6, FALSE), \"\")","v":""},{"$f":"IF(ISNUMBER(VLOOKUP($B22, 'Data Inputs'!$B$5:$H$648, 7, FALSE))=TRUE, VLOOKUP($B22, 'Data Inputs'!$B$5:$H$648, 7, FALSE), \"\")","v":""},30,40.6,35.591771428571427,15,20]
[null,18,{"$f":"VLOOKUP($B23, 'Data Inputs'!$B$5:$F$214, 2, TRUE)","v":0.15151512},{"$f":"VLOOKUP($B23, 'Data Inputs'!$B$5:$F$648, 3, TRUE)","v":800},{"$f":"VLOOKUP($B23, 'Data Inputs'!$B$5:$F$648, 4, TRUE)","v":5.501515151515151},null,null,{"$f":"IF(ISNUMBER(VLOOKUP($B23, 'Data Inputs'!$B$5:$F$648, 5, FALSE))=TRUE, VLOOKUP($B23, 'Data Inputs'!$B$5:$F$648, 5, FALSE), \"\")","v":""},{"$f":"IF(ISNUMBER(VLOOKUP($B23, 'Data Inputs'!$B$5:$H$648, 6, FALSE))=TRUE, VLOOKUP($B23, 'Data Inputs'!$B$5:$H$648, 6, FALSE), \"\")","v":""},{"$f":"IF(ISNUMBER(VLOOKUP($B23, 'Data Inputs'!$B$5:$H$648, 7, FALSE))=TRUE, VLOOKUP($B23, 'Data Inputs'!$B$5:$H$648, 7, FALSE), \"\")","v":""},30,41.9,36.887657142857144,15]
[null,19,{"$f":"VLOOKUP($B24, 'Data Inputs'!$B$5:$F$214, 2, TRUE)","v":0.17045451},{"$f":"VLOOKUP($B24, 'Data Inputs'!$B$5:$F$648, 3, TRUE)","v":900},{"$f":"VLOOKUP($B24, 'Data Inputs'!$B$5:$F$648, 4, TRUE)","v":5.5204545454545455},null,null,{"$f":"IF(ISNUMBER(VLOOKUP($B24, 'Data Inputs'!$B$5:$F$648, 5, FALSE))=TRUE, VLOOKUP($B24, 'Data Inputs'!$B$5:$F$648, 5, FALSE), \"\")","v":30},{"$f":"IF(ISNUMBER(VLOOKUP($B24, 'Data Inputs'!$B$5:$H$648, 6, FALSE))=TRUE, VLOOKUP($B24, 'Data Inputs'!$B$5:$H$648, 6, FALSE), \"\")","v":""},{"$f":"IF(ISNUMBER(VLOOKUP($B24, 'Data Inputs'!$B$5:$H$648, 7, FALSE))=TRUE, VLOOKUP($B24, 'Data Inputs'!$B$5:$H$648, 7, FALSE), \"\")","v":""},30,43.2,38.183542857142854,15]
[null,20,{"$f":"VLOOKUP($B25, 'Data Inputs'!$B$5:$F$214, 2, TRUE)","v":0.17045451},{"$f":"VLOOKUP($B25, 'Data Inputs'!$B$5:$F$648, 3, TRUE)","v":900},{"$f":"VLOOKUP($B25, 'Data Inputs'!$B$5:$F$648, 4, TRUE)","v":5.5204545454545455},null,null,{"$f":"IF(ISNUMBER(VLOOKUP($B25, 'Data Inputs'!$B$5:$F$648, 5, FALSE))=TRUE, VLOOKUP($B25, 'Data Inputs'!$B$5:$F$648, 5, FALSE), \"\")","v":""},{"$f":"IF(ISNUMBER(VLOOKUP($B25, 'Data Inputs'!$B$5:$H$648, 6, FALSE))=TRUE, VLOOKUP($B25, 'Data Inputs'!$B$5:$H$648, 6, FALSE), \"\")","v":""},{"$f":"IF(ISNUMBER(VLOOKUP($B25, 'Data Inputs'!$B$5:$H$648, 7, FALSE))=TRUE, VLOOKUP($B25, 'Data Inputs'!$B$5:$H$648, 7, FALSE), \"\")","v":""},50,43.2,38.183542857142854,{"$error":"#N/A"}]
[null,21,{"$f":"VLOOKUP($B26, 'Data Inputs'!$B$5:$F$214, 2, TRUE)","v":0.1893939},{"$f":"VLOOKUP($B26, 'Data Inputs'!$B$5:$F$648, 3, TRUE)","v":1000},{"$f":"VLOOKUP($B26, 'Data Inputs'!$B$5:$F$648, 4, TRUE)","v":5.5393939393939391},null,null,{"$f":"IF(ISNUMBER(VLOOKUP($B26, 'Data Inputs'!$B$5:$F$648, 5, FALSE))=TRUE, VLOOKUP($B26, 'Data Inputs'!$B$5:$F$648, 5, FALSE), \"\")","v":""},{"$f":"IF(ISNUMBER(VLOOKUP($B26, 'Data Inputs'!$B$5:$H$648, 6, FALSE))=TRUE, VLOOKUP($B26, 'Data Inputs'!$B$5:$H$648, 6, FALSE), \"\")","v":""},{"$f":"IF(ISNUMBER(VLOOKUP($B26, 'Data Inputs'!$B$5:$H$648, 7, FALSE))=TRUE, VLOOKUP($B26, 'Data Inputs'!$B$5:$H$648, 7, FALSE), \"\")","v":""},50,44.5,39.479428571428571,{"$error":"#N/A"}]
[null,22,{"$f":"VLOOKUP($B27, 'Data Inputs'!$B$5:$F$214, 2, TRUE)","v":0.20833329},{"$f":"VLOOKUP($B27, 'Data Inputs'!$B$5:$F$648, 3, TRUE)","v":1100},{"$f":"VLOOKUP($B27, 'Data Inputs'!$B$5:$F$648, 4, TRUE)","v":5.5583333333333327},null,null,{"$f":"IF(ISNUMBER(VLOOKUP($B27, 'Data Inputs'!$B$5:$F$648, 5, FALSE))=TRUE, VLOOKUP($B27, 'Data Inputs'!$B$5:$F$648, 5, FALSE), \"\")","v":""},{"$f":"IF(ISNUMBER(VLOOKUP($B27, 'Data Inputs'!$B$5:$H$648, 6, FALSE))=TRUE, VLOOKUP($B27, 'Data Inputs'!$B$5:$H$648, 6, FALSE), \"\")","v":""},{"$f":"IF(ISNUMBER(VLOOKUP($B27, 'Data Inputs'!$B$5:$H$648, 7, FALSE))=TRUE, VLOOKUP($B27, 'Data Inputs'!$B$5:$H$648, 7, FALSE), \"\")","v":""},50,45.8,40.775314285714281,{"$error":"#N/A"}]
[null,23,{"$f":"VLOOKUP($B28, 'Data Inputs'!$B$5:$F$214, 2, TRUE)","v":0.22727268},{"$f":"VLOOKUP($B28, 'Data Inputs'!$B$5:$F$648, 3, TRUE)","v":1200},{"$f":"VLOOKUP($B28, 'Data Inputs'!$B$5:$F$648, 4, TRUE)","v":5.5772727272727272},null,null,{"$f":"IF(ISNUMBER(VLOOKUP($B28, 'Data Inputs'!$B$5:$F$648, 5, FALSE))=TRUE, VLOOKUP($B28, 'Data Inputs'!$B$5:$F$648, 5, FALSE), \"\")","v":""},{"$f":"IF(ISNUMBER(VLOOKUP($B28, 'Data Inputs'!$B$5:$H$648, 6, FALSE))=TRUE, VLOOKUP($B28, 'Data Inputs'!$B$5:$H$648, 6, FALSE), \"\")","v":""},{"$f":"IF(ISNUMBER(VLOOKUP($B28, 'Data Inputs'!$B$5:$H$648, 7, FALSE))=TRUE, VLOOKUP($B28, 'Data Inputs'!$B$5:$H$648, 7, FALSE), \"\")","v":42.071199999999997},50,47.1,{"$f":"IF($D28=\"\",\"\",(IF($D28<=$AC$5,$AE$5,IF($D28=$AC$6,$AE$6,IF($D28=$AC$7,$AE$7,IF($D28=$AC$8,$AE$8,IF(AND($AB$6=\"N\",$D28>$AC$5)=TRUE,$AE$5,IF(AND($AB$7=\"N\",$D28>$AC$6)=TRUE,$AE$6,IF(AND($AB$8=\"N\",$D28>$AC$7)=TRUE,$AE$7,IF(AND($AB$9=\"N\",$D28>$AC$8)=TRUE,$AE$8,IF($AB$6=\"Y\",IF(AND($D28>$AC$5,$D28<$AC$6)=TRUE,(($D28-$AC$5)/($AC$5-$AC$6)*(AE$5-AE$6))+MIN(AE$6,AE$5),IF($AB$7=\"Y\",IF(AND($D28>$AC$6,$D28<$AC$7)=TRUE,(($D28-$AC$6)/($AC$6-$AC$7)*(AE$6-AE$7))+MIN(AE$7,AE$6),IF($AB$8=\"Y\",IF(AND($D28>$AC$7,$D28<$AC$8)=TRUE,(($D28-$AC$7)/($AC$7-$AC$8)*(AE$7-AE$8))+MIN(AE$8,AE$7),IF($AB$9=\"Y\",IF(AND($D28>$AC$8,$D28<$AC$9)=TRUE,(($D28-$AC$8)/($AC$8-$AC$9)*(AE$8-AE$9))+MIN(AE$9,AE$8),IF($D28>=$AC$9,$AE$9,\"\")))))))))))))))))))","v":42.071199999999997},{"$error":"#N/A"},20]
[null,24,{"$f":"VLOOKUP($B29, 'Data Inputs'!$B$5:$F$214, 2, TRUE)","v":0.24621207000000001},{"$f":"VLOOKUP($B29, 'Data Inputs'!$B$5:$F$648, 3, TRUE)","v":1300},{"$f":"VLOOKUP($B29, 'Data Inputs'!$B$5:$F$648, 4, TRUE)","v":5.5962121212121207},null,null,{"$f":"IF(ISNUMBER(VLOOKUP($B29, 'Data Inputs'!$B$5:$F$648, 5, FALSE))=TRUE, VLOOKUP($B29, 'Data Inputs'!$B$5:$F$648, 5, FALSE), \"\")","v":""},{"$f":"IF(ISNUMBER(VLOOKUP($B29, 'Data Inputs'!$B$5:$H$648, 6, FALSE))=TRUE, VLOOKUP($B29, 'Data Inputs'!$B$5:$H$648, 6, FALSE), \"\")","v":""},{"$f":"IF(ISNUMBER(VLOOKUP($B29, 'Data Inputs'!$B$5:$H$648, 7, FALSE))=TRUE, VLOOKUP($B29, 'Data Inputs'!$B$5:$H$648, 7, FALSE), \"\")","v":""},50,48.400000000000006,43.798074999999997,{"$error":"#N/A"}]
[null,25,{"$f":"VLOOKUP($B30, 'Data Inputs'!$B$5:$F$214, 2, TRUE)","v":0.26515146000000001},{"$f":"VLOOKUP($B30, 'Data Inputs'!$B$5:$F$648, 3, TRUE)","v":1400},{"$f":"VLOOKUP($B30, 'Data Inputs'!$B$5:$F$648, 4, TRUE)","v":5.6151515151515152},null,null,{"$f":"IF(ISNUMBER(VLOOKUP($B30, 'Data Inputs'!$B$5:$F$648, 5, FALSE))=TRUE, VLOOKUP($B30, 'Data Inputs'!$B$5:$F$648, 5, FALSE), \"\")","v":""},{"$f":"IF(ISNUMBER(VLOOKUP($B30, 'Data Inputs'!$B$5:$H$648, 6, FALSE))=TRUE, VLOOKUP($B30, 'Data Inputs'!$B$5:$H$648, 6, FALSE), \"\")","v":""},{"$f":"IF(ISNUMBER(VLOOKUP($B30, 'Data Inputs'!$B$5:$H$648, 7, FALSE))=TRUE, VLOOKUP($B30, 'Data Inputs'!$B$5:$H$648, 7, FALSE), \"\")","v":""},50,49.7,45.524950000000004,{"$error":"#N/A"}]
[null,26,{"$f":"VLOOKUP($B31, 'Data Inputs'!$B$5:$F$214, 2, TRUE)","v":0.28409085000000001},{"$f":"VLOOKUP($B31, 'Data Inputs'!$B$5:$F$648, 3, TRUE)","v":1500},{"$f":"VLOOKUP($B31, 'Data Inputs'!$B$5:$F$648, 4, TRUE)","v":5.6340909090909088},null,null,{"$f":"IF(ISNUMBER(VLOOKUP($B31, 'Data Inputs'!$B$5:$F$648, 5, FALSE))=TRUE, VLOOKUP($B31, 'Data Inputs'!$B$5:$F$648, 5, FALSE), \"\")","v":""},{"$f":"IF(ISNUMBER(VLOOKUP($B31, 'Data Inputs'!$B$5:$H$648, 6, FALSE))=TRUE, VLOOKUP($B31, 'Data Inputs'!$B$5:$H$648, 6, FALSE), \"\")","v":""},{"$f":"IF(ISNUMBER(VLOOKUP($B31, 'Data Inputs'!$B$5:$H$648, 7, FALSE))=TRUE, VLOOKUP($B31, 'Data Inputs'!$B$5:$H$648, 7, FALSE), \"\")","v":""},50,51,47.251825000000004,{"$error":"#N/A"},20]
[null,27,{"$f":"VLOOKUP($B32, 'Data Inputs'!$B$5:$F$214, 2, TRUE)","v":0.30303024000000001},{"$f":"VLOOKUP($B32, 'Data Inputs'!$B$5:$F$648, 3, TRUE)","v":1600},{"$f":"VLOOKUP($B32, 'Data Inputs'!$B$5:$F$648, 4, TRUE)","v":5.6530303030303024},null,null,{"$f":"IF(ISNUMBER(VLOOKUP($B32, 'Data Inputs'!$B$5:$F$648, 5, FALSE))=TRUE, VLOOKUP($B32, 'Data Inputs'!$B$5:$F$648, 5, FALSE), \"\")","v":""},{"$f":"IF(ISNUMBER(VLOOKUP($B32, 'Data Inputs'!$B$5:$H$648, 6, FALSE))=TRUE, VLOOKUP($B32, 'Data Inputs'!$B$5:$H$648, 6, FALSE), \"\")","v":""},{"$f":"IF(ISNUMBER(VLOOKUP($B32, 'Data Inputs'!$B$5:$H$648, 7, FALSE))=TRUE, VLOOKUP($B32, 'Data Inputs'!$B$5:$H$648, 7, FALSE), \"\")","v":48.978700000000003},50,52.300000000000004,48.978700000000003,{"$error":"#N/A"}]
[null,28,{"$f":"VLOOKUP($B33, 'Data Inputs'!$B$5:$F$214, 2, TRUE)","v":0.32196963000000001},{"$f":"VLOOKUP($B33, 'Data Inputs'!$B$5:$F$648, 3, TRUE)","v":1700},{"$f":"VLOOKUP($B33, 'Data Inputs'!$B$5:$F$648, 4, TRUE)","v":5.6719696969696969},null,null,{"$f":"IF(ISNUMBER(VLOOKUP($B33, 'Data Inputs'!$B$5:$F$648, 5, FALSE))=TRUE, VLOOKUP($B33, 'Data Inputs'!$B$5:$F$648, 5, FALSE), \"\")","v":""},{"$f":"IF(ISNUMBER(VLOOKUP($B33, 'Data Inputs'!$B$5:$H$648, 6, FALSE))=TRUE, VLOOKUP($B33, 'Data Inputs'!$B$5:$H$648, 6, FALSE), \"\")","v":""},{"$f":"IF(ISNUMBER(VLOOKUP($B33, 'Data Inputs'!$B$5:$H$648, 7, FALSE))=TRUE, VLOOKUP($B33, 'Data Inputs'!$B$5:$H$648, 7, FALSE), \"\")","v":""},50,53.6,49.981066666666671,{"$error":"#N/A"}]
[null,29,{"$f":"VLOOKUP($B34, 'Data Inputs'!$B$5:$F$214, 2, TRUE)","v":0.34090902000000001},{"$f":"VLOOKUP($B34, 'Data Inputs'!$B$5:$F$648, 3, TRUE)","v":1800},{"$f":"VLOOKUP($B34, 'Data Inputs'!$B$5:$F$648, 4, TRUE)","v":5.6909090909090905},null,null,{"$f":"IF(ISNUMBER(VLOOKUP($B34, 'Data Inputs'!$B$5:$F$648, 5, FALSE))=TRUE, VLOOKUP($B34, 'Data Inputs'!$B$5:$F$648, 5, FALSE), \"\")","v":""},{"$f":"IF(ISNUMBER(VLOOKUP($B34, 'Data Inputs'!$B$5:$H$648, 6, FALSE))=TRUE, VLOOKUP($B34, 'Data Inputs'!$B$5:$H$648, 6, FALSE), \"\")","v":""},{"$f":"IF(ISNUMBER(VLOOKUP($B34, 'Data Inputs'!$B$5:$H$648, 7, FALSE))=TRUE, VLOOKUP($B34, 'Data Inputs'!$B$5:$H$648, 7, FALSE), \"\")","v":""},50,54.900000000000006,50.983433333333338,{"$error":"#N/A"}]
[null,30,{"$f":"VLOOKUP($B35, 'Data Inputs'!$B$5:$F$214, 2, TRUE)","v":0.35984841000000001},{"$f":"VLOOKUP($B35, 'Data Inputs'!$B$5:$F$648, 3, TRUE)","v":1900},{"$f":"VLOOKUP($B35, 'Data Inputs'!$B$5:$F$648, 4, TRUE)","v":5.7098484848484841},null,null,{"$f":"IF(ISNUMBER(VLOOKUP($B35, 'Data Inputs'!$B$5:$F$648, 5, FALSE))=TRUE, VLOOKUP($B35, 'Data Inputs'!$B$5:$F$648, 5, FALSE), \"\")","v":""},{"$f":"IF(ISNUMBER(VLOOKUP($B35, 'Data Inputs'!$B$5:$H$648, 6, FALSE))=TRUE, VLOOKUP($B35, 'Data Inputs'!$B$5:$H$648, 6, FALSE), \"\")","v":""},{"$f":"IF(ISNUMBER(VLOOKUP($B35, 'Data Inputs'!$B$5:$H$648, 7, FALSE))=TRUE, VLOOKUP($B35, 'Data Inputs'!$B$5:$H$648, 7, FALSE), \"\")","v":""},50,56.2,51.985800000000005,15]
[null,31,{"$f":"VLOOKUP($B36, 'Data Inputs'!$B$5:$F$214, 2, TRUE)","v":0.37878780000000001},{"$f":"VLOOKUP($B36, 'Data Inputs'!$B$5:$F$648, 3, TRUE)","v":2000},{"$f":"VLOOKUP($B36, 'Data Inputs'!$B$5:$F$648, 4, TRUE)","v":5.7287878787878785},null,null,{"$f":"IF(ISNUMBER(VLOOKUP($B36, 'Data Inputs'!$B$5:$F$648, 5, FALSE))=TRUE, VLOOKUP($B36, 'Data Inputs'!$B$5:$F$648, 5, FALSE), \"\")","v":""},{"$f":"IF(ISNUMBER(VLOOKUP($B36, 'Data Inputs'!$B$5:$H$648, 6, FALSE))=TRUE, VLOOKUP($B36, 'Data Inputs'!$B$5:$H$648, 6, FALSE), \"\")","v":""},{"$f":"IF(ISNUMBER(VLOOKUP($B36, 'Data Inputs'!$B$5:$H$648, 7, FALSE))=TRUE, VLOOKUP($B36, 'Data Inputs'!$B$5:$H$648, 7, FALSE), \"\")","v":""},50,57.5,52.988166666666672,15,20]
[null,32,{"$f":"VLOOKUP($B37, 'Data Inputs'!$B$5:$F$214, 2, TRUE)","v":0.39772719000000001},{"$f":"VLOOKUP($B37, 'Data Inputs'!$B$5:$F$648, 3, TRUE)","v":2100},{"$f":"VLOOKUP($B37, 'Data Inputs'!$B$5:$F$648, 4, TRUE)","v":5.7477272727272721},null,null,{"$f":"IF(ISNUMBER(VLOOKUP($B37, 'Data Inputs'!$B$5:$F$648, 5, FALSE))=TRUE, VLOOKUP($B37, 'Data Inputs'!$B$5:$F$648, 5, FALSE), \"\")","v":""},{"$f":"IF(ISNUMBER(VLOOKUP($B37, 'Data Inputs'!$B$5:$H$648, 6, FALSE))=TRUE, VLOOKUP($B37, 'Data Inputs'!$B$5:$H$648, 6, FALSE), \"\")","v":""},{"$f":"IF(ISNUMBER(VLOOKUP($B37, 'Data Inputs'!$B$5:$H$648, 7, FALSE))=TRUE, VLOOKUP($B37, 'Data Inputs'!$B$5:$H$648, 7, FALSE), \"\")","v":""},50,58.800000000000004,{"$f":"IF($D37=\"\",\"\",(IF($D37<=$AC$5,$AE$5,IF($D37=$AC$6,$AE$6,IF($D37=$AC$7,$AE$7,IF($D37=$AC$8,$AE$8,IF(AND($AB$6=\"N\",$D37>$AC$5)=TRUE,$AE$5,IF(AND($AB$7=\"N\",$D37>$AC$6)=TRUE,$AE$6,IF(AND($AB$8=\"N\",$D37>$AC$7)=TRUE,$AE$7,IF(AND($AB$9=\"N\",$D37>$AC$8)=TRUE,$AE$8,IF($AB$6=\"Y\",IF(AND($D37>$AC$5,$D37<$AC$6)=TRUE,(($D37-$AC$5)/($AC$5-$AC$6)*(AE$5-AE$6))+MIN(AE$6,AE$5),IF($AB$7=\"Y\",IF(AND($D37>$AC$6,$D37<$AC$7)=TRUE,(($D37-$AC$6)/($AC$6-$AC$7)*(AE$6-AE$7))+MIN(AE$7,AE$6),IF($AB$8=\"Y\",IF(AND($D37>$AC$7,$D37<$AC$8)=TRUE,(($D37-$AC$7)/($AC$7-$AC$8)*(AE$7-AE$8))+MIN(AE$8,AE$7),IF($AB$9=\"Y\",IF(AND($D37>$AC$8,$D37<$AC$9)=TRUE,(($D37-$AC$8)/($AC$8-$AC$9)*(AE$8-AE$9))+MIN(AE$9,AE$8),IF($D37>=$AC$9,$AE$9,\"\")))))))))))))))))))","v":53.990533333333332},15]
[null,33,{"$f":"VLOOKUP($B38, 'Data Inputs'!$B$5:$F$214, 2, TRUE)","v":0.41666658000000001},{"$f":"VLOOKUP($B38, 'Data Inputs'!$B$5:$F$648, 3, TRUE)","v":2200},{"$f":"VLOOKUP($B38, 'Data Inputs'!$B$5:$F$648, 4, TRUE)","v":5.7666666666666666},null,null,{"$f":"IF(ISNUMBER(VLOOKUP($B38, 'Data Inputs'!$B$5:$F$648, 5, FALSE))=TRUE, VLOOKUP($B38, 'Data Inputs'!$B$5:$F$648, 5, FALSE), \"\")","v":50},{"$f":"IF(ISNUMBER(VLOOKUP($B38, 'Data Inputs'!$B$5:$H$648, 6, FALSE))=TRUE, VLOOKUP($B38, 'Data Inputs'!$B$5:$H$648, 6, FALSE), \"\")","v":""},{"$f":"IF(ISNUMBER(VLOOKUP($B38, 'Data Inputs'!$B$5:$H$648, 7, FALSE))=TRUE, VLOOKUP($B38, 'Data Inputs'!$B$5:$H$648, 7, FALSE), \"\")","v":""},50,60.1,54.992899999999999,15]
[null,34,{"$f":"VLOOKUP($B39, 'Data Inputs'!$B$5:$F$214, 2, TRUE)","v":0.41666658000000001},{"$f":"VLOOKUP($B39, 'Data Inputs'!$B$5:$F$648, 3, TRUE)","v":2200},{"$f":"VLOOKUP($B39, 'Data Inputs'!$B$5:$F$648, 4, TRUE)","v":5.7666666666666666},null,null,{"$f":"IF(ISNUMBER(VLOOKUP($B39, 'Data Inputs'!$B$5:$F$648, 5, FALSE))=TRUE, VLOOKUP($B39, 'Data Inputs'!$B$5:$F$648, 5, FALSE), \"\")","v":""},{"$f":"IF(ISNUMBER(VLOOKUP($B39, 'Data Inputs'!$B$5:$H$648, 6, FALSE))=TRUE, VLOOKUP($B39, 'Data Inputs'!$B$5:$H$648, 6, FALSE), \"\")","v":""},{"$f":"IF(ISNUMBER(VLOOKUP($B39, 'Data Inputs'!$B$5:$H$648, 7, FALSE))=TRUE, VLOOKUP($B39, 'Data Inputs'!$B$5:$H$648, 7, FALSE), \"\")","v":""},65,60.1,54.992899999999999,{"$error":"#N/A"}]
[null,35,{"$f":"VLOOKUP($B40, 'Data Inputs'!$B$5:$F$214, 2, TRUE)","v":0.43560597000000001},{"$f":"VLOOKUP($B40, 'Data Inputs'!$B$5:$F$648, 3, TRUE)","v":2300},{"$f":"VLOOKUP($B40, 'Data Inputs'!$B$5:$F$648, 4, TRUE)","v":5.7856060606060602},null,null,{"$f":"IF(ISNUMBER(VLOOKUP($B40, 'Data Inputs'!$B$5:$F$648, 5, FALSE))=TRUE, VLOOKUP($B40, 'Data Inputs'!$B$5:$F$648, 5, FALSE), \"\")","v":""},{"$f":"IF(ISNUMBER(VLOOKUP($B40, 'Data Inputs'!$B$5:$H$648, 6, FALSE))=TRUE, VLOOKUP($B40, 'Data Inputs'!$B$5:$H$648, 6, FALSE), \"\")","v":""},{"$f":"IF(ISNUMBER(VLOOKUP($B40, 'Data Inputs'!$B$5:$H$648, 7, FALSE))=TRUE, VLOOKUP($B40, 'Data Inputs'!$B$5:$H$648, 7, FALSE), \"\")","v":""},65,61.4,55.995266666666666,{"$error":"#N/A"}]
[null,36,{"$f":"VLOOKUP($B41, 'Data Inputs'!$B$5:$F$214, 2, TRUE)","v":0.45454536000000001},{"$f":"VLOOKUP($B41, 'Data Inputs'!$B$5:$F$648, 3, TRUE)","v":2400},{"$f":"VLOOKUP($B41, 'Data Inputs'!$B$5:$F$648, 4, TRUE)","v":5.8045454545454538},null,null,{"$f":"IF(ISNUMBER(VLOOKUP($B41, 'Data Inputs'!$B$5:$F$648, 5, FALSE))=TRUE, VLOOKUP($B41, 'Data Inputs'!$B$5:$F$648, 5, FALSE), \"\")","v":""},{"$f":"IF(ISNUMBER(VLOOKUP($B41, 'Data Inputs'!$B$5:$H$648, 6, FALSE))=TRUE, VLOOKUP($B41, 'Data Inputs'!$B$5:$H$648, 6, FALSE), \"\")","v":""},{"$f":"IF(ISNUMBER(VLOOKUP($B41, 'Data Inputs'!$B$5:$H$648, 7, FALSE))=TRUE, VLOOKUP($B41, 'Data Inputs'!$B$5:$H$648, 7, FALSE), \"\")","v":""},65,62.7,56.997633333333333,{"$error":"#N/A"},20]
[null,37,{"$f":"VLOOKUP($B42, 'Data Inputs'!$B$5:$F$214, 2, TRUE)","v":0.47348475000000001},{"$f":"VLOOKUP($B42, 'Data Inputs'!$B$5:$F$648, 3, TRUE)","v":2500},{"$f":"VLOOKUP($B42, 'Data Inputs'!$B$5:$F$648, 4, TRUE)","v":5.8234848484848483},null,null,{"$f":"IF(ISNUMBER(VLOOKUP($B42, 'Data Inputs'!$B$5:$F$648, 5, FALSE))=TRUE, VLOOKUP($B42, 'Data Inputs'!$B$5:$F$648, 5, FALSE), \"\")","v":""},{"$f":"IF(ISNUMBER(VLOOKUP($B42, 'Data Inputs'!$B$5:$H$648, 6, FALSE))=TRUE, VLOOKUP($B42, 'Data Inputs'!$B$5:$H$648, 6, FALSE), \"\")","v":64},{"$f":"IF(ISNUMBER(VLOOKUP($B42, 'Data Inputs'!$B$5:$H$648, 7, FALSE))=TRUE, VLOOKUP($B42, 'Data Inputs'!$B$5:$H$648, 7, FALSE), \"\")","v":58},65,64,58,{"$error":"#N/A"}]
[null,38,{"$f":"VLOOKUP($B43, 'Data Inputs'!$B$5:$F$214, 2, TRUE)","v":0.49242414000000001},{"$f":"VLOOKUP($B43, 'Data Inputs'!$B$5:$F$648, 3, TRUE)","v":2600},{"$f":"VLOOKUP($B43, 'Data Inputs'!$B$5:$F$648, 4, TRUE)","v":5.8424242424242419},null,null,{"$f":"IF(ISNUMBER(VLOOKUP($B43, 'Data Inputs'!$B$5:$F$648, 5, FALSE))=TRUE, VLOOKUP($B43, 'Data Inputs'!$B$5:$F$648, 5, FALSE), \"\")","v":""},{"$f":"IF(ISNUMBER(VLOOKUP($B43, 'Data Inputs'!$B$5:$H$648, 6, FALSE))=TRUE, VLOOKUP($B43, 'Data Inputs'!$B$5:$H$648, 6, FALSE), \"\")","v":""},{"$f":"IF(ISNUMBER(VLOOKUP($B43, 'Data Inputs'!$B$5:$H$648, 7, FALSE))=TRUE, VLOOKUP($B43, 'Data Inputs'!$B$5:$H$648, 7, FALSE), \"\")","v":""},65,64,58,{"$error":"#N/A"}]
[null,39,{"$f":"VLOOKUP($B44, 'Data Inputs'!$B$5:$F$214, 2, TRUE)","v":0.51136353000000001},{"$f":"VLOOKUP($B44, 'Data Inputs'!$B$5:$F$648, 3, TRUE)","v":2700},{"$f":"VLOOKUP($B44, 'Data Inputs'!$B$5:$F$648, 4, TRUE)","v":5.8613636363636363},null,null,{"$f":"IF(ISNUMBER(VLOOKUP($B44, 'Data Inputs'!$B$5:$F$648, 5, FALSE))=TRUE, VLOOKUP($B44, 'Data Inputs'!$B$5:$F$648, 5, FALSE), \"\")","v":""},{"$f":"IF(ISNUMBER(VLOOKUP($B44, 'Data Inputs'!$B$5:$H$648, 6, FALSE))=TRUE, VLOOKUP($B44, 'Data Inputs'!$B$5:$H$648, 6, FALSE), \"\")","v":""},{"$f":"IF(ISNUMBER(VLOOKUP($B44, 'Data Inputs'!$B$5:$H$648, 7, FALSE))=TRUE, VLOOKUP($B44, 'Data Inputs'!$B$5:$H$648, 7, FALSE), \"\")","v":""},65,64,58,{"$error":"#N/A"}]
[null,40,{"$f":"VLOOKUP($B45, 'Data Inputs'!$B$5:$F$214, 2, TRUE)","v":0.53030292000000001},{"$f":"VLOOKUP($B45, 'Data Inputs'!$B$5:$F$648, 3, TRUE)","v":2800},{"$f":"VLOOKUP($B45, 'Data Inputs'!$B$5:$F$648, 4, TRUE)","v":5.8803030303030299},null,null,{"$f":"IF(ISNUMBER(VLOOKUP($B45, 'Data Inputs'!$B$5:$F$648, 5, FALSE))=TRUE, VLOOKUP($B45, 'Data Inputs'!$B$5:$F$648, 5, FALSE), \"\")","v":""},{"$f":"IF(ISNUMBER(VLOOKUP($B45, 'Data Inputs'!$B$5:$H$648, 6, FALSE))=TRUE, VLOOKUP($B45, 'Data Inputs'!$B$5:$H$648, 6, FALSE), \"\")","v":""},{"$f":"IF(ISNUMBER(VLOOKUP($B45, 'Data Inputs'!$B$5:$H$648, 7, FALSE))=TRUE, VLOOKUP($B45, 'Data Inputs'!$B$5:$H$648, 7, FALSE), \"\")","v":""},65,64,58,{"$error":"#N/A"}]
[null,41,{"$f":"VLOOKUP($B46, 'Data Inputs'!$B$5:$F$214, 2, TRUE)","v":0.54924231000000001},{"$f":"VLOOKUP($B46, 'Data Inputs'!$B$5:$F$648, 3, TRUE)","v":2900},{"$f":"VLOOKUP($B46, 'Data Inputs'!$B$5:$F$648, 4, TRUE)","v":5.8992424242424235},null,null,{"$f":"IF(ISNUMBER(VLOOKUP($B46, 'Data Inputs'!$B$5:$F$648, 5, FALSE))=TRUE, VLOOKUP($B46, 'Data Inputs'!$B$5:$F$648, 5, FALSE), \"\")","v":""},{"$f":"IF(ISNUMBER(VLOOKUP($B46, 'Data Inputs'!$B$5:$H$648, 6, FALSE))=TRUE, VLOOKUP($B46, 'Data Inputs'!$B$5:$H$648, 6, FALSE), \"\")","v":""},{"$f":"IF(ISNUMBER(VLOOKUP($B46, 'Data Inputs'!$B$5:$H$648, 7, FALSE))=TRUE, VLOOKUP($B46, 'Data Inputs'!$B$5:$H$648, 7, FALSE), \"\")","v":""},65,64,58,{"$error":"#N/A"}]
[null,42,{"$f":"VLOOKUP($B47, 'Data Inputs'!$B$5:$F$214, 2, TRUE)","v":0.56818170000000001},{"$f":"VLOOKUP($B47, 'Data Inputs'!$B$5:$F$648, 3, TRUE)","v":3000},{"$f":"VLOOKUP($B47, 'Data Inputs'!$B$5:$F$648, 4, TRUE)","v":5.918181818181818},null,null,{"$f":"IF(ISNUMBER(VLOOKUP($B47, 'Data Inputs'!$B$5:$F$648, 5, FALSE))=TRUE, VLOOKUP($B47, 'Data Inputs'!$B$5:$F$648, 5, FALSE), \"\")","v":""},{"$f":"IF(ISNUMBER(VLOOKUP($B47, 'Data Inputs'!$B$5:$H$648, 6, FALSE))=TRUE, VLOOKUP($B47, 'Data Inputs'!$B$5:$H$648, 6, FALSE), \"\")","v":""},{"$f":"IF(ISNUMBER(VLOOKUP($B47, 'Data Inputs'!$B$5:$H$648, 7, FALSE))=TRUE, VLOOKUP($B47, 'Data Inputs'!$B$5:$H$648, 7, FALSE), \"\")","v":""},65,64,58,{"$error":"#N/A"}]
[null,43,{"$f":"VLOOKUP($B48, 'Data Inputs'!$B$5:$F$214, 2, TRUE)","v":0.58712109000000001},{"$f":"VLOOKUP($B48, 'Data Inputs'!$B$5:$F$648, 3, TRUE)","v":3100},{"$f":"VLOOKUP($B48, 'Data Inputs'!$B$5:$F$648, 4, TRUE)","v":5.9371212121212116},null,null,{"$f":"IF(ISNUMBER(VLOOKUP($B48, 'Data Inputs'!$B$5:$F$648, 5, FALSE))=TRUE, VLOOKUP($B48, 'Data Inputs'!$B$5:$F$648, 5, FALSE), \"\")","v":65},{"$f":"IF(ISNUMBER(VLOOKUP($B48, 'Data Inputs'!$B$5:$H$648, 6, FALSE))=TRUE, VLOOKUP($B48, 'Data Inputs'!$B$5:$H$648, 6, FALSE), \"\")","v":""},{"$f":"IF(ISNUMBER(VLOOKUP($B48, 'Data Inputs'!$B$5:$H$648, 7, FALSE))=TRUE, VLOOKUP($B48, 'Data Inputs'!$B$5:$H$648, 7, FALSE), \"\")","v":""},65,64,58,{"$error":"#N/A"}]
[null,44,{"$f":"VLOOKUP($B49, 'Data Inputs'!$B$5:$F$214, 2, TRUE)","v":0.58712109000000001},{"$f":"VLOOKUP($B49, 'Data Inputs'!$B$5:$F$648, 3, TRUE)","v":3100},{"$f":"VLOOKUP($B49, 'Data Inputs'!$B$5:$F$648, 4, TRUE)","v":5.9371212121212116},null,null,{"$f":"IF(ISNUMBER(VLOOKUP($B49, 'Data Inputs'!$B$5:$F$648, 5, FALSE))=TRUE, VLOOKUP($B49, 'Data Inputs'!$B$5:$F$648, 5, FALSE), \"\")","v":""},{"$f":"IF(ISNUMBER(VLOOKUP($B49, 'Data Inputs'!$B$5:$H$648, 6, FALSE))=TRUE, VLOOKUP($B49, 'Data Inputs'!$B$5:$H$648, 6, FALSE), \"\")","v":""},{"$f":"IF(ISNUMBER(VLOOKUP($B49, 'Data Inputs'!$B$5:$H$648, 7, FALSE))=TRUE, VLOOKUP($B49, 'Data Inputs'!$B$5:$H$648, 7, FALSE), \"\")","v":""},65,64,58,{"$error":"#N/A"}]
[null,45,{"$f":"VLOOKUP($B50, 'Data Inputs'!$B$5:$F$214, 2, TRUE)","v":0.60606048000000001},{"$f":"VLOOKUP($B50, 'Data Inputs'!$B$5:$F$648, 3, TRUE)","v":3200},{"$f":"VLOOKUP($B50, 'Data Inputs'!$B$5:$F$648, 4, TRUE)","v":5.9560606060606061},null,null,{"$f":"IF(ISNUMBER(VLOOKUP($B50, 'Data Inputs'!$B$5:$F$648, 5, FALSE))=TRUE, VLOOKUP($B50, 'Data Inputs'!$B$5:$F$648, 5, FALSE), \"\")","v":""},{"$f":"IF(ISNUMBER(VLOOKUP($B50, 'Data Inputs'!$B$5:$H$648, 6, FALSE))=TRUE, VLOOKUP($B50, 'Data Inputs'!$B$5:$H$648, 6, FALSE), \"\")","v":""},{"$f":"IF(ISNUMBER(VLOOKUP($B50, 'Data Inputs'!$B$5:$H$648, 7, FALSE))=TRUE, VLOOKUP($B50, 'Data Inputs'!$B$5:$H$648, 7, FALSE), \"\")","v":""},65,64,58,{"$error":"#N/A"}]
[null,46,{"$f":"VLOOKUP($B51, 'Data Inputs'!$B$5:$F$214, 2, TRUE)","v":0.62499987000000001},{"$f":"VLOOKUP($B51, 'Data Inputs'!$B$5:$F$648, 3, TRUE)","v":3300},{"$f":"VLOOKUP($B51, 'Data Inputs'!$B$5:$F$648, 4, TRUE)","v":5.9749999999999996},null,null,{"$f":"IF(ISNUMBER(VLOOKUP($B51, 'Data Inputs'!$B$5:$F$648, 5, FALSE))=TRUE, VLOOKUP($B51, 'Data Inputs'!$B$5:$F$648, 5, FALSE), \"\")","v":""},{"$f":"IF(ISNUMBER(VLOOKUP($B51, 'Data Inputs'!$B$5:$H$648, 6, FALSE))=TRUE, VLOOKUP($B51, 'Data Inputs'!$B$5:$H$648, 6, FALSE), \"\")","v":""},{"$f":"IF(ISNUMBER(VLOOKUP($B51, 'Data Inputs'!$B$5:$H$648, 7, FALSE))=TRUE, VLOOKUP($B51, 'Data Inputs'!$B$5:$H$648, 7, FALSE), \"\")","v":""},65,64,58,{"$error":"#N/A"}]
[null,47,{"$f":"VLOOKUP($B52, 'Data Inputs'!$B$5:$F$214, 2, TRUE)","v":0.64393926000000001},{"$f":"VLOOKUP($B52, 'Data Inputs'!$B$5:$F$648, 3, TRUE)","v":3400},{"$f":"VLOOKUP($B52, 'Data Inputs'!$B$5:$F$648, 4, TRUE)","v":5.9939393939393932},null,null,{"$f":"IF(ISNUMBER(VLOOKUP($B52, 'Data Inputs'!$B$5:$F$648, 5, FALSE))=TRUE, VLOOKUP($B52, 'Data Inputs'!$B$5:$F$648, 5, FALSE), \"\")","v":""},{"$f":"IF(ISNUMBER(VLOOKUP($B52, 'Data Inputs'!$B$5:$H$648, 6, FALSE))=TRUE, VLOOKUP($B52, 'Data Inputs'!$B$5:$H$648, 6, FALSE), \"\")","v":""},{"$f":"IF(ISNUMBER(VLOOKUP($B52, 'Data Inputs'!$B$5:$H$648, 7, FALSE))=TRUE, VLOOKUP($B52, 'Data Inputs'!$B$5:$H$648, 7, FALSE), \"\")","v":""},65,64,58,{"$error":"#N/A"}]
[null,48,{"$f":"VLOOKUP($B53, 'Data Inputs'!$B$5:$F$214, 2, TRUE)","v":0.66287865000000001},{"$f":"VLOOKUP($B53, 'Data Inputs'!$B$5:$F$648, 3, TRUE)","v":3500},{"$f":"VLOOKUP($B53, 'Data Inputs'!$B$5:$F$648, 4, TRUE)","v":6.0128787878787877},null,null,{"$f":"IF(ISNUMBER(VLOOKUP($B53, 'Data Inputs'!$B$5:$F$648, 5, FALSE))=TRUE, VLOOKUP($B53, 'Data Inputs'!$B$5:$F$648, 5, FALSE), \"\")","v":""},{"$f":"IF(ISNUMBER(VLOOKUP($B53, 'Data Inputs'!$B$5:$H$648, 6, FALSE))=TRUE, VLOOKUP($B53, 'Data Inputs'!$B$5:$H$648, 6, FALSE), \"\")","v":""},{"$f":"IF(ISNUMBER(VLOOKUP($B53, 'Data Inputs'!$B$5:$H$648, 7, FALSE))=TRUE, VLOOKUP($B53, 'Data Inputs'!$B$5:$H$648, 7, FALSE), \"\")","v":""},65,64,58,{"$error":"#N/A"}]
[null,49,{"$f":"VLOOKUP($B54, 'Data Inputs'!$B$5:$F$214, 2, TRUE)","v":""},{"$f":"VLOOKUP($B54, 'Data Inputs'!$B$5:$F$648, 3, TRUE)","v":""},{"$f":"VLOOKUP($B54, 'Data Inputs'!$B$5:$F$648, 4, TRUE)","v":""},null,null,{"$f":"IF(ISNUMBER(VLOOKUP($B54, 'Data Inputs'!$B$5:$F$648, 5, FALSE))=TRUE, VLOOKUP($B54, 'Data Inputs'!$B$5:$F$648, 5, FALSE), \"\")","v":""},{"$f":"IF(ISNUMBER(VLOOKUP($B54, 'Data Inputs'!$B$5:$H$648, 6, FALSE))=TRUE, VLOOKUP($B54, 'Data Inputs'!$B$5:$H$648, 6, FALSE), \"\")","v":""},{"$f":"IF(ISNUMBER(VLOOKUP($B54, 'Data Inputs'!$B$5:$H$648, 7, FALSE))=TRUE, VLOOKUP($B54, 'Data Inputs'!$B$5:$H$648, 7, FALSE), \"\")","v":""},65,"","",""]
[null,50,{"$f":"VLOOKUP($B55, 'Data Inputs'!$B$5:$F$214, 2, TRUE)","v":""},{"$f":"VLOOKUP($B55, 'Data Inputs'!$B$5:$F$648, 3, TRUE)","v":""},{"$f":"VLOOKUP($B55, 'Data Inputs'!$B$5:$F$648, 4, TRUE)","v":""},null,null,{"$f":"IF(ISNUMBER(VLOOKUP($B55, 'Data Inputs'!$B$5:$F$648, 5, FALSE))=TRUE, VLOOKUP($B55, 'Data Inputs'!$B$5:$F$648, 5, FALSE), \"\")","v":""},{"$f":"IF(ISNUMBER(VLOOKUP($B55, 'Data Inputs'!$B$5:$H$648, 6, FALSE))=TRUE, VLOOKUP($B55, 'Data Inputs'!$B$5:$H$648, 6, FALSE), \"\")","v":""},{"$f":"IF(ISNUMBER(VLOOKUP($B55, 'Data Inputs'!$B$5:$H$648, 7, FALSE))=TRUE, VLOOKUP($B55, 'Data Inputs'!$B$5:$H$648, 7, FALSE), \"\")","v":""},65,"","",""]
[null,51,{"$f":"VLOOKUP($B56, 'Data Inputs'!$B$5:$F$214, 2, TRUE)","v":""},{"$f":"VLOOKUP($B56, 'Data Inputs'!$B$5:$F$648, 3, TRUE)","v":""},{"$f":"VLOOKUP($B56, 'Data Inputs'!$B$5:$F$648, 4, TRUE)","v":""},null,null,{"$f":"IF(ISNUMBER(VLOOKUP($B56, 'Data Inputs'!$B$5:$F$648, 5, FALSE))=TRUE, VLOOKUP($B56, 'Data Inputs'!$B$5:$F$648, 5, FALSE), \"\")","v":""},{"$f":"IF(ISNUMBER(VLOOKUP($B56, 'Data Inputs'!$B$5:$H$648, 6, FALSE))=TRUE, VLOOKUP($B56, 'Data Inputs'!$B$5:$H$648, 6, FALSE), \"\")","v":""},{"$f":"IF(ISNUMBER(VLOOKUP($B56, 'Data Inputs'!$B$5:$H$648, 7, FALSE))=TRUE, VLOOKUP($B56, 'Data Inputs'!$B$5:$H$648, 7, FALSE), \"\")","v":""},65,"","",""]
[null,52,{"$f":"VLOOKUP($B57, 'Data Inputs'!$B$5:$F$214, 2, TRUE)","v":""},{"$f":"VLOOKUP($B57, 'Data Inputs'!$B$5:$F$648, 3, TRUE)","v":""},{"$f":"VLOOKUP($B57, 'Data Inputs'!$B$5:$F$648, 4, TRUE)","v":""},null,null,{"$f":"IF(ISNUMBER(VLOOKUP($B57, 'Data Inputs'!$B$5:$F$648, 5, FALSE))=TRUE, VLOOKUP($B57, 'Data Inputs'!$B$5:$F$648, 5, FALSE), \"\")","v":""},{"$f":"IF(ISNUMBER(VLOOKUP($B57, 'Data Inputs'!$B$5:$H$648, 6, FALSE))=TRUE, VLOOKUP($B57, 'Data Inputs'!$B$5:$H$648, 6, FALSE), \"\")","v":""},{"$f":"IF(ISNUMBER(VLOOKUP($B57, 'Data Inputs'!$B$5:$H$648, 7, FALSE))=TRUE, VLOOKUP($B57, 'Data Inputs'!$B$5:$H$648, 7, FALSE), \"\")","v":""},65,"","",""]
[null,53,{"$f":"VLOOKUP($B58, 'Data Inputs'!$B$5:$F$214, 2, TRUE)","v":""},{"$f":"VLOOKUP($B58, 'Data Inputs'!$B$5:$F$648, 3, TRUE)","v":""},{"$f":"VLOOKUP($B58, 'Data Inputs'!$B$5:$F$648, 4, TRUE)","v":""},null,null,{"$f":"IF(ISNUMBER(VLOOKUP($B58, 'Data Inputs'!$B$5:$F$648, 5, FALSE))=TRUE, VLOOKUP($B58, 'Data Inputs'!$B$5:$F$648, 5, FALSE), \"\")","v":""},{"$f":"IF(ISNUMBER(VLOOKUP($B58, 'Data Inputs'!$B$5:$H$648, 6, FALSE))=TRUE, VLOOKUP($B58, 'Data Inputs'!$B$5:$H$648, 6, FALSE), \"\")","v":""},{"$f":"IF(ISNUMBER(VLOOKUP($B58, 'Data Inputs'!$B$5:$H$648, 7, FALSE))=TRUE, VLOOKUP($B58, 'Data Inputs'!$B$5:$H$648, 7, FALSE), \"\")","v":""},65,"","",""]
[null,54,{"$f":"VLOOKUP($B59, 'Data Inputs'!$B$5:$F$214, 2, TRUE)","v":""},{"$f":"VLOOKUP($B59, 'Data Inputs'!$B$5:$F$648, 3, TRUE)","v":""},{"$f":"VLOOKUP($B59, 'Data Inputs'!$B$5:$F$648, 4, TRUE)","v":""},null,null,{"$f":"IF(ISNUMBER(VLOOKUP($B59, 'Data Inputs'!$B$5:$F$648, 5, FALSE))=TRUE, VLOOKUP($B59, 'Data Inputs'!$B$5:$F$648, 5, FALSE), \"\")","v":""},{"$f":"IF(ISNUMBER(VLOOKUP($B59, 'Data Inputs'!$B$5:$H$648, 6, FALSE))=TRUE, VLOOKUP($B59, 'Data Inputs'!$B$5:$H$648, 6, FALSE), \"\")","v":""},{"$f":"IF(ISNUMBER(VLOOKUP($B59, 'Data Inputs'!$B$5:$H$648, 7, FALSE))=TRUE, VLOOKUP($B59, 'Data Inputs'!$B$5:$H$648, 7, FALSE), \"\")","v":""},65,"","",""]
[null,55,{"$f":"VLOOKUP($B60, 'Data Inputs'!$B$5:$F$214, 2, TRUE)","v":""},{"$f":"VLOOKUP($B60, 'Data Inputs'!$B$5:$F$648, 3, TRUE)","v":""},{"$f":"VLOOKUP($B60, 'Data Inputs'!$B$5:$F$648, 4, TRUE)","v":""},null,null,{"$f":"IF(ISNUMBER(VLOOKUP($B60, 'Data Inputs'!$B$5:$F$648, 5, FALSE))=TRUE, VLOOKUP($B60, 'Data Inputs'!$B$5:$F$648, 5, FALSE), \"\")","v":""},{"$f":"IF(ISNUMBER(VLOOKUP($B60, 'Data Inputs'!$B$5:$H$648, 6, FALSE))=TRUE, VLOOKUP($B60, 'Data Inputs'!$B$5:$H$648, 6, FALSE), \"\")","v":""},{"$f":"IF(ISNUMBER(VLOOKUP($B60, 'Data Inputs'!$B$5:$H$648, 7, FALSE))=TRUE, VLOOKUP($B60, 'Data Inputs'!$B$5:$H$648, 7, FALSE), \"\")","v":""},65,"","",""]
[null,56,{"$f":"VLOOKUP($B61, 'Data Inputs'!$B$5:$F$214, 2, TRUE)","v":""},{"$f":"VLOOKUP($B61, 'Data Inputs'!$B$5:$F$648, 3, TRUE)","v":""},{"$f":"VLOOKUP($B61, 'Data Inputs'!$B$5:$F$648, 4, TRUE)","v":""},null,null,{"$f":"IF(ISNUMBER(VLOOKUP($B61, 'Data Inputs'!$B$5:$F$648, 5, FALSE))=TRUE, VLOOKUP($B61, 'Data Inputs'!$B$5:$F$648, 5, FALSE), \"\")","v":""},{"$f":"IF(ISNUMBER(VLOOKUP($B61, 'Data Inputs'!$B$5:$H$648, 6, FALSE))=TRUE, VLOOKUP($B61, 'Data Inputs'!$B$5:$H$648, 6, FALSE), \"\")","v":""},{"$f":"IF(ISNUMBER(VLOOKUP($B61, 'Data Inputs'!$B$5:$H$648, 7, FALSE))=TRUE, VLOOKUP($B61, 'Data Inputs'!$B$5:$H$648, 7, FALSE), \"\")","v":""},65,"","",""]
[null,57,{"$f":"VLOOKUP($B62, 'Data Inputs'!$B$5:$F$214, 2, TRUE)","v":""},{"$f":"VLOOKUP($B62, 'Data Inputs'!$B$5:$F$648, 3, TRUE)","v":""},{"$f":"VLOOKUP($B62, 'Data Inputs'!$B$5:$F$648, 4, TRUE)","v":""},null,null,{"$f":"IF(ISNUMBER(VLOOKUP($B62, 'Data Inputs'!$B$5:$F$648, 5, FALSE))=TRUE, VLOOKUP($B62, 'Data Inputs'!$B$5:$F$648, 5, FALSE), \"\")","v":""},{"$f":"IF(ISNUMBER(VLOOKUP($B62, 'Data Inputs'!$B$5:$H$648, 6, FALSE))=TRUE, VLOOKUP($B62, 'Data Inputs'!$B$5:$H$648, 6, FALSE), \"\")","v":""},{"$f":"IF(ISNUMBER(VLOOKUP($B62, 'Data Inputs'!$B$5:$H$648, 7, FALSE))=TRUE, VLOOKUP($B62, 'Data Inputs'!$B$5:$H$648, 7, FALSE), \"\")","v":""},65,"","",""]
[null,58,{"$f":"VLOOKUP($B63, 'Data Inputs'!$B$5:$F$214, 2, TRUE)","v":""},{"$f":"VLOOKUP($B63, 'Data Inputs'!$B$5:$F$648, 3, TRUE)","v":""},{"$f":"VLOOKUP($B63, 'Data Inputs'!$B$5:$F$648, 4, TRUE)","v":""},null,null,{"$f":"IF(ISNUMBER(VLOOKUP($B63, 'Data Inputs'!$B$5:$F$648, 5, FALSE))=TRUE, VLOOKUP($B63, 'Data Inputs'!$B$5:$F$648, 5, FALSE), \"\")","v":""},{"$f":"IF(ISNUMBER(VLOOKUP($B63, 'Data Inputs'!$B$5:$H$648, 6, FALSE))=TRUE, VLOOKUP($B63, 'Data Inputs'!$B$5:$H$648, 6, FALSE), \"\")","v":""},{"$f":"IF(ISNUMBER(VLOOKUP($B63, 'Data Inputs'!$B$5:$H$648, 7, FALSE))=TRUE, VLOOKUP($B63, 'Data Inputs'!$B$5:$H$648, 7, FALSE), \"\")","v":""},65,"","",""]
[null,59,{"$f":"VLOOKUP($B64, 'Data Inputs'!$B$5:$F$214, 2, TRUE)","v":""},{"$f":"VLOOKUP($B64, 'Data Inputs'!$B$5:$F$648, 3, TRUE)","v":""},{"$f":"VLOOKUP($B64, 'Data Inputs'!$B$5:$F$648, 4, TRUE)","v":""},null,null,{"$f":"IF(ISNUMBER(VLOOKUP($B64, 'Data Inputs'!$B$5:$F$648, 5, FALSE))=TRUE, VLOOKUP($B64, 'Data Inputs'!$B$5:$F$648, 5, FALSE), \"\")","v":""},{"$f":"IF(ISNUMBER(VLOOKUP($B64, 'Data Inputs'!$B$5:$H$648, 6, FALSE))=TRUE, VLOOKUP($B64, 'Data Inputs'!$B$5:$H$648, 6, FALSE), \"\")","v":""},{"$f":"IF(ISNUMBER(VLOOKUP($B64, 'Data Inputs'!$B$5:$H$648, 7, FALSE))=TRUE, VLOOKUP($B64, 'Data Inputs'!$B$5:$H$648, 7, FALSE), \"\")","v":""},65,"","",""]
[null,60,{"$f":"VLOOKUP($B65, 'Data Inputs'!$B$5:$F$214, 2, TRUE)","v":""},{"$f":"VLOOKUP($B65, 'Data Inputs'!$B$5:$F$648, 3, TRUE)","v":""},{"$f":"VLOOKUP($B65, 'Data Inputs'!$B$5:$F$648, 4, TRUE)","v":""},null,null,{"$f":"IF(ISNUMBER(VLOOKUP($B65, 'Data Inputs'!$B$5:$F$648, 5, FALSE))=TRUE, VLOOKUP($B65, 'Data Inputs'!$B$5:$F$648, 5, FALSE), \"\")","v":""},{"$f":"IF(ISNUMBER(VLOOKUP($B65, 'Data Inputs'!$B$5:$H$648, 6, FALSE))=TRUE, VLOOKUP($B65, 'Data Inputs'!$B$5:$H$648, 6, FALSE), \"\")","v":""},{"$f":"IF(ISNUMBER(VLOOKUP($B65, 'Data Inputs'!$B$5:$H$648, 7, FALSE))=TRUE, VLOOKUP($B65, 'Data Inputs'!$B$5:$H$648, 7, FALSE), \"\")","v":""},65,"","",""]
[]
[]
[]
[null,null,null,null,null,null,null,null,null,null,{"$f":"MAX('Data Inputs'!$F$5:$F$206)","v":65}]
[]
[]
[null,"Land Use"]
[null,"Right",-0.03,-0.03]
[null,{"$f":"IF('Basic Input'!#REF!=\"\",\"\", IF('Basic Input'!$F17=\"Right\",'Basic Input'!#REF!, \"\"))","v":{"$error":"#REF!"}},{"$f":"IF('Basic Input'!#REF!=\"\",\"\", IF('Basic Input'!$F17=\"Right\",'Basic Input'!#REF!+95, \"\"))","v":{"$error":"#REF!"}},{"$f":"IF('Basic Input'!#REF!=\"\",\"\", IF('Basic Input'!$F17=\"Right\",'Basic Input'!#REF!-95, \"\"))","v":{"$error":"#REF!"}},{"$f":"IF('Basic Input'!F17=\"\",\"\", IF('Basic Input'!$F17=\"Right\",'Basic Input'!F17, \"\"))","v":""}]
[null,{"$f":"IF('Basic Input'!#REF!=\"\",\"\", IF('Basic Input'!$F18=\"Right\",'Basic Input'!#REF!, \"\"))","v":{"$error":"#REF!"}},{"$f":"IF('Basic Input'!#REF!=\"\",\"\", IF('Basic Input'!$F18=\"Right\",'Basic Input'!#REF!+95, \"\"))","v":{"$error":"#REF!"}},{"$f":"IF('Basic Input'!#REF!=\"\",\"\", IF('Basic Input'!$F18=\"Right\",'Basic Input'!#REF!-95, \"\"))","v":{"$error":"#REF!"}},{"$f":"IF('Basic Input'!F18=\"\",\"\", IF('Basic Input'!$F18=\"Right\",'Basic Input'!F18, \"\"))","v":""}]
[null,{"$f":"IF('Basic Input'!#REF!=\"\",\"\", IF('Basic Input'!$F19=\"Right\",'Basic Input'!#REF!, \"\"))","v":{"$error":"#REF!"}},{"$f":"IF('Basic Input'!#REF!=\"\",\"\", IF('Basic Input'!$F19=\"Right\",'Basic Input'!#REF!+95, \"\"))","v":{"$error":"#REF!"}},{"$f":"IF('Basic Input'!#REF!=\"\",\"\", IF('Basic Input'!$F19=\"Right\",'Basic Input'!#REF!-95, \"\"))","v":{"$error":"#REF!"}},{"$f":"IF('Basic Input'!F19=\"\",\"\", IF('Basic Input'!$F19=\"Right\",'Basic Input'!F19, \"\"))","v":""}]
[null,{"$f":"IF('Basic Input'!#REF!=\"\",\"\", IF('Basic Input'!$F20=\"Right\",'Basic Input'!#REF!, \"\"))","v":{"$error":"#REF!"}},{"$f":"IF('Basic Input'!#REF!=\"\",\"\", IF('Basic Input'!$F20=\"Right\",'Basic Input'!#REF!+95, \"\"))","v":{"$error":"#REF!"}},{"$f":"IF('Basic Input'!#REF!=\"\",\"\", IF('Basic Input'!$F20=\"Right\",'Basic Input'!#REF!-95, \"\"))","v":{"$error":"#REF!"}},{"$f":"IF('Basic Input'!F20=\"\",\"\", IF('Basic Input'!$F20=\"Right\",'Basic Input'!F20, \"\"))","v":""}]
[null,{"$f":"IF('Basic Input'!#REF!=\"\",\"\", IF('Basic Input'!$F21=\"Right\",'Basic Input'!#REF!, \"\"))","v":{"$error":"#REF!"}},{"$f":"IF('Basic Input'!#REF!=\"\",\"\", IF('Basic Input'!$F21=\"Right\",'Basic Input'!#REF!+95, \"\"))","v":{"$error":"#REF!"}},{"$f":"IF('Basic Input'!#REF!=\"\",\"\", IF('Basic Input'!$F21=\"Right\",'Basic Input'!#REF!-95, \"\"))","v":{"$error":"#REF!"}},{"$f":"IF('Basic Input'!F21=\"\",\"\", IF('Basic Input'!$F21=\"Right\",'Basic Input'!F21, \"\"))","v":""}]
[null,{"$f":"IF('Basic Input'!#REF!=\"\",\"\", IF('Basic Input'!$F22=\"Right\",'Basic Input'!#REF!, \"\"))","v":{"$error":"#REF!"}},{"$f":"IF('Basic Input'!#REF!=\"\",\"\", IF('Basic Input'!$F22=\"Right\",'Basic Input'!#REF!+95, \"\"))","v":{"$error":"#REF!"}},{"$f":"IF('Basic Input'!#REF!=\"\",\"\", IF('Basic Input'!$F22=\"Right\",'Basic Input'!#REF!-95, \"\"))","v":{"$error":"#REF!"}},{"$f":"IF('Basic Input'!F22=\"\",\"\", IF('Basic Input'!$F22=\"Right\",'Basic Input'!F22, \"\"))","v":""}]
[null,{"$f":"IF('Basic Input'!#REF!=\"\",\"\", IF('Basic Input'!$F23=\"Right\",'Basic Input'!#REF!, \"\"))","v":{"$error":"#REF!"}},{"$f":"IF('Basic Input'!#REF!=\"\",\"\", IF('Basic Input'!$F23=\"Right\",'Basic Input'!#REF!+95, \"\"))","v":{"$error":"#REF!"}},{"$f":"IF('Basic Input'!#REF!=\"\",\"\", IF('Basic Input'!$F23=\"Right\",'Basic Input'!#REF!-95, \"\"))","v":{"$error":"#REF!"}},{"$f":"IF('Basic Input'!F23=\"\",\"\", IF('Basic Input'!$F23=\"Right\",'Basic Input'!F23, \"\"))","v":""}]
[null,{"$f":"IF('Basic Input'!#REF!=\"\",\"\", IF('Basic Input'!$F24=\"Right\",'Basic Input'!#REF!, \"\"))","v":{"$error":"#REF!"}},{"$f":"IF('Basic Input'!#REF!=\"\",\"\", IF('Basic Input'!$F24=\"Right\",'Basic Input'!#REF!+95, \"\"))","v":{"$error":"#REF!"}},{"$f":"IF('Basic Input'!#REF!=\"\",\"\", IF('Basic Input'!$F24=\"Right\",'Basic Input'!#REF!-95, \"\"))","v":{"$error":"#REF!"}},{"$f":"IF('Basic Input'!F24=\"\",\"\", IF('Basic Input'!$F24=\"Right\",'Basic Input'!F24, \"\"))","v":""}]
[null,{"$f":"IF('Basic Input'!#REF!=\"\",\"\", IF('Basic Input'!$F25=\"Right\",'Basic Input'!#REF!, \"\"))","v":{"$error":"#REF!"}},{"$f":"IF('Basic Input'!#REF!=\"\",\"\", IF('Basic Input'!$F25=\"Right\",'Basic Input'!#REF!+95, \"\"))","v":{"$error":"#REF!"}},{"$f":"IF('Basic Input'!#REF!=\"\",\"\", IF('Basic Input'!$F25=\"Right\",'Basic Input'!#REF!-95, \"\"))","v":{"$error":"#REF!"}},{"$f":"IF('Basic Input'!F25=\"\",\"\", IF('Basic Input'!$F25=\"Right\",'Basic Input'!F25, \"\"))","v":""}]
[null,{"$f":"IF('Basic Input'!#REF!=\"\",\"\", IF('Basic Input'!$F26=\"Right\",'Basic Input'!#REF!, \"\"))","v":{"$error":"#REF!"}},{"$f":"IF('Basic Input'!#REF!=\"\",\"\", IF('Basic Input'!$F26=\"Right\",'Basic Input'!#REF!+95, \"\"))","v":{"$error":"#REF!"}},{"$f":"IF('Basic Input'!#REF!=\"\",\"\", IF('Basic Input'!$F26=\"Right\",'Basic Input'!#REF!-95, \"\"))","v":{"$error":"#REF!"}},{"$f":"IF('Basic Input'!F26=\"\",\"\", IF('Basic Input'!$F26=\"Right\",'Basic Input'!F26, \"\"))","v":""}]
[null,"Left",0.03,0.03]
[null,{"$f":"IF('Basic Input'!#REF!=\"\",\"\", IF('Basic Input'!$F17=\"Left\",'Basic Input'!#REF!, \"\"))","v":{"$error":"#REF!"}},{"$f":"IF('Basic Input'!#REF!=\"\",\"\", IF('Basic Input'!$F17=\"Left\",'Basic Input'!#REF!+95, \"\"))","v":{"$error":"#REF!"}},{"$f":"IF('Basic Input'!#REF!=\"\",\"\", IF('Basic Input'!$F17=\"Left\",'Basic Input'!#REF!-95, \"\"))","v":{"$error":"#REF!"}},{"$f":"IF('Basic Input'!F17=\"\",\"\", IF('Basic Input'!$F17=\"Left\",'Basic Input'!F17, \"\"))","v":""}]
[null,{"$f":"IF('Basic Input'!#REF!=\"\",\"\", IF('Basic Input'!$F18=\"Left\",'Basic Input'!#REF!, \"\"))","v":{"$error":"#REF!"}},{"$f":"IF('Basic Input'!#REF!=\"\",\"\", IF('Basic Input'!$F18=\"Left\",'Basic Input'!#REF!+95, \"\"))","v":{"$error":"#REF!"}},{"$f":"IF('Basic Input'!#REF!=\"\",\"\", IF('Basic Input'!$F18=\"Left\",'Basic Input'!#REF!-95, \"\"))","v":{"$error":"#REF!"}},{"$f":"IF('Basic Input'!F18=\"\",\"\", IF('Basic Input'!$F18=\"Left\",'Basic Input'!F18, \"\"))","v":""}]
[null,{"$f":"IF('Basic Input'!#REF!=\"\",\"\", IF('Basic Input'!$F19=\"Left\",'Basic Input'!#REF!, \"\"))","v":{"$error":"#REF!"}},{"$f":"IF('Basic Input'!#REF!=\"\",\"\", IF('Basic Input'!$F19=\"Left\",'Basic Input'!#REF!+95, \"\"))","v":{"$error":"#REF!"}},{"$f":"IF('Basic Input'!#REF!=\"\",\"\", IF('Basic Input'!$F19=\"Left\",'Basic Input'!#REF!-95, \"\"))","v":{"$error":"#REF!"}},{"$f":"IF('Basic Input'!F19=\"\",\"\", IF('Basic Input'!$F19=\"Left\",'Basic Input'!F19, \"\"))","v":""}]
[null,{"$f":"IF('Basic Input'!#REF!=\"\",\"\", IF('Basic Input'!$F20=\"Left\",'Basic Input'!#REF!, \"\"))","v":{"$error":"#REF!"}},{"$f":"IF('Basic Input'!#REF!=\"\",\"\", IF('Basic Input'!$F20=\"Left\",'Basic Input'!#REF!+95, \"\"))","v":{"$error":"#REF!"}},{"$f":"IF('Basic Input'!#REF!=\"\",\"\", IF('Basic Input'!$F20=\"Left\",'Basic Input'!#REF!-95, \"\"))","v":{"$error":"#REF!"}},{"$f":"IF('Basic Input'!F20=\"\",\"\", IF('Basic Input'!$F20=\"Left\",'Basic Input'!F20, \"\"))","v":""}]
[null,{"$f":"IF('Basic Input'!#REF!=\"\",\"\", IF('Basic Input'!$F21=\"Left\",'Basic Input'!#REF!, \"\"))","v":{"$error":"#REF!"}},{"$f":"IF('Basic Input'!#REF!=\"\",\"\", IF('Basic Input'!$F21=\"Left\",'Basic Input'!#REF!+95, \"\"))","v":{"$error":"#REF!"}},{"$f":"IF('Basic Input'!#REF!=\"\",\"\", IF('Basic Input'!$F21=\"Left\",'Basic Input'!#REF!-95, \"\"))","v":{"$error":"#REF!"}},{"$f":"IF('Basic Input'!F21=\"\",\"\", IF('Basic Input'!$F21=\"Left\",'Basic Input'!F21, \"\"))","v":""}]
[null,{"$f":"IF('Basic Input'!#REF!=\"\",\"\", IF('Basic Input'!$F22=\"Left\",'Basic Input'!#REF!, \"\"))","v":{"$error":"#REF!"}},{"$f":"IF('Basic Input'!#REF!=\"\",\"\", IF('Basic Input'!$F22=\"Left\",'Basic Input'!#REF!+95, \"\"))","v":{"$error":"#REF!"}},{"$f":"IF('Basic Input'!#REF!=\"\",\"\", IF('Basic Input'!$F22=\"Left\",'Basic Input'!#REF!-95, \"\"))","v":{"$error":"#REF!"}},{"$f":"IF('Basic Input'!F22=\"\",\"\", IF('Basic Input'!$F22=\"Left\",'Basic Input'!F22, \"\"))","v":""}]
[null,{"$f":"IF('Basic Input'!#REF!=\"\",\"\", IF('Basic Input'!$F23=\"Left\",'Basic Input'!#REF!, \"\"))","v":{"$error":"#REF!"}},{"$f":"IF('Basic Input'!#REF!=\"\",\"\", IF('Basic Input'!$F23=\"Left\",'Basic Input'!#REF!+95, \"\"))","v":{"$error":"#REF!"}},{"$f":"IF('Basic Input'!#REF!=\"\",\"\", IF('Basic Input'!$F23=\"Left\",'Basic Input'!#REF!-95, \"\"))","v":{"$error":"#REF!"}},{"$f":"IF('Basic Input'!F23=\"\",\"\", IF('Basic Input'!$F23=\"Left\",'Basic Input'!F23, \"\"))","v":""}]
[null,{"$f":"IF('Basic Input'!#REF!=\"\",\"\", IF('Basic Input'!$F24=\"Left\",'Basic Input'!#REF!, \"\"))","v":{"$error":"#REF!"}},{"$f":"IF('Basic Input'!#REF!=\"\",\"\", IF('Basic Input'!$F24=\"Left\",'Basic Input'!#REF!+95, \"\"))","v":{"$error":"#REF!"}},{"$f":"IF('Basic Input'!#REF!=\"\",\"\", IF('Basic Input'!$F24=\"Left\",'Basic Input'!#REF!-95, \"\"))","v":{"$error":"#REF!"}},{"$f":"IF('Basic Input'!F24=\"\",\"\", IF('Basic Input'!$F24=\"Left\",'Basic Input'!F24, \"\"))","v":""}]
[null,{"$f":"IF('Basic Input'!#REF!=\"\",\"\", IF('Basic Input'!$F25=\"Left\",'Basic Input'!#REF!, \"\"))","v":{"$error":"#REF!"}},{"$f":"IF('Basic Input'!#REF!=\"\",\"\", IF('Basic Input'!$F25=\"Left\",'Basic Input'!#REF!+95, \"\"))","v":{"$error":"#REF!"}},{"$f":"IF('Basic Input'!#REF!=\"\",\"\", IF('Basic Input'!$F25=\"Left\",'Basic Input'!#REF!-95, \"\"))","v":{"$error":"#REF!"}},{"$f":"IF('Basic Input'!F25=\"\",\"\", IF('Basic Input'!$F25=\"Left\",'Basic Input'!F25, \"\"))","v":""}]
[null,{"$f":"IF('Basic Input'!#REF!=\"\",\"\", IF('Basic Input'!$F26=\"Left\",'Basic Input'!#REF!, \"\"))","v":{"$error":"#REF!"}},{"$f":"IF('Basic Input'!#REF!=\"\",\"\", IF('Basic Input'!$F26=\"Left\",'Basic Input'!#REF!+95, \"\"))","v":{"$error":"#REF!"}},{"$f":"IF('Basic Input'!#REF!=\"\",\"\", IF('Basic Input'!$F26=\"Left\",'Basic Input'!#REF!-95, \"\"))","v":{"$error":"#REF!"}},{"$f":"IF('Basic Input'!F26=\"\",\"\", IF('Basic Input'!$F26=\"Left\",'Basic Input'!F26, \"\"))","v":""}]

{"sheet":"Working Data - HZ","index":5,"n_rows":184,"n_cols":19,"rows_kept":184,"cut":false,"hidden":true,"merged":[]}
[null,"WORKING DATA -- DO NOT MODIFY"]
[]
[]
[null,null,"Distance (miles)","Distance (feet)","Mile Post","Curve Radius (ft)","Horizontal Curvature",null,null,null,null,null,null,null,"LABELS"]
[null,null,-0.18939393939393939,-1000,5.1606060606060602,0,{"$f":"IF(F5=\"\", NA(), IF(F5=0, 0, 1000/F5))","v":0},null,null,null,null,null,null,null,{"$f":"IF('Basic Input'!C51<>\"\", 'Basic Input'!C51, \"\")","v":"Tangent"},{"$f":"IF(O5=\"\",NA(),('Basic Input'!D51+'Basic Input'!D51)/2)","v":-1000},{"$f":"IF(O5=\"\", NA(), IF('Basic Input'!C51=\"Curve Right\", -1, 1))","v":1},{"$f":"IF(P5=\"\", NA(), IF('Basic Input'!F51=0,0, Q5*1000/'Basic Input'!F51))","v":0},{"$f":"IF('Basic Input'!F51<>\"\", 'Basic Input'!F51, \"\")","v":0}]
[null,null,-0.18939393939393939,-1000,5.1606060606060602,0,{"$f":"IF(F6=\"\", NA(), IF(F6=0, 0, 1000/F6))","v":0},null,null,null,null,null,null,null,{"$f":"IF('Basic Input'!C52<>\"\", 'Basic Input'!C52, \"\")","v":""},{"$f":"IF(O6=\"\",NA(),('Basic Input'!D52+'Basic Input'!D52)/2)","v":{"$error":"#N/A"}},{"$f":"IF(O6=\"\", NA(), IF('Basic Input'!C52=\"Curve Right\", -1, 1))","v":{"$error":"#N/A"}},{"$f":"IF(P6=\"\", NA(), IF('Basic Input'!F52=0,0, Q6*1000/'Basic Input'!F52))","v":{"$error":"#N/A"}},{"$f":"IF('Basic Input'!F52<>\"\", 'Basic Input'!F52, \"\")","v":""}]
[null,null,-0.17045454545454544,-900,5.1795454545454538,0,0,null,null,null,null,null,null,null,{"$f":"IF('Basic Input'!C53<>\"\", 'Basic Input'!C53, \"\")","v":""},{"$f":"IF(O7=\"\",NA(),('Basic Input'!D53+'Basic Input'!D53)/2)","v":{"$error":"#N/A"}},{"$f":"IF(O7=\"\", NA(), IF('Basic Input'!C53=\"Curve Right\", -1, 1))","v":{"$error":"#N/A"}},{"$f":"IF(P7=\"\", NA(), IF('Basic Input'!F53=0,0, Q7*1000/'Basic Input'!F53))","v":{"$error":"#N/A"}},{"$f":"IF('Basic Input'!F53<>\"\", 'Basic Input'!F53, \"\")","v":""}]
[null,null,-0.15151515151515152,-800,5.1984848484848483,0,0,null,null,null,null,null,null,null,{"$f":"IF('Basic Input'!C54<>\"\", 'Basic Input'!C54, \"\")","v":""},{"$f":"IF(O8=\"\",NA(),('Basic Input'!D54+'Basic Input'!D54)/2)","v":{"$error":"#N/A"}},{"$f":"IF(O8=\"\", NA(), IF('Basic Input'!C54=\"Curve Right\", -1, 1))","v":{"$error":"#N/A"}},{"$f":"IF(P8=\"\", NA(), IF('Basic Input'!F54=0,0, Q8*1000/'Basic Input'!F54))","v":{"$error":"#N/A"}},{"$f":"IF('Basic Input'!F54<>\"\", 'Basic Input'!F54, \"\")","v":""}]
[null,null,-0.13257575757575757,-700,5.2174242424242419,0,0,null,null,null,null,null,null,null,{"$f":"IF('Basic Input'!C55<>\"\", 'Basic Input'!C55, \"\")","v":""},{"$f":"IF(O9=\"\",NA(),('Basic Input'!D55+'Basic Input'!D55)/2)","v":{"$error":"#N/A"}},{"$f":"IF(O9=\"\", NA(), IF('Basic Input'!C55=\"Curve Right\", -1, 1))","v":{"$error":"#N/A"}},{"$f":"IF(P9=\"\", NA(), IF('Basic Input'!F55=0,0, Q9*1000/'Basic Input'!F55))","v":{"$error":"#N/A"}},{"$f":"IF('Basic Input'!F55<>\"\", 'Basic Input'!F55, \"\")","v":""}]
[null,null,-0.11363636363636363,-600,5.2363636363636363,0,0,null,null,null,null,null,null,null,{"$f":"IF('Basic Input'!C56<>\"\", 'Basic Input'!C56, \"\")","v":""},{"$f":"IF(O10=\"\",NA(),('Basic Input'!D56+'Basic Input'!D56)/2)","v":{"$error":"#N/A"}},{"$f":"IF(O10=\"\", NA(), IF('Basic Input'!C56=\"Curve Right\", -1, 1))","v":{"$error":"#N/A"}},{"$f":"IF(P10=\"\", NA(), IF('Basic Input'!F56=0,0, Q10*1000/'Basic Input'!F56))","v":{"$error":"#N/A"}},{"$f":"IF('Basic Input'!F56<>\"\", 'Basic Input'!F56, \"\")","v":""}]
[null,null,-9.4696969696969696E-2,-500,5.2553030303030299,0,0,null,null,null,null,null,null,null,{"$f":"IF('Basic Input'!C57<>\"\", 'Basic Input'!C57, \"\")","v":""},{"$f":"IF(O11=\"\",NA(),('Basic Input'!D57+'Basic Input'!D57)/2)","v":{"$error":"#N/A"}},{"$f":"IF(O11=\"\", NA(), IF('Basic Input'!C57=\"Curve Right\", -1, 1))","v":{"$error":"#N/A"}},{"$f":"IF(P11=\"\", NA(), IF('Basic Input'!F57=0,0, Q11*1000/'Basic Input'!F57))","v":{"$error":"#N/A"}},{"$f":"IF('Basic Input'!F57<>\"\", 'Basic Input'!F57, \"\")","v":""}]
[null,null,-7.575757575757576E-2,-400,5.2742424242424235,0,0,null,null,null,null,null,null,null,{"$f":"IF('Basic Input'!C58<>\"\", 'Basic Input'!C58, \"\")","v":""},{"$f":"IF(O12=\"\",NA(),('Basic Input'!D58+'Basic Input'!D58)/2)","v":{"$error":"#N/A"}},{"$f":"IF(O12=\"\", NA(), IF('Basic Input'!C58=\"Curve Right\", -1, 1))","v":{"$error":"#N/A"}},{"$f":"IF(P12=\"\", NA(), IF('Basic Input'!F58=0,0, Q12*1000/'Basic Input'!F58))","v":{"$error":"#N/A"}},{"$f":"IF('Basic Input'!F58<>\"\", 'Basic Input'!F58, \"\")","v":""}]
[null,null,-5.6818181818181816E-2,-300,5.293181818181818,0,0,null,null,null,null,null,null,null,{"$f":"IF('Basic Input'!C59<>\"\", 'Basic Input'!C59, \"\")","v":""},{"$f":"IF(O13=\"\",NA(),('Basic Input'!D59+'Basic Input'!D59)/2)","v":{"$error":"#N/A"}},{"$f":"IF(O13=\"\", NA(), IF('Basic Input'!C59=\"Curve Right\", -1, 1))","v":{"$error":"#N/A"}},{"$f":"IF(P13=\"\", NA(), IF('Basic Input'!F59=0,0, Q13*1000/'Basic Input'!F59))","v":{"$error":"#N/A"}},{"$f":"IF('Basic Input'!F59<>\"\", 'Basic Input'!F59, \"\")","v":""}]
[null,null,-3.787878787878788E-2,-200,5.3121212121212116,0,0,null,null,null,null,null,null,null,{"$f":"IF('Basic Input'!C60<>\"\", 'Basic Input'!C60, \"\")","v":""},{"$f":"IF(O14=\"\",NA(),('Basic Input'!D60+'Basic Input'!D60)/2)","v":{"$error":"#N/A"}},{"$f":"IF(O14=\"\", NA(), IF('Basic Input'!C60=\"Curve Right\", -1, 1))","v":{"$error":"#N/A"}},{"$f":"IF(P14=\"\", NA(), IF('Basic Input'!F60=0,0, Q14*1000/'Basic Input'!F60))","v":{"$error":"#N/A"}},{"$f":"IF('Basic Input'!F60<>\"\", 'Basic Input'!F60, \"\")","v":""}]
[null,null,-1.893939393939394E-2,-100,5.3310606060606061,0,0]
[null,null,0,0,5.35,0,0]
[null,null,1.893939393939394E-2,100,5.3689393939393932,0,0]
[null,null,3.787878787878788E-2,200,5.3878787878787877,0,0]
[null,null,5.6818181818181816E-2,300,5.4068181818181813,0,0]
[null,null,7.575757575757576E-2,400,5.4257575757575758,0,0]
[null,null,9.4696969696969696E-2,500,5.4446969696969694,0,0]
[null,null,0.11363636363636363,600,5.463636363636363,0,0]
[null,null,0.13257575757575757,700,5.4825757575757574,0,0]
[null,null,0.15151515151515152,800,5.501515151515151,0,0]
[null,null,0.17045454545454544,900,5.5204545454545455,0,0]
[null,null,0.18939393939393939,1000,5.5393939393939391,0,0]
[null,null,0.20833333333333334,1100,5.5583333333333327,0,0]
[null,null,0.22727272727272727,1200,5.5772727272727272,0,0]
[null,null,0.24621212121212122,1300,5.5962121212121207,0,0]
[null,null,0.26515151515151514,1400,5.6151515151515152,0,0]
[null,null,0.28409090909090912,1500,5.6340909090909088,0,0]
[null,null,0.30303030303030304,1600,5.6530303030303024,0,0]
[null,null,0.32196969696969696,1700,5.6719696969696969,0,0]
[null,null,0.34090909090909088,1800,5.6909090909090905,0,0]
[null,null,0.35984848484848486,1900,5.7098484848484841,0,0]
[null,null,0.37878787878787878,2000,5.7287878787878785,0,0]
[null,null,0.39772727272727271,2100,5.7477272727272721,0,0]
[null,null,0.41666666666666669,2200,5.7666666666666666,0,0]
[null,null,0.43560606060606061,2300,5.7856060606060602,0,0]
[null,null,0.45454545454545453,2400,5.8045454545454538,0,0]
[null,null,0.47348484848484851,2500,5.8234848484848483,0,0]
[null,null,0.49242424242424243,2600,5.8424242424242419,0,0]
[null,null,0.51136363636363635,2700,5.8613636363636363,0,0]
[null,null,0.53030303030303028,2800,5.8803030303030299,0,0]
[null,null,0.5492424242424242,2900,5.8992424242424235,0,0]
[null,null,0.56818181818181823,3000,5.918181818181818,0,0]
[null,null,0.58712121212121215,3100,5.9371212121212116,0,0]
[null,null,0.60606060606060608,3200,5.9560606060606061,0,0]
[null,null,0.625,3300,5.9749999999999996,0,0]
[null,null,0.64393939393939392,3400,5.9939393939393932,0,0]
[null,null,0.66287878787878785,3500,6.0128787878787877,0,0]
[null,null,0.66287878787878785,3500,6.0128787878787877,0,0]
[null,null,0.68181818181818177,3600,6.0318181818181813,null,{"$error":"#N/A"}]
[null,null,0.7007575757575758,3700,6.0507575757575758,null,{"$error":"#N/A"}]
[null,null,0.71969696969696972,3800,6.0696969696969694,null,{"$error":"#N/A"}]
[null,null,0.73863636363636365,3900,6.088636363636363,null,{"$error":"#N/A"}]
[null,null,0.75757575757575757,4000,6.1075757575757574,null,{"$error":"#N/A"}]
[null,null,0.77651515151515149,4100,6.126515151515151,null,{"$error":"#N/A"}]
[null,null,0.79545454545454541,4200,6.1454545454545446,null,{"$error":"#N/A"}]
[null,null,0.81439393939393945,4300,6.1643939393939391,null,{"$error":"#N/A"}]
[null,null,0.83333333333333337,4400,6.1833333333333327,null,{"$error":"#N/A"}]
[null,null,0.85227272727272729,4500,6.2022727272727272,null,{"$error":"#N/A"}]
[null,null,0.87121212121212122,4600,6.2212121212121207,null,{"$error":"#N/A"}]
[null,null,0.89015151515151514,4700,6.2401515151515152,null,{"$error":"#N/A"}]
[null,null,0.90909090909090906,4800,6.2590909090909088,null,{"$error":"#N/A"}]
[null,null,0.92803030303030298,4900,6.2780303030303024,null,{"$error":"#N/A"}]
[null,null,0.94696969696969702,5000,6.2969696969696969,null,{"$error":"#N/A"}]
[null,null,0.89015151515151514,4700,0.89015151515151514,null,{"$error":"#N/A"}]
[null,null,0.90909090909090906,4800,0.90909090909090906,null,{"$error":"#N/A"}]
[null,null,0.92803030303030298,4900,0.92803030303030298,null,{"$f":"IF(F70=\"\", NA(), IF(F70=0, 0, 1000/F70))","v":{"$error":"#N/A"}}]
[null,null,0.94696969696969702,5000,0.94696969696969702,null,{"$error":"#N/A"}]
[null,null,0.89015151515151514,4700,53.790151515151514,null,{"$error":"#N/A"}]
[null,null,0.90909090909090906,4800,53.809090909090905,null,{"$error":"#N/A"}]
[null,null,0.92803030303030298,4900,53.828030303030303,null,{"$error":"#N/A"}]
[null,null,0.94696969696969702,5000,53.846969696969694,null,{"$error":"#N/A"}]
[null,null,0.94696969696969702,5000,53.846969696969694,null,{"$error":"#N/A"}]
[null,null,null,null,null,null,{"$error":"#N/A"}]
[null,null,null,null,null,null,{"$error":"#N/A"}]
[null,null,null,null,null,null,{"$error":"#N/A"}]
[null,null,null,null,null,null,{"$error":"#N/A"}]
[null,null,null,null,null,null,{"$error":"#N/A"}]
[null,null,null,null,null,null,{"$error":"#N/A"}]
[null,null,null,null,null,null,{"$error":"#N/A"}]
[null,null,null,null,null,null,{"$error":"#N/A"}]
[null,null,null,null,null,null,{"$error":"#N/A"}]
[null,null,null,null,null,null,{"$error":"#N/A"}]
[null,null,null,null,null,null,{"$error":"#N/A"}]
[null,null,null,null,null,null,{"$error":"#N/A"}]
[null,null,null,null,null,null,{"$error":"#N/A"}]
[null,null,null,null,null,null,{"$error":"#N/A"}]
[null,null,null,null,null,null,{"$error":"#N/A"}]
[null,null,null,null,null,null,{"$error":"#N/A"}]
[null,null,null,null,null,null,{"$error":"#N/A"}]
[null,null,null,null,null,null,{"$error":"#N/A"}]
[null,null,null,null,null,null,{"$error":"#N/A"}]
[null,null,null,null,null,null,{"$error":"#N/A"}]
[null,null,null,null,null,null,{"$error":"#N/A"}]
[null,null,null,null,null,null,{"$error":"#N/A"}]
[null,null,null,null,null,null,{"$error":"#N/A"}]
[null,null,null,null,null,null,{"$error":"#N/A"}]
[null,null,null,null,null,null,{"$error":"#N/A"}]
[null,null,null,null,null,null,{"$error":"#N/A"}]
[null,null,null,null,null,null,{"$error":"#N/A"}]
[null,null,null,null,null,null,{"$error":"#N/A"}]
[null,null,null,null,null,null,{"$error":"#N/A"}]
[null,null,null,null,null,null,{"$error":"#N/A"}]
[null,null,null,null,null,null,{"$error":"#N/A"}]
[null,null,null,null,null,null,{"$error":"#N/A"}]
[null,null,null,null,null,null,{"$error":"#N/A"}]
[null,null,null,null,null,null,{"$error":"#N/A"}]
[null,null,null,null,null,null,{"$error":"#N/A"}]
[null,null,null,null,null,null,{"$error":"#N/A"}]
[null,null,null,null,null,null,{"$error":"#N/A"}]
[null,null,null,null,null,null,{"$error":"#N/A"}]
[null,null,null,null,null,null,{"$error":"#N/A"}]
[null,null,null,null,null,null,{"$error":"#N/A"}]
[null,null,null,null,null,null,{"$error":"#N/A"}]
[null,null,null,null,null,null,{"$error":"#N/A"}]
[null,null,null,null,null,null,{"$error":"#N/A"}]
[null,null,null,null,null,null,{"$error":"#N/A"}]
[null,null,null,null,null,null,{"$error":"#N/A"}]
[null,null,null,null,null,null,{"$error":"#N/A"}]
[null,null,null,null,null,null,{"$error":"#N/A"}]
[null,null,null,null,null,null,{"$error":"#N/A"}]
[null,null,null,null,null,null,{"$error":"#N/A"}]
[null,null,null,null,null,null,{"$error":"#N/A"}]
[null,null,null,null,null,null,{"$error":"#N/A"}]
[null,null,null,null,null,null,{"$error":"#N/A"}]
[null,null,null,null,null,null,{"$error":"#N/A"}]
[null,null,null,null,null,null,{"$error":"#N/A"}]
[null,null,null,null,null,null,{"$error":"#N/A"}]
[null,null,null,null,null,null,{"$error":"#N/A"}]
[null,null,null,null,null,null,{"$error":"#N/A"}]
[null,null,null,null,null,null,{"$f":"IF(F134=\"\", NA(), IF(F134=0, 0, 1000/F134))","v":{"$error":"#N/A"}}]
[null,null,null,null,null,null,{"$error":"#N/A"}]
[null,null,null,null,null,null,{"$error":"#N/A"}]
[null,null,null,null,null,null,{"$error":"#N/A"}]
[null,null,null,null,null,null,{"$error":"#N/A"}]
[null,null,null,null,null,null,{"$error":"#N/A"}]
[null,null,null,null,null,null,{"$error":"#N/A"}]
[null,null,null,null,null,null,{"$error":"#N/A"}]
[null,null,null,null,null,null,{"$error":"#N/A"}]
[null,null,null,null,null,null,{"$error":"#N/A"}]
[null,null,null,null,null,null,{"$error":"#N/A"}]
[null,null,null,null,null,null,{"$error":"#N/A"}]
[null,null,null,null,null,null,{"$error":"#N/A"}]
[null,null,null,null,null,null,{"$error":"#N/A"}]
[null,null,null,null,null,null,{"$error":"#N/A"}]
[null,null,null,null,null,null,{"$error":"#N/A"}]
[null,null,null,null,null,null,{"$error":"#N/A"}]
[null,null,null,null,null,null,{"$error":"#N/A"}]
[null,null,null,null,null,null,{"$error":"#N/A"}]
[null,null,null,null,null,null,{"$error":"#N/A"}]
[null,null,null,null,null,null,{"$error":"#N/A"}]
[null,null,null,null,null,null,{"$error":"#N/A"}]
[null,null,null,null,null,null,{"$error":"#N/A"}]
[null,null,null,null,null,null,{"$error":"#N/A"}]
[null,null,null,null,null,null,{"$error":"#N/A"}]
[null,null,null,null,null,null,{"$error":"#N/A"}]
[null,null,null,null,null,null,{"$error":"#N/A"}]
[null,null,null,null,null,null,{"$error":"#N/A"}]
[null,null,null,null,null,null,{"$error":"#N/A"}]
[null,null,null,null,null,null,{"$error":"#N/A"}]
[null,null,null,null,null,null,{"$error":"#N/A"}]
[null,null,null,null,null,null,{"$error":"#N/A"}]
[null,null,null,null,null,null,{"$error":"#N/A"}]
[null,null,null,null,null,null,{"$error":"#N/A"}]
[null,null,null,null,null,null,{"$error":"#N/A"}]
[null,null,null,null,null,null,{"$error":"#N/A"}]
[null,null,null,null,null,null,{"$error":"#N/A"}]
[null,null,null,null,null,null,{"$error":"#N/A"}]
[null,null,null,null,null,null,{"$error":"#N/A"}]
[null,null,null,null,null,null,{"$error":"#N/A"}]
[null,null,null,null,null,null,{"$error":"#N/A"}]
[null,null,null,null,null,null,{"$error":"#N/A"}]
[null,null,null,null,null,null,{"$error":"#N/A"}]
[null,null,null,null,null,null,{"$error":"#N/A"}]
[null,null,null,null,null,null,{"$error":"#N/A"}]
[null,null,null,null,null,null,{"$error":"#N/A"}]
[null,null,null,null,null,null,{"$error":"#N/A"}]
[null,null,null,null,null,null,{"$error":"#N/A"}]
[null,null,null,null,null,null,{"$error":"#N/A"}]
[null,null,null,null,null,null,{"$error":"#N/A"}]
[null,null,null,null,null,null,{"$error":"#N/A"}]

{"sheet":"Working Data - Vol","index":6,"n_rows":203,"n_cols":7,"rows_kept":203,"cut":false,"hidden":true,"merged":[]}
[null,"WORKING DATA -- DO NOT MODIFY"]
[]
[]
[null,null,"Distance (miles)","Distance (feet)","Mile Post","2 way ADT","Graphable"]
[null,null,-0.18939393939393939,-1000,5.1606060606060602,0,{"$f":"IF(F5=0, NA(), IF(F5=\"\", NA(), F5))","v":{"$error":"#N/A"}}]
[null,null,-0.18939393939393939,-1000,5.1606060606060602,4310,{"$f":"IF(F6=0, NA(), IF(F6=\"\", NA(), F6))","v":4310}]
[null,null,-0.17045454545454544,-900,5.1795454545454538,4310,4310]
[null,null,-0.15151515151515152,-800,5.1984848484848483,4310,4310]
[null,null,-0.13257575757575757,-700,5.2174242424242419,4310,4310]
[null,null,-0.11363636363636363,-600,5.2363636363636363,4310,4310]
[null,null,-9.4696969696969696E-2,-500,5.2553030303030299,4310,4310]
[null,null,-7.575757575757576E-2,-400,5.2742424242424235,4310,4310]
[null,null,-5.6818181818181816E-2,-300,5.293181818181818,4310,4310]
[null,null,-3.787878787878788E-2,-200,5.3121212121212116,4310,4310]
[null,null,-1.893939393939394E-2,-100,5.3310606060606061,4310,4310]
[null,null,0,0,5.35,4310,4310]
[null,null,1.893939393939394E-2,100,5.3689393939393932,4310,4310]
[null,null,3.787878787878788E-2,200,5.3878787878787877,4310,4310]
[null,null,5.6818181818181816E-2,300,5.4068181818181813,4310,4310]
[null,null,7.575757575757576E-2,400,5.4257575757575758,4310,4310]
[null,null,9.4696969696969696E-2,500,5.4446969696969694,4310,4310]
[null,null,0.11363636363636363,600,5.463636363636363,4310,4310]
[null,null,0.13257575757575757,700,5.4825757575757574,4310,4310]
[null,null,0.15151515151515152,800,5.501515151515151,4310,4310]
[null,null,0.17045454545454544,900,5.5204545454545455,4310,4310]
[null,null,0.18939393939393939,1000,5.5393939393939391,4310,4310]
[null,null,0.20833333333333334,1100,5.5583333333333327,4310,4310]
[null,null,0.22727272727272727,1200,5.5772727272727272,4310,4310]
[null,null,0.24621212121212122,1300,5.5962121212121207,4310,4310]
[null,null,0.26515151515151514,1400,5.6151515151515152,4310,4310]
[null,null,0.28409090909090912,1500,5.6340909090909088,4310,4310]
[null,null,0.30303030303030304,1600,5.6530303030303024,4310,4310]
[null,null,0.32196969696969696,1700,5.6719696969696969,4310,4310]
[null,null,0.34090909090909088,1800,5.6909090909090905,4310,4310]
[null,null,0.35984848484848486,1900,5.7098484848484841,4310,4310]
[null,null,0.37878787878787878,2000,5.7287878787878785,4310,4310]
[null,null,0.39772727272727271,2100,5.7477272727272721,4310,4310]
[null,null,0.41666666666666669,2200,5.7666666666666666,4310,4310]
[null,null,0.43560606060606061,2300,5.7856060606060602,4310,4310]
[null,null,0.45454545454545453,2400,5.8045454545454538,4310,4310]
[null,null,0.47348484848484851,2500,5.8234848484848483,4310,4310]
[null,null,0.49242424242424243,2600,5.8424242424242419,4310,4310]
[null,null,0.51136363636363635,2700,5.8613636363636363,4310,4310]
[null,null,0.53030303030303028,2800,5.8803030303030299,4310,4310]
[null,null,0.5492424242424242,2900,5.8992424242424235,4310,4310]
[null,null,0.56818181818181823,3000,5.918181818181818,4310,4310]
[null,null,0.58712121212121215,3100,5.9371212121212116,4310,4310]
[null,null,0.60606060606060608,3200,5.9560606060606061,4310,4310]
[null,null,0.625,3300,5.9749999999999996,4310,4310]
[null,null,0.64393939393939392,3400,5.9939393939393932,4310,4310]
[null,null,0.66287878787878785,3500,6.0128787878787877,4310,4310]
[null,null,0.66287878787878785,3500,6.0128787878787877,0,{"$error":"#N/A"}]
[null,null,0.68181818181818177,3600,6.0318181818181813,null,{"$error":"#N/A"}]
[null,null,0.7007575757575758,3700,6.0507575757575758,null,{"$error":"#N/A"}]
[null,null,0.71969696969696972,3800,6.0696969696969694,null,{"$error":"#N/A"}]
[null,null,0.73863636363636365,3900,6.088636363636363,null,{"$error":"#N/A"}]
[null,null,0.75757575757575757,4000,6.1075757575757574,null,{"$error":"#N/A"}]
[null,null,0.77651515151515149,4100,6.126515151515151,null,{"$error":"#N/A"}]
[null,null,0.79545454545454541,4200,6.1454545454545446,null,{"$error":"#N/A"}]
[null,null,0.81439393939393945,4300,6.1643939393939391,null,{"$error":"#N/A"}]
[null,null,0.83333333333333337,4400,6.1833333333333327,null,{"$error":"#N/A"}]
[null,null,0.85227272727272729,4500,6.2022727272727272,null,{"$error":"#N/A"}]
[null,null,0.87121212121212122,4600,6.2212121212121207,null,{"$error":"#N/A"}]
[null,null,0.89015151515151514,4700,6.2401515151515152,null,{"$error":"#N/A"}]
[null,null,0.90909090909090906,4800,6.2590909090909088,null,{"$error":"#N/A"}]
[null,null,0.92803030303030298,4900,6.2780303030303024,null,{"$error":"#N/A"}]
[null,null,0.94696969696969702,5000,6.2969696969696969,null,{"$error":"#N/A"}]
[null,null,0.94696969696969702,5000,0.94696969696969702,null,{"$error":"#N/A"}]
[null,null,0.94696969696969702,5000,53.846969696969694,null,{"$error":"#N/A"}]
[null,null,0.92803030303030298,4900,53.828030303030303,null,{"$f":"IF(F70=0, NA(), IF(F70=\"\", NA(), F70))","v":{"$error":"#N/A"}}]
[null,null,0.94696969696969702,5000,53.846969696969694,null,{"$error":"#N/A"}]
[null,null,null,null,null,null,{"$error":"#N/A"}]
[null,null,null,null,null,null,{"$error":"#N/A"}]
[null,null,null,null,null,null,{"$error":"#N/A"}]
[null,null,null,null,null,null,{"$error":"#N/A"}]
[null,null,null,null,null,null,{"$error":"#N/A"}]
[null,null,null,null,null,null,{"$error":"#N/A"}]
[null,null,null,null,null,null,{"$error":"#N/A"}]
[null,null,null,null,null,null,{"$error":"#N/A"}]
[null,null,null,null,null,null,{"$error":"#N/A"}]
[null,null,null,null,null,null,{"$error":"#N/A"}]
[null,null,null,null,null,null,{"$error":"#N/A"}]
[null,null,null,null,null,null,{"$error":"#N/A"}]
[null,null,null,null,null,null,{"$error":"#N/A"}]
[null,null,null,null,null,null,{"$error":"#N/A"}]
[null,null,null,null,null,null,{"$error":"#N/A"}]
[null,null,null,null,null,null,{"$error":"#N/A"}]
[null,null,null,null,null,null,{"$error":"#N/A"}]
[null,null,null,null,null,null,{"$error":"#N/A"}]
[null,null,null,null,null,null,{"$error":"#N/A"}]
[null,null,null,null,null,null,{"$error":"#N/A"}]
[null,null,null,null,null,null,{"$error":"#N/A"}]
[null,null,null,null,null,null,{"$error":"#N/A"}]
[null,null,null,null,null,null,{"$error":"#N/A"}]
[null,null,null,null,null,null,{"$error":"#N/A"}]
[null,null,null,null,null,null,{"$error":"#N/A"}]
[null,null,null,null,null,null,{"$error":"#N/A"}]
[null,null,null,null,null,null,{"$error":"#N/A"}]
[null,null,null,null,null,null,{"$error":"#N/A"}]
[null,null,null,null,null,null,{"$error":"#N/A"}]
[null,null,null,null,null,null,{"$error":"#N/A"}]
[null,null,null,null,null,null,{"$error":"#N/A"}]
[null,null,null,null,null,null,{"$error":"#N/A"}]
[null,null,null,null,null,null,{"$error":"#N/A"}]
[null,null,null,null,null,null,{"$error":"#N/A"}]
[null,null,null,null,null,null,{"$error":"#N/A"}]
[null,null,null,null,null,null,{"$error":"#N/A"}]
[null,null,null,null,null,null,{"$error":"#N/A"}]
[null,null,null,null,null,null,{"$error":"#N/A"}]
[null,null,null,null,null,null,{"$error":"#N/A"}]
[null,null,null,null,null,null,{"$error":"#N/A"}]
[null,null,null,null,null,null,{"$error":"#N/A"}]
[null,null,null,null,null,null,{"$error":"#N/A"}]
[null,null,null,null,null,null,{"$error":"#N/A"}]
[null,null,null,null,null,null,{"$error":"#N/A"}]
[null,null,null,null,null,null,{"$error":"#N/A"}]
[null,null,null,null,null,null,{"$error":"#N/A"}]
[null,null,null,null,null,null,{"$error":"#N/A"}]
[null,null,null,null,null,null,{"$error":"#N/A"}]
[null,null,null,null,null,null,{"$error":"#N/A"}]
[null,null,null,null,null,null,{"$error":"#N/A"}]
[null,null,null,null,null,null,{"$error":"#N/A"}]
[null,null,null,null,null,null,{"$error":"#N/A"}]
[null,null,null,null,null,null,{"$error":"#N/A"}]
[null,null,null,null,null,null,{"$error":"#N/A"}]
[null,null,null,null,null,null,{"$error":"#N/A"}]
[null,null,null,null,null,null,{"$error":"#N/A"}]
[null,null,null,null,null,null,{"$error":"#N/A"}]
[null,null,null,null,null,null,{"$error":"#N/A"}]
[null,null,null,null,null,null,{"$error":"#N/A"}]
[null,null,null,null,null,null,{"$error":"#N/A"}]
[null,null,null,null,null,null,{"$error":"#N/A"}]
[null,null,null,null,null,null,{"$error":"#N/A"}]
[null,null,null,null,null,null,{"$f":"IF(F134=0, NA(), IF(F134=\"\", NA(), F134))","v":{"$error":"#N/A"}}]
[null,null,null,null,null,null,{"$error":"#N/A"}]
[null,null,null,null,null,null,{"$error":"#N/A"}]
[null,null,null,null,null,null,{"$error":"#N/A"}]
[null,null,null,null,null,null,{"$error":"#N/A"}]
[null,null,null,null,null,null,{"$error":"#N/A"}]
[null,null,null,null,null,null,{"$error":"#N/A"}]
[null,null,null,null,null,null,{"$error":"#N/A"}]
[null,null,null,null,null,null,{"$error":"#N/A"}]
[null,null,null,null,null,null,{"$error":"#N/A"}]
[null,null,null,null,null,null,{"$error":"#N/A"}]
[null,null,null,null,null,null,{"$error":"#N/A"}]
[null,null,null,null,null,null,{"$error":"#N/A"}]
[null,null,null,null,null,null,{"$error":"#N/A"}]
[null,null,null,null,null,null,{"$error":"#N/A"}]
[null,null,null,null,null,null,{"$error":"#N/A"}]
[null,null,null,null,null,null,{"$error":"#N/A"}]
[null,null,null,null,null,null,{"$error":"#N/A"}]
[null,null,null,null,null,null,{"$error":"#N/A"}]
[null,null,null,null,null,null,{"$error":"#N/A"}]
[null,null,null,null,null,null,{"$error":"#N/A"}]
[null,null,null,null,null,null,{"$error":"#N/A"}]
[null,null,null,null,null,null,{"$error":"#N/A"}]
[null,null,null,null,null,null,{"$error":"#N/A"}]
[null,null,null,null,null,null,{"$error":"#N/A"}]
[null,null,null,null,null,null,{"$error":"#N/A"}]
[null,null,null,null,null,null,{"$error":"#N/A"}]
[null,null,null,null,null,null,{"$error":"#N/A"}]
[null,null,null,null,null,null,{"$error":"#N/A"}]
[null,null,null,null,null,null,{"$error":"#N/A"}]
[null,null,null,null,null,null,{"$error":"#N/A"}]
[null,null,null,null,null,null,{"$error":"#N/A"}]
[null,null,null,null,null,null,{"$error":"#N/A"}]
[null,null,null,null,null,null,{"$error":"#N/A"}]
[null,null,null,null,null,null,{"$error":"#N/A"}]
[null,null,null,null,null,null,{"$error":"#N/A"}]
[null,null,null,null,null,null,{"$error":"#N/A"}]
[null,null,null,null,null,null,{"$error":"#N/A"}]
[null,null,null,null,null,null,{"$error":"#N/A"}]
[null,null,null,null,null,null,{"$error":"#N/A"}]
[null,null,null,null,null,null,{"$error":"#N/A"}]
[null,null,null,null,null,null,{"$error":"#N/A"}]
[null,null,null,null,null,null,{"$error":"#N/A"}]
[null,null,null,null,null,null,{"$error":"#N/A"}]
[null,null,null,null,null,null,{"$error":"#N/A"}]
[null,null,null,null,null,null,{"$error":"#N/A"}]
[null,null,null,null,null,null,{"$error":"#N/A"}]
[null,null,null,null,null,null,{"$error":"#N/A"}]
[null,null,null,null,null,null,{"$error":"#N/A"}]
[null,null,null,null,null,null,{"$error":"#N/A"}]
[null,null,null,null,null,null,{"$error":"#N/A"}]
[null,null,null,null,null,null,{"$error":"#N/A"}]
[null,null,null,null,null,null,{"$error":"#N/A"}]
[null,null,null,null,null,null,{"$error":"#N/A"}]
[null,null,null,null,null,null,{"$error":"#N/A"}]
[null,null,null,null,null,null,{"$error":"#N/A"}]
[null,null,null,null,null,null,{"$error":"#N/A"}]
[null,null,null,null,null,null,{"$error":"#N/A"}]
[null,null,null,null,null,null,{"$error":"#N/A"}]
[null,null,null,null,null,null,{"$error":"#N/A"}]
[null,null,null,null,null,null,{"$error":"#N/A"}]
[null,null,null,null,null,null,{"$error":"#N/A"}]
[null,null,null,null,null,null,{"$error":"#N/A"}]
[null,null,null,null,null,null,{"$error":"#N/A"}]
[null,null,null,null,null,null,{"$f":"IF(F198=0, NA(), IF(F198=\"\", NA(), F198))","v":{"$error":"#N/A"}}]
[null,null,null,null,null,null,{"$error":"#N/A"}]
[null,null,null,null,null,null,{"$error":"#N/A"}]
[null,null,null,null,null,null,{"$error":"#N/A"}]
[null,null,null,null,null,null,{"$error":"#N/A"}]
[null,null,null,null,null,null,{"$error":"#N/A"}]