{"text_format":"1","workbook":"xlsx","n_sheets":7,"sheets":["Basic Input","Data Inputs","Straight-Line Diagram","Working Data","Working Data - 2","Working Data - HZ","Working Data - Vol"],"not_rendered":{"charts":10,"images":2,"macros":1,"external_links":0,"defined_names":2,"comments":0,"pivot_tables":0},"unopened":[],"bounds":{"document_bytes":16777216,"sheet_cells":100000,"rows_first":2000,"rows_last":500,"rows_between":2000,"halvings":0,"cell_chars":16384,"cell_head_chars":4096},"cells_cut":0,"cells_raw":0,"read":"whole","date_system":"1900"}

{"sheet":"Basic Input","index":0,"n_rows":70,"n_cols":26,"rows_kept":70,"cut":false,"hidden":false,"merged":[[12,15,13,15],[10,15,11,15],[61,4,61,5],[62,4,62,5],[20,1,21,1],[28,4,29,8],[50,6,53,8],[16,2,25,6],[63,4,63,5],[64,4,64,5],[65,4,65,5],[66,4,66,5],[2,2,2,3],[6,2,6,3],[2,4,3,8],[4,4,4,8],[6,4,6,8],[9,4,9,8],[62,6,64,8]]}
[null,null,null,null,"Transition Zone Straight-Line Diagram Workbook"]
[null,null,null,null,"Enter Fields in Grey Boxes With Blue Text"]
[null,"Reference Location:","Navarre Road",null,"Enter a cross-street as the reference location for the diagram. The intersection should be within community portion of study area and will serve as the zero point on the straight-line diagram."]
[]
[null,"State Mile Post for Reference Location:",5.35,null,"Enter the state mile post of above cross-street reference location.",null,null,null,null,null,null,null,null,null,null,"DATA INPUT -- DO NOT MODIFY"]
[]
{"$rows_left_out":65}
{"sheet":"Data Inputs","index":1,"n_rows":206,"n_cols":14,"rows_kept":206,"cut":false,"hidden":false,"merged":[[19,13,23,13],[2,6,2,7],[2,8,2,10],[5,13,6,13],[9,13,10,13],[13,13,17,13]]}
[null,null,null,null,null,null,"Enter Posted Speeds, Observed Speeds, Crash Data, and Access Points In Grey Boxes With Blue Text"]
[]
[null,null,"Please Do Not Modify the Cells in Red",null,null,null,"Observed Speed Data",null,"Crash Data (nearest MP)"]
[null,null,"Distance (miles)","Distance (feet)","Mile Post","Posted Speed (mph)","85th Percentile Speed","Mean Speed","Property Damage Only","Injury","Fatal","Access Points"]
[{"$f":"IF(H5<>\"\", A4+1, A4)","v":0},0,{"$f":"IF(D5=\"\", \"\", D5*0.0001893939)","v":-0.1893939},{"$f":"-'Basic Input'!Q12","v":-1000},{"$f":"IF(D5=\"\", \"\",IF(D5=0, 'Basic Input'!$C$5, IF('Basic Input'!$C$7=\"Increasing\", 'Basic Input'!$C$5+(D5/5280), 'Basic Input'!$C$5-(D5/5280))))","v":5.1606060606060602},null,null,null,null,null,null,null,null,"Posted Speeds"]
[{"$f":"IF(H6<>\"\", A5+1, A5)","v":0},{"$f":"IF(F5=\"\", B5+1, B5+2)","v":1},{"$f":"IF(D6=\"\", \"\", D6*0.0001893939)","v":-0.17045451},{"$f":"IF(D5=\"\", \"\", IF(D5+100<='Basic Input'!$Q$14+'Basic Input'!$Q$9, D5+100, \"\"))","v":-900},{"$f":"IF(D6=\"\", \"\",IF(D6=0, 'Basic Input'!$C$5, IF('Basic Input'!$C$7=\"Increasing\", 'Basic Input'!$C$5+(D6/5280), 'Basic Input'!$C$5-(D6/5280))))","v":5.1795454545454538},null,null,null,null,null,null,null,null,"Enter the posted speeds based on feet from the reference point (column D)."]
{"$rows_left_out":201}
{"sheet":"Straight-Line Diagram","index":2,"n_rows":45,"n_cols":15,"rows_kept":45,"cut":false,"hidden":false,"merged":[[6,14,10,14]]}
[]
[]
[]
[]
[]
[null,null,null,null,null,null,null,null,null,null,null,null,null,null,"Graphic"]
{"$rows_left_out":40}
{"sheet":"Working Data","index":3,"n_rows":84,"n_cols":56,"rows_kept":84,"cut":false,"hidden":true,"merged":[[2,27,2,30],[2,16,2,19]]}
[null,"WORKING DATA -- DO NOT MODIFY"]
[null,null,null,null,null,null,null,null,null,null,"Speeds"]
[null,null,null,null,null,null,null,null,null,null,null,null,null,null,null,null,"Crashes (2006-2010)",null,null,null,null,null,null,null,null,"per mile",null,"Geometry"]
[null,null,"Distance (miles)","Distance (feet)","Mile Post","Key Locations",null,"Inserted Speed","85% Observed Speeds","Mean Speed","Posted Speed Limit","85th Percentile Speed","Median","85%>Posted+5mph","Data Locations",null,"Property Damage Only","Injury","Fatality","Total","Sliding Window Crash Rate","Avg. Rate for Similar Roads","Threshold Rate",null,"Access Points","Access Density",null,"Vertical Elevation","Grade","Horizontal Profile","Horizontal Curvature",null,"Volume",null,null,null,null,null,null,null,null,null,null,null,null,null,null,null,null,null,null,null,null,"Dist","85th","Mean"]
[null,0,{"$f":"IF(D5=\"\", \"\", D5*0.0001893939)","v":-0.1893939},-1000,{"$f":"IF(D5=\"\", \"\", ROUND(VLOOKUP($C5, 'Data Inputs'!$C$5:$F$648, 3, TRUE), 2))","v":5.16},null,null,{"$f":"IF(ISNUMBER(VLOOKUP($B5, 'Data Inputs'!$B$5:$F$648, 5, FALSE))=TRUE, VLOOKUP($B5, 'Data Inputs'!$B$5:$F$648, 5, FALSE), \"\")","v":""},{"$f":"IF(ISNUMBER(VLOOKUP($B5, 'Data Inputs'!$B$5:$H$648, 6, FALSE))=TRUE, VLOOKUP($B5, 'Data Inputs'!$B$5:$H$648, 6, FALSE), \"\")","v":""},{"$f":"IF(ISNUMBER(VLOOKUP($B5, 'Data Inputs'!$B$5:$H$648, 7, FALSE))=TRUE, VLOOKUP($B5, 'Data Inputs'!$B$5:$H$648, 7, FALSE), \"\")","v":""},{"$f":"MIN('Data Inputs'!$F$5:$F$206)","v":30},{"$f":"IF($D5=\"\",\"\",(IF($D5<=$BB$5,$BC$5,IF($D5=$BB$6,$BC$6,IF($D5=$BB$7,$BC$7,IF($D5=$BB$8,$BC$8,IF(AND($BA$6=\"N\",$D5>$BB$5)=TRUE,$BC$5,IF(AND($BA$7=\"N\",$D5>$BB$6)=TRUE,$BC$6,IF(AND($BA$8=\"N\",$D5>$BB$7)=TRUE,$BC$7,IF(AND($BA$9=\"N\",$D5>$BB$8)=TRUE,$BC$8,IF($BA$6=\"Y\",IF(AND($D5>$BB$5,$D5<$BB$6)=TRUE,(($D5-$BB$5)/($BB$5-$BB$6)*(BC$5-BC$6))+MIN(BC$6,BC$5),IF($BA$7=\"Y\",IF(AND($D5>$BB$6,$D5<$BB$7)=TRUE,(($D5-$BB$6)/($BB$6-$BB$7)*(BC$6-BC$7))+MIN(BC$7,BC$6),IF($BA$8=\"Y\",IF(AND($D5>$BB$7,$D5<$BB$8)=TRUE,(($D5-$BB$7)/($BB$7-$BB$8)*(BC$7-BC$8))+MIN(BC$8,BC$7),IF($BA$9=\"Y\",IF(AND($D5>$BB$8,$D5<$BB$9)=TRUE,(($D5-$BB$8)/($BB$8-$BB$9)*(BC$8-BC$9))+MIN(BC$9,BC$8),IF($D5>=$BB$9,$BC$9,\"\")))))))))))))))))))","v":34},{"$f":"IF($D5=\"\",\"\",(IF($D5<=$BB$5,$BD$5,IF($D5=$BB$6,$BD$6,IF($D5=$BB$7,$BD$7,IF($D5=$BB$8,$BD$8,IF(AND($BA$6=\"N\",$D5>$BB$5)=TRUE,$BD$5,IF(AND($BA$7=\"N\",$D5>$BB$6)=TRUE,$BD$6,IF(AND($BA$8=\"N\",$D5>$BB$7)=TRUE,$BD$7,IF(AND($BA$9=\"N\",$D5>$BB$8)=TRUE,$BD$8,IF($BA$6=\"Y\",IF(AND($D5>$BB$5,$D5<$BB$6)=TRUE,(($D5-$BB$5)/($BB$5-$BB$6)*(BD$5-BD$6))+MIN(BD$6,BD$5),IF($BA$7=\"Y\",IF(AND($D5>$BB$6,$D5<$BB$7)=TRUE,(($D5-$BB$6)/($BB$6-$BB$7)*(BD$6-BD$7))+MIN(BD$7,BD$6),IF($BA$8=\"Y\",IF(AND($D5>$BB$7,$D5<$BB$8)=TRUE,(($D5-$BB$7)/($BB$7-$BB$8)*(BD$7-BD$8))+MIN(BD$8,BD$7),IF($BA$9=\"Y\",IF(AND($D5>$BB$8,$D5<$BB$9)=TRUE,(($D5-$BB$8)/($BB$8-$BB$9)*(BD$8-BD$9))+MIN(BD$9,BD$8),IF($D5>=$BB$9,$BD$9,\"\")))))))))))))))))))","v":30},{"$f":"IF($D5=\"\", \"\", IF(L5>(K5+5),15,NA()))","v":{"$error":"#N/A"}},null,null,{"$f":"IF(ISNUMBER(VLOOKUP($B5, 'Data Inputs'!$B$5:$K$648, 8, FALSE))=TRUE, VLOOKUP($B5, 'Data Inputs'!$B$5:$K$648, 8, FALSE), \"\")","v":""},{"$f":"IF(ISNUMBER(VLOOKUP($B5, 'Data Inputs'!$B$5:$K$648, 9, FALSE))=TRUE, VLOOKUP($B5, 'Data Inputs'!$B$5:$K$648, 9, FALSE), \"\")","v":""},{"$f":"IF(ISNUMBER(VLOOKUP($B5, 'Data Inputs'!$B$5:$K$648, 10, FALSE))=TRUE, VLOOKUP($B5, 'Data Inputs'!$B$5:$K$648, 10, FALSE), \"\")","v":""},{"$f":"SUM(Q5:S5)","v":0},null,{"$f":"IF(U5=\"\", \"\", 'Basic Input'!$C$12)","v":""},null,null,{"$f":"IF(ISNUMBER(VLOOKUP($B5, 'Data Inputs'!$B$5:$L$648, 11, FALSE))=TRUE, VLOOKUP($B5, 'Data Inputs'!$B$5:$L$648, 11, FALSE), \"\")","v":""},null,null,null,null,null,null,null,{"$f":"VLOOKUP(D5,'Working Data - Vol'!D5:G71,4,TRUE)","v":4310},null,null,null,null,null,null,null,null,null,null,null,null,null,null,null,null,null,null,1,{"$f":"IF(ISNUMBER(BB5)=TRUE, \"Y\", \"N\")","v":"Y"},{"$f":"IF(ISNUMBER(VLOOKUP($AZ5, 'Data Inputs'!$A$5:$H$206, 4, FALSE)), VLOOKUP($AZ5, 'Data Inputs'!$A$5:$H$206, 4, FALSE), \"\")","v":100},{"$f":"IF(ISNUMBER(VLOOKUP($AZ5, 'Data Inputs'!$A$5:$H$206, 7, FALSE)), VLOOKUP($AZ5, 'Data Inputs'!$A$5:$H$206, 7, FALSE), \"\")","v":34},{"$f":"IF(ISNUMBER(VLOOKUP($AZ5, 'Data Inputs'!$A$5:$H$206, 8, FALSE)), VLOOKUP($AZ5, 'Data Inputs'!$A$5:$H$206, 8, FALSE), \"\")","v":30}]
[null,1,{"$f":"IF(D6=\"\", \"\", D6*0.0001893939)","v":-0.17045451},{"$f":"D5+100","v":-900},{"$f":"IF(D6=\"\", \"\", ROUND(VLOOKUP($C6, 'Data Inputs'!$C$5:$F$648, 3, TRUE), 2))","v":5.18},null,null,{"$f":"IF(ISNUMBER(VLOOKUP($B6, 'Data Inputs'!$B$5:$F$648, 5, FALSE))=TRUE, VLOOKUP($B6, 'Data Inputs'!$B$5:$F$648, 5, FALSE), \"\")","v":""},{"$f":"IF(ISNUMBER(VLOOKUP($B6, 'Data Inputs'!$B$5:$H$648, 6, FALSE))=TRUE, VLOOKUP($B6, 'Data Inputs'!$B$5:$H$648, 6, FALSE), \"\")","v":""},{"$f":"IF(ISNUMBER(VLOOKUP($B6, 'Data Inputs'!$B$5:$H$648, 7, FALSE))=TRUE, VLOOKUP($B6, 'Data Inputs'!$B$5:$H$648, 7, FALSE), \"\")","v":""},{"$f":"IF(D6=\"\", $K$69, IF(H6<>\"\", H6, K7))","v":30},{"$f":"IF(D6=\"\",\"\",(IF(D6<=$BB$5,$BC$5,IF(D6=$BB$6,$BC$6,IF(D6=$BB$7,$BC$7,IF(D6=$BB$8,$BC$8,IF(AND($BA$6=\"N\",D6>$BB$5)=TRUE,$BC$5,IF(AND($BA$7=\"N\",D6>$BB$6)=TRUE,$BC$6,IF(AND($BA$8=\"N\",D6>$BB$7)=TRUE,$BC$7,IF(AND($BA$9=\"N\",D6>$BB$8)=TRUE,$BC$8,IF($BA$6=\"Y\",IF(AND(D6>$BB$5,D6<$BB$6)=TRUE,(($D6-$BB$5)/($BB$5-$BB$6)*(BC$5-BC$6))+MIN(BC$6,BC$5),IF($BA$7=\"Y\",IF(AND(D6>$BB$6,D6<$BB$7)=TRUE,(($D6-$BB$6)/($BB$6-$BB$7)*(BC$6-BC$7))+MIN(BC$7,BC$6),IF($BA$8=\"Y\",IF(AND(D6>$BB$7,D6<$BB$8)=TRUE,(($D6-$BB$7)/($BB$7-$BB$8)*(BC$7-BC$8))+MIN(BC$8,BC$7),IF($BA$9=\"Y\",IF(AND(D6>$BB$8,D6<$BB$9)=TRUE,(($D6-$BB$8)/($BB$8-$BB$9)*(BC$8-BC$9))+MIN(BC$9,BC$8),IF(D6>=$BB$9,$BC$9,\"\")))))))))))))))))))","v":34},30,{"$f":"IF($D6=\"\", \"\", IF(L6>(K6+5),15,NA()))","v":{"$error":"#N/A"}},null,null,{"$f":"IF(ISNUMBER(VLOOKUP($B6, 'Data Inputs'!$B$5:$K$648, 8, FALSE))=TRUE, VLOOKUP($B6, 'Data Inputs'!$B$5:$K$648, 8, FALSE), \"\")","v":""},{"$f":"IF(ISNUMBER(VLOOKUP($B6, 'Data Inputs'!$B$5:$K$648, 9, FALSE))=TRUE, VLOOKUP($B6, 'Data Inputs'!$B$5:$K$648, 9, FALSE), \"\")","v":""},{"$f":"IF(ISNUMBER(VLOOKUP($B6, 'Data Inputs'!$B$5:$K$648, 10, FALSE))=TRUE, VLOOKUP($B6, 'Data Inputs'!$B$5:$K$648, 10, FALSE), \"\")","v":""},0,null,{"$f":"IF(U6=\"\", \"\", 'Basic Input'!$C$12)","v":""},null,null,{"$f":"IF(ISNUMBER(VLOOKUP($B6, 'Data Inputs'!$B$5:$L$648, 11, FALSE))=TRUE, VLOOKUP($B6, 'Data Inputs'!$B$5:$L$648, 11, FALSE), \"\")","v":""},null,null,null,null,null,null,null,{"$f":"VLOOKUP(D6,'Working Data - Vol'!D6:G72,4,TRUE)","v":4310},null,null,null,null,null,null,null,null,null,null,null,null,null,null,null,null,null,null,2,{"$f":"IF(ISNUMBER(BB6)=TRUE, \"Y\", \"N\")","v":"Y"},{"$f":"IF(ISNUMBER(VLOOKUP($AZ6, 'Data Inputs'!$A$5:$H$206, 4, FALSE)), VLOOKUP($AZ6, 'Data Inputs'!$A$5:$H$206, 4, FALSE), \"\")","v":500},{"$f":"IF(ISNUMBER(VLOOKUP($AZ6, 'Data Inputs'!$A$5:$H$206, 7, FALSE)), VLOOKUP($AZ6, 'Data Inputs'!$A$5:$H$206, 7, FALSE), \"\")","v":38},{"$f":"IF(ISNUMBER(VLOOKUP($AZ6, 'Data Inputs'!$A$5:$H$206, 8, FALSE)), VLOOKUP($AZ6, 'Data Inputs'!$A$5:$H$206, 8, FALSE), \"\")","v":33}]
{"$rows_left_out":79}
{"sheet":"Working Data - 2","index":4,"n_rows":94,"n_cols":33,"rows_kept":94,"cut":false,"hidden":true,"merged":[]}
[null,"WORKING DATA -- DO NOT MODIFY"]
[null,null,null,null,null,null,null,null,null,null,"Speeds"]
[null,null,null,null,null,null,null,null,null,null,null,null,null,null,null,null,null,null,null,null,null,null,null,null,null,null,null,null,null,"Data Inputs",null,null,"For Interpolation"]
[null,null,"Distance (miles)","Distance (feet)","Mile Post","Key Locations",null,"Inserted Speed","85% Observed Speeds","Mean Speed","Posted Speed Limit","85th Percentile Speed","Mean Speed","85%>Posted+5mph","Data Locations",null,null,null,null,null,null,null,null,null,null,null,null,null,"Dist","85th","Mean",null,"85th"]
[null,0,{"$f":"VLOOKUP($B5, 'Data Inputs'!$B$5:$F$214, 2, TRUE)","v":-0.1893939},{"$f":"VLOOKUP($B5, 'Data Inputs'!$B$5:$F$648, 3, TRUE)","v":-1000},{"$f":"VLOOKUP($B5, 'Data Inputs'!$B$5:$F$648, 4, TRUE)","v":5.1606060606060602},null,null,{"$f":"IF(ISNUMBER(VLOOKUP($B5, 'Data Inputs'!$B$5:$F$648, 5, FALSE))=TRUE, VLOOKUP($B5, 'Data Inputs'!$B$5:$F$648, 5, FALSE), \"\")","v":""},{"$f":"IF(ISNUMBER(VLOOKUP($B5, 'Data Inputs'!$B$5:$H$648, 6, FALSE))=TRUE, VLOOKUP($B5, 'Data Inputs'!$B$5:$H$648, 6, FALSE), \"\")","v":""},{"$f":"IF(ISNUMBER(VLOOKUP($B5, 'Data Inputs'!$B$5:$H$648, 7, FALSE))=TRUE, VLOOKUP($B5, 'Data Inputs'!$B$5:$H$648, 7, FALSE), \"\")","v":""},{"$f":"MIN('Data Inputs'!$F$5:$F$206)","v":30},{"$f":"IF($D5=\"\",\"\",(IF($D5<=$AC$5,$AG$5,IF($D5=$AC$6,$AG$6,IF($D5=$AC$7,$AG$7,IF($D5=$AC$8,$AG$8,IF(AND($AB$6=\"N\",$D5>$AC$5)=TRUE,$AG$5,IF(AND($AB$7=\"N\",$D5>$AC$6)=TRUE,$AG$6,IF(AND($AB$8=\"N\",$D5>$AC$7)=TRUE,$AG$7,IF(AND($AB$9=\"N\",$D5>$AC$8)=TRUE,$AG$8,IF($AB$6=\"Y\",IF(AND($D5>$AC$5,$D5<$AC$6)=TRUE,(($D5-$AC$5)/($AC$5-$AC$6)*(AG$5-AG$6))+MIN(AG$6,AG$5),IF($AB$7=\"Y\",IF(AND($D5>$AC$6,$D5<$AC$7)=TRUE,(($D5-$AC$6)/($AC$6-$AC$7)*(AG$6-AG$7))+MIN(AG$7,AG$6),IF($AB$8=\"Y\",IF(AND($D5>$AC$7,$D5<$AC$8)=TRUE,(($D5-$AC$7)/($AC$7-$AC$8)*(AG$7-AG$8))+MIN(AG$8,AG$7),IF($AB$9=\"Y\",IF(AND($D5>$AC$8,$D5<$AC$9)=TRUE,(($D5-$AC$8)/($AC$8-$AC$9)*(AG$8-AG$9))+MIN(AG$9,AG$8),IF($D5>=$AC$9,$AG$9,\"\")))))))))))))))))))","v":34},{"$f":"IF($D5=\"\",\"\",(IF($D5<=$AC$5,$AE$5,IF($D5=$AC$6,$AE$6,IF($D5=$AC$7,$AE$7,IF($D5=$AC$8,$AE$8,IF(AND($AB$6=\"N\",$D5>$AC$5)=TRUE,$AE$5,IF(AND($AB$7=\"N\",$D5>$AC$6)=TRUE,$AE$6,IF(AND($AB$8=\"N\",$D5>$AC$7)=TRUE,$AE$7,IF(AND($AB$9=\"N\",$D5>$AC$8)=TRUE,$AE$8,IF($AB$6=\"Y\",IF(AND($D5>$AC$5,$D5<$AC$6)=TRUE,(($D5-$AC$5)/($AC$5-$AC$6)*(AE$5-AE$6))+MIN(AE$6,AE$5),IF($AB$7=\"Y\",IF(AND($D5>$AC$6,$D5<$AC$7)=TRUE,(($D5-$AC$6)/($AC$6-$AC$7)*(AE$6-AE$7))+MIN(AE$7,AE$6),IF($AB$8=\"Y\",IF(AND($D5>$AC$7,$D5<$AC$8)=TRUE,(($D5-$AC$7)/($AC$7-$AC$8)*(AE$7-AE$8))+MIN(AE$8,AE$7),IF($AB$9=\"Y\",IF(AND($D5>$AC$8,$D5<$AC$9)=TRUE,(($D5-$AC$8)/($AC$8-$AC$9)*(AE$8-AE$9))+MIN(AE$9,AE$8),IF($D5>=$AC$9,$AE$9,\"\")))))))))))))))))))","v":30},{"$f":"IF($D5=\"\", \"\", IF(L5>(K5+5),15,NA()))","v":{"$error":"#N/A"}},null,null,null,null,null,null,null,null,null,null,null,null,1,{"$f":"IF(ISNUMBER(AC5)=TRUE, \"Y\", \"N\")","v":"Y"},{"$f":"IF(ISNUMBER(VLOOKUP($AA5, 'Data Inputs'!$A$5:$H$206, 4, FALSE)), VLOOKUP($AA5, 'Data Inputs'!$A$5:$H$206, 4, FALSE), \"\")","v":100},{"$f":"IF(ISNUMBER(VLOOKUP($AA5, 'Data Inputs'!$A$5:$H$206, 7, FALSE)), VLOOKUP($AA5, 'Data Inputs'!$A$5:$H$206, 7, FALSE), \"\")","v":34},{"$f":"IF(ISNUMBER(VLOOKUP($AA5, 'Data Inputs'!$A$5:$H$206, 8, FALSE)), VLOOKUP($AA5, 'Data Inputs'!$A$5:$H$206, 8, FALSE), \"\")","v":30},null,{"$f":"IF(ISNUMBER(VLOOKUP($AA5, 'Data Inputs'!$A$5:$H$206, 7, FALSE)), VLOOKUP($AA5, 'Data Inputs'!$A$5:$H$206, 7, FALSE), \"\")","v":34}]
[null,1,{"$f":"VLOOKUP($B6, 'Data Inputs'!$B$5:$F$214, 2, TRUE)","v":-0.17045451},{"$f":"VLOOKUP($B6, 'Data Inputs'!$B$5:$F$648, 3, TRUE)","v":-900},{"$f":"VLOOKUP($B6, 'Data Inputs'!$B$5:$F$648, 4, TRUE)","v":5.1795454545454538},null,null,{"$f":"IF(ISNUMBER(VLOOKUP($B6, 'Data Inputs'!$B$5:$F$648, 5, FALSE))=TRUE, VLOOKUP($B6, 'Data Inputs'!$B$5:$F$648, 5, FALSE), \"\")","v":""},{"$f":"IF(ISNUMBER(VLOOKUP($B6, 'Data Inputs'!$B$5:$H$648, 6, FALSE))=TRUE, VLOOKUP($B6, 'Data Inputs'!$B$5:$H$648, 6, FALSE), \"\")","v":""},{"$f":"IF(ISNUMBER(VLOOKUP($B6, 'Data Inputs'!$B$5:$H$648, 7, FALSE))=TRUE, VLOOKUP($B6, 'Data Inputs'!$B$5:$H$648, 7, FALSE), \"\")","v":""},{"$f":"IF(D6=\"\", $K$69, IF(H6<>\"\", H6, K7))","v":30},{"$f":"IF($D6=\"\",\"\",(IF($D6<=$AC$5,$AG$5,IF($D6=$AC$6,$AG$6,IF($D6=$AC$7,$AG$7,IF($D6=$AC$8,$AG$8,IF(AND($AB$6=\"N\",$D6>$AC$5)=TRUE,$AG$5,IF(AND($AB$7=\"N\",$D6>$AC$6)=TRUE,$AG$6,IF(AND($AB$8=\"N\",$D6>$AC$7)=TRUE,$AG$7,IF(AND($AB$9=\"N\",$D6>$AC$8)=TRUE,$AG$8,IF($AB$6=\"Y\",IF(AND($D6>$AC$5,$D6<$AC$6)=TRUE,(($D6-$AC$5)/($AC$5-$AC$6)*(AG$5-AG$6))+MIN(AG$6,AG$5),IF($AB$7=\"Y\",IF(AND($D6>$AC$6,$D6<$AC$7)=TRUE,(($D6-$AC$6)/($AC$6-$AC$7)*(AG$6-AG$7))+MIN(AG$7,AG$6),IF($AB$8=\"Y\",IF(AND($D6>$AC$7,$D6<$AC$8)=TRUE,(($D6-$AC$7)/($AC$7-$AC$8)*(AG$7-AG$8))+MIN(AG$8,AG$7),IF($AB$9=\"Y\",IF(AND($D6>$AC$8,$D6<$AC$9)=TRUE,(($D6-$AC$8)/($AC$8-$AC$9)*(AG$8-AG$9))+MIN(AG$9,AG$8),IF($D6>=$AC$9,$AG$9,\"\")))))))))))))))))))","v":34},{"$f":"IF($D6=\"\",\"\",(IF($D6<=$AC$5,$AE$5,IF($D6=$AC$6,$AE$6,IF($D6=$AC$7,$AE$7,IF($D6=$AC$8,$AE$8,IF(AND($AB$6=\"N\",$D6>$AC$5)=TRUE,$AE$5,IF(AND($AB$7=\"N\",$D6>$AC$6)=TRUE,$AE$6,IF(AND($AB$8=\"N\",$D6>$AC$7)=TRUE,$AE$7,IF(AND($AB$9=\"N\",$D6>$AC$8)=TRUE,$AE$8,IF($AB$6=\"Y\",IF(AND($D6>$AC$5,$D6<$AC$6)=TRUE,(($D6-$AC$5)/($AC$5-$AC$6)*(AE$5-AE$6))+MIN(AE$6,AE$5),IF($AB$7=\"Y\",IF(AND($D6>$AC$6,$D6<$AC$7)=TRUE,(($D6-$AC$6)/($AC$6-$AC$7)*(AE$6-AE$7))+MIN(AE$7,AE$6),IF($AB$8=\"Y\",IF(AND($D6>$AC$7,$D6<$AC$8)=TRUE,(($D6-$AC$7)/($AC$7-$AC$8)*(AE$7-AE$8))+MIN(AE$8,AE$7),IF($AB$9=\"Y\",IF(AND($D6>$AC$8,$D6<$AC$9)=TRUE,(($D6-$AC$8)/($AC$8-$AC$9)*(AE$8-AE$9))+MIN(AE$9,AE$8),IF($D6>=$AC$9,$AE$9,\"\")))))))))))))))))))","v":30},{"$f":"IF($D6=\"\", \"\", IF(L6>(K6+5),15,NA()))","v":{"$error":"#N/A"}},null,null,null,null,null,null,null,null,null,null,null,null,2,{"$f":"IF(ISNUMBER(AC6)=TRUE, \"Y\", \"N\")","v":"Y"},{"$f":"IF(ISNUMBER(VLOOKUP($AA6, 'Data Inputs'!$A$5:$H$206, 4, FALSE)), VLOOKUP($AA6, 'Data Inputs'!$A$5:$H$206, 4, FALSE), \"\")","v":500},{"$f":"IF(ISNUMBER(VLOOKUP($AA6, 'Data Inputs'!$A$5:$H$206, 7, FALSE)), VLOOKUP($AA6, 'Data Inputs'!$A$5:$H$206, 7, FALSE), \"\")","v":38},{"$f":"IF(ISNUMBER(VLOOKUP($AA6, 'Data Inputs'!$A$5:$H$206, 8, FALSE)), VLOOKUP($AA6, 'Data Inputs'!$A$5:$H$206, 8, FALSE), \"\")","v":33},null,{"$f":"IF(ISNUMBER(VLOOKUP($AA6,'Data Inputs'!$A$5:$H$206,7,FALSE)),VLOOKUP($AA6,'Data Inputs'!$A$5:$H$206,7,FALSE),IF(ISNUMBER(AE6),((AC6-AC5)/(AC5-MAX(AC7:AC9)))*(AG5-MIN(AD7:AD9))+AG5))","v":38}]
{"$rows_left_out":89}
{"sheet":"Working Data - HZ","index":5,"n_rows":184,"n_cols":19,"rows_kept":184,"cut":false,"hidden":true,"merged":[]}
[null,"WORKING DATA -- DO NOT MODIFY"]
[]
[]
[null,null,"Distance (miles)","Distance (feet)","Mile Post","Curve Radius (ft)","Horizontal Curvature",null,null,null,null,null,null,null,"LABELS"]
[null,null,-0.18939393939393939,-1000,5.1606060606060602,0,{"$f":"IF(F5=\"\", NA(), IF(F5=0, 0, 1000/F5))","v":0},null,null,null,null,null,null,null,{"$f":"IF('Basic Input'!C51<>\"\", 'Basic Input'!C51, \"\")","v":"Tangent"},{"$f":"IF(O5=\"\",NA(),('Basic Input'!D51+'Basic Input'!D51)/2)","v":-1000},{"$f":"IF(O5=\"\", NA(), IF('Basic Input'!C51=\"Curve Right\", -1, 1))","v":1},{"$f":"IF(P5=\"\", NA(), IF('Basic Input'!F51=0,0, Q5*1000/'Basic Input'!F51))","v":0},{"$f":"IF('Basic Input'!F51<>\"\", 'Basic Input'!F51, \"\")","v":0}]
[null,null,-0.18939393939393939,-1000,5.1606060606060602,0,{"$f":"IF(F6=\"\", NA(), IF(F6=0, 0, 1000/F6))","v":0},null,null,null,null,null,null,null,{"$f":"IF('Basic Input'!C52<>\"\", 'Basic Input'!C52, \"\")","v":""},{"$f":"IF(O6=\"\",NA(),('Basic Input'!D52+'Basic Input'!D52)/2)","v":{"$error":"#N/A"}},{"$f":"IF(O6=\"\", NA(), IF('Basic Input'!C52=\"Curve Right\", -1, 1))","v":{"$error":"#N/A"}},{"$f":"IF(P6=\"\", NA(), IF('Basic Input'!F52=0,0, Q6*1000/'Basic Input'!F52))","v":{"$error":"#N/A"}},{"$f":"IF('Basic Input'!F52<>\"\", 'Basic Input'!F52, \"\")","v":""}]
{"$rows_left_out":179}
{"sheet":"Working Data - Vol","index":6,"n_rows":203,"n_cols":7,"rows_kept":203,"cut":false,"hidden":true,"merged":[]}
[null,"WORKING DATA -- DO NOT MODIFY"]
[]
[]
[null,null,"Distance (miles)","Distance (feet)","Mile Post","2 way ADT","Graphable"]
[null,null,-0.18939393939393939,-1000,5.1606060606060602,0,{"$f":"IF(F5=0, NA(), IF(F5=\"\", NA(), F5))","v":{"$error":"#N/A"}}]
[null,null,-0.18939393939393939,-1000,5.1606060606060602,4310,{"$f":"IF(F6=0, NA(), IF(F6=\"\", NA(), F6))","v":4310}]
{"$rows_left_out":197}