{"text_format":"1","workbook":"xlsx","n_sheets":13,"sheets":["1. Data Strategy & Governance","2. Data Life Cycle Management","3. Data Arch. & Integration","4. Data Collaboration","5. Data Quality","Calculations","Assessment Summary","Radar Chart","Improvement Identification","Action Planning","Validation Lists","Individual Summary","Individual Notes"],"not_rendered":{"charts":2,"images":0,"macros":1,"external_links":1,"defined_names":9,"comments":0,"pivot_tables":0},"unopened":[{"sheet":"Radar Chart","index":7,"reason":"not_a_worksheet"}],"bounds":{"document_bytes":16777216,"sheet_cells":100000,"rows_first":2000,"rows_last":500,"rows_between":2000,"halvings":0,"cell_chars":16384,"cell_head_chars":4096},"cells_cut":0,"cells_raw":0,"read":"whole","date_system":"1900"}

{"sheet":"1. Data Strategy & Governance","index":0,"n_rows":74,"n_cols":10,"rows_kept":74,"cut":false,"hidden":false,"merged":[[27,1,27,4],[15,1,15,4],[3,1,3,4],[16,1,17,1],[16,3,17,3],[16,4,17,4],[1,1,1,4],[2,1,2,4],[4,1,5,1],[4,3,5,3],[4,4,5,4],[64,1,65,1],[52,1,53,1],[52,3,53,3],[52,4,53,4],[28,1,29,1],[28,3,29,3],[28,4,29,4],[40,1,41,1],[40,3,41,3],[40,4,41,4],[63,1,63,4],[51,1,51,4],[39,1,39,4],[42,7,46,7],[54,7,58,7],[66,7,70,7],[64,3,65,3],[64,4,65,4],[52,5,53,5],[52,6,53,6],[64,5,65,5],[64,6,65,6],[18,8,22,8],[18,9,22,9],[6,7,10,7],[18,7,22,7],[30,7,34,7],[28,8,29,8],[28,9,29,9],[30,8,34,8],[30,9,34,9],[4,8,5,8],[6,8,10,8],[4,9,5,9],[6,9,10,9],[16,8,17,8],[16,9,17,9],[40,8,41,8],[40,9,41,9],[64,8,65,8],[64,9,65,9],[66,8,70,8],[66,9,70,9],[42,8,46,8],[42,9,46,9],[52,8,53,8],[52,9,53,9],[54,8,58,8],[54,9,58,9],[3,5,3,6],[15,5,15,6],[27,5,27,6],[63,5,63,6],[51,5,51,6],[39,5,39,6],[4,5,5,5],[4,6,5,6],[16,5,17,5],[16,6,17,6],[28,5,29,5],[28,6,29,6],[40,5,41,5],[40,6,41,6]]}
[]
[null,"1. Data Strategy and Governance - Agency Level Evaluation"]
[null,"Leadership and management practices to manage data as a strategic agency asset."]
[null,"NOTE: Based on what is most representative of current/desired performance, please select only ONE current and ONE desired state maturity level.",null,null,null,"Indiv. Response Summary"]
[null,"1.1.","Strategy and Direction","Consensus Current Level","Consensus Desired Level","Response Count Current Level","Response Count Desired Level",null,"Comments","Improvements"]
[null,null,"Leadership commitment and strategic planning to maximize value of data to meet agency goals. This sub-element looks at the extent to which the agency leadership has demonstrated a commitment to managing data as a strategic asset through establishment of data governance structures, communications, and planning activities to ensure alignment between data investments and business needs."]
[null,"1.1.1","Data collection and management is performed by individual business units with little or no agency-wide direction or coordination. Data improvements are not systematically or regularly identified - they are implemented on a reactive or opportunistic basis.",null,null,{"$f":"COUNTIFS('Individual Summary'!A:A,$B5,'Individual Summary'!D:D,\"1\")+COUNTIFS('Individual Summary'!A:A,$B5,'Individual Summary'!D:D,\"1.5\")","v":0},{"$f":"COUNTIFS('Individual Summary'!A:A,$B5,'Individual Summary'!E:E,\"1\")+COUNTIFS('Individual Summary'!A:A,$B5,'Individual Summary'!E:E,\"1.5\")","v":0}]
[null,"1.1.2","Efforts to implement agency-wide data governance or assess agency-wide data needs are being discussed or planned. Data improvement needs are identified and communicated to management in an informal manner.",null,null,{"$f":"COUNTIFS('Individual Summary'!A:A,$B5,'Individual Summary'!D:D,\"2\")+COUNTIFS('Individual Summary'!A:A,$B5,'Individual Summary'!D:D,\"2.5\")","v":0},{"$f":"COUNTIFS('Individual Summary'!A:A,$B5,'Individual Summary'!E:E,\"2\")+COUNTIFS('Individual Summary'!A:A,$B5,'Individual Summary'!E:E,\"2.5\")","v":0}]
{"$rows_left_out":67}
{"sheet":"2. Data Life Cycle Management","index":1,"n_rows":74,"n_cols":10,"rows_kept":74,"cut":false,"hidden":false,"merged":[[64,1,65,1],[64,3,65,3],[64,4,65,4],[28,1,29,1],[28,3,29,3],[40,4,41,4],[52,1,53,1],[52,3,53,3],[52,4,53,4],[64,5,65,5],[64,6,65,6],[28,5,29,5],[28,6,29,6],[40,5,41,5],[40,6,41,6],[52,5,53,5],[52,6,53,6],[63,5,63,6],[51,5,51,6],[39,5,39,6],[3,5,3,6],[15,5,15,6],[27,1,27,4],[15,1,15,4],[3,1,3,4],[4,5,5,5],[4,6,5,6],[16,5,17,5],[16,6,17,6],[16,1,17,1],[4,3,5,3],[4,4,5,4],[16,3,17,3],[16,4,17,4],[4,1,5,1],[27,5,27,6],[1,1,1,4],[2,1,2,4],[63,1,63,4],[51,1,51,4],[39,1,39,4],[28,4,29,4],[40,1,41,1],[40,3,41,3],[66,7,70,7],[6,7,10,7],[18,7,22,7],[30,7,34,7],[42,7,46,7],[54,7,58,7],[4,8,5,8],[4,9,5,9],[6,8,10,8],[6,9,10,9],[16,8,17,8],[16,9,17,9],[18,8,22,8],[18,9,22,9],[28,8,29,8],[28,9,29,9],[30,8,34,8],[30,9,34,9],[40,9,41,9],[42,8,46,8],[42,9,46,9],[52,8,53,8],[52,9,53,9],[40,8,41,8],[54,9,58,9],[64,8,65,8],[64,9,65,9],[66,8,70,8],[66,9,70,9],[54,8,58,8]]}
[]
[null,"2. Data Life Cycle Management - Agency Level Evaluation"]
[null,"Practices for managing data throughout its life cycle from collection to archiving or deletion."]
[null,"NOTE: Based on what is most representative of current/desired performance, please select only ONE current and ONE desired state maturity level.",null,null,null,"Indiv. Response Summary"]
[null,"2.1.","Data Collection and Updating","Consensus Current Level","Consensus Desired Level","Response Count Current Level","Response Count Desired Level",null,"Comments","Improvements"]
[null,null,"Well-defined and coordinated data update cycles. This sub-element assesses the extent to which update methods and cycles have been defined and documented for key data sets."]
[null,"2.1.1","Data collection and updating cycles and business rules for enterprise data updates have not been established.",null,null,{"$f":"COUNTIFS('Individual Summary'!A:A,$B5,'Individual Summary'!D:D,\"1\")+COUNTIFS('Individual Summary'!A:A,$B5,'Individual Summary'!D:D,\"1.5\")","v":0},{"$f":"COUNTIFS('Individual Summary'!A:A,$B5,'Individual Summary'!E:E,\"1\")+COUNTIFS('Individual Summary'!A:A,$B5,'Individual Summary'!E:E,\"1.5\")","v":0}]
[null,"2.1.2","Enterprise data collection and updating cycles have been established but have not been documented.",null,null,{"$f":"COUNTIFS('Individual Summary'!A:A,$B5,'Individual Summary'!D:D,\"2\")+COUNTIFS('Individual Summary'!A:A,$B5,'Individual Summary'!D:D,\"2.5\")","v":0},{"$f":"COUNTIFS('Individual Summary'!A:A,$B5,'Individual Summary'!E:E,\"2\")+COUNTIFS('Individual Summary'!A:A,$B5,'Individual Summary'!E:E,\"2.5\")","v":0}]
{"$rows_left_out":67}
{"sheet":"3. Data Arch. & Integration","index":2,"n_rows":50,"n_cols":10,"rows_kept":50,"cut":false,"hidden":false,"merged":[[39,1,39,4],[27,1,27,4],[15,1,15,4],[1,1,1,4],[2,1,2,4],[4,1,5,1],[4,3,5,3],[4,4,5,4],[3,1,3,4],[42,7,46,7],[30,7,34,7],[18,7,22,7],[6,7,10,7],[28,1,29,1],[28,3,29,3],[28,4,29,4],[40,1,41,1],[40,3,41,3],[40,4,41,4],[16,1,17,1],[16,3,17,3],[16,4,17,4],[40,5,41,5],[40,6,41,6],[16,5,17,5],[4,9,5,9],[6,8,10,8],[6,9,10,9],[16,8,17,8],[16,9,17,9],[40,9,41,9],[42,8,46,8],[42,9,46,9],[18,8,22,8],[18,9,22,9],[28,8,29,8],[28,9,29,9],[30,8,34,8],[30,9,34,9],[3,5,3,6],[15,5,15,6],[27,5,27,6],[39,5,39,6],[40,8,41,8],[4,8,5,8],[4,5,5,5],[4,6,5,6],[16,6,17,6],[28,5,29,5],[28,6,29,6]]}
[]
[null,"3. Data Architecture and Integration - Agency Level Evaluation"]
[null,"Technical standards, processes, tools and coordination mechanisms to maximize data integration and minimize duplication."]
[null,"NOTE: Based on what is most representative of current/desired performance, please select only ONE current and ONE desired state maturity level.",null,null,null,"Indiv. Response Summary"]
[null,"3.1.","Location Referencing","Consensus Current Level","Consensus Desired Level","Response Count Current Level","Response Count Desired Level",null,"Comments","Improvements"]
[null,null,"Common location referencing methods across agency data sets. This sub-element assesses the extent to which the agency has standardized methods for location referencing, including linear referencing for its road-related data sets."]
[null,"3.1.1","The agency has not pursued creating a standard linear referencing system (LRS) for agency data.",null,null,{"$f":"COUNTIFS('Individual Summary'!A:A,$B5,'Individual Summary'!D:D,\"1\")+COUNTIFS('Individual Summary'!A:A,$B5,'Individual Summary'!D:D,\"1.5\")","v":0},{"$f":"COUNTIFS('Individual Summary'!A:A,$B5,'Individual Summary'!E:E,\"1\")+COUNTIFS('Individual Summary'!A:A,$B5,'Individual Summary'!E:E,\"1.5\")","v":0}]
[null,"3.1.2","The agency is working towards establishing a standard LRS.  However most data sets including location elements cannot be easily and accurately integrated with other agency data sets.",null,null,{"$f":"COUNTIFS('Individual Summary'!A:A,$B5,'Individual Summary'!D:D,\"2\")+COUNTIFS('Individual Summary'!A:A,$B5,'Individual Summary'!D:D,\"2.5\")","v":0},{"$f":"COUNTIFS('Individual Summary'!A:A,$B5,'Individual Summary'!E:E,\"2\")+COUNTIFS('Individual Summary'!A:A,$B5,'Individual Summary'!E:E,\"2.5\")","v":0}]
{"$rows_left_out":43}
{"sheet":"4. Data Collaboration","index":3,"n_rows":38,"n_cols":10,"rows_kept":38,"cut":false,"hidden":false,"merged":[[15,1,15,4],[16,1,17,1],[16,3,17,3],[16,4,17,4],[30,7,34,7],[18,7,22,7],[28,1,29,1],[28,3,29,3],[28,4,29,4],[27,1,27,4],[16,5,17,5],[16,6,17,6],[28,5,29,5],[15,5,15,6],[27,5,27,6],[28,6,29,6],[6,7,10,7],[1,1,1,4],[2,1,2,4],[4,1,5,1],[4,3,5,3],[4,4,5,4],[4,5,5,5],[4,6,5,6],[3,5,3,6],[3,1,3,4],[30,8,34,8],[30,9,34,9],[4,8,5,8],[4,9,5,9],[6,8,10,8],[6,9,10,9],[16,8,17,8],[16,9,17,9],[18,8,22,8],[18,9,22,9],[28,8,29,8],[28,9,29,9]]}
[]
[null,"4. Data Collaboration - Agency Level Evaluation"]
[null,"Internal and external collaboration to maximize data sharing and avoid duplication of effort."]
[null,"NOTE: Based on what is most representative of current/desired performance, please select only ONE current and ONE desired state maturity level.",null,null,null,"Indiv. Response Summary"]
[null,"4.1.","Internal Agency Collaboration","Consensus Current Level","Consensus Desired Level","Response Count Current Level","Response Count Desired Level",null,"Comments","Improvements"]
[null,null,"Collaboration across agency business units to leverage opportunities for efficiencies in data collection and management.  This sub-element assesses the extent to which there is collaboration and coordination across different organizational units on data collection and management. "]
[null,"4.1.1","Most data collection efforts in the agency are independent - there have been little or no efforts to coordinate across business units.\nThe agency does not have information about the extent to which data are duplicated.",null,null,{"$f":"COUNTIFS('Individual Summary'!A:A,$B5,'Individual Summary'!D:D,\"1\")+COUNTIFS('Individual Summary'!A:A,$B5,'Individual Summary'!D:D,\"1.5\")","v":0},{"$f":"COUNTIFS('Individual Summary'!A:A,$B5,'Individual Summary'!E:E,\"1\")+COUNTIFS('Individual Summary'!A:A,$B5,'Individual Summary'!E:E,\"1.5\")","v":0}]
[null,"4.1.2","The agency is starting to identify cases of data duplication and discuss opportunities for coordinating data collection and management across business units (e.g., safety and asset management). ",null,null,{"$f":"COUNTIFS('Individual Summary'!A:A,$B5,'Individual Summary'!D:D,\"2\")+COUNTIFS('Individual Summary'!A:A,$B5,'Individual Summary'!D:D,\"2.5\")","v":0},{"$f":"COUNTIFS('Individual Summary'!A:A,$B5,'Individual Summary'!E:E,\"2\")+COUNTIFS('Individual Summary'!A:A,$B5,'Individual Summary'!E:E,\"2.5\")","v":0}]
{"$rows_left_out":31}
{"sheet":"5. Data Quality","index":4,"n_rows":26,"n_cols":10,"rows_kept":26,"cut":false,"hidden":false,"merged":[[3,1,3,4],[15,1,15,4],[6,7,10,7],[18,7,22,7],[1,1,1,4],[2,1,2,4],[4,1,5,1],[4,3,5,3],[4,4,5,4],[4,5,5,5],[4,6,5,6],[16,5,17,5],[16,6,17,6],[16,1,17,1],[16,3,17,3],[16,4,17,4],[3,5,3,6],[15,5,15,6],[18,8,22,8],[18,9,22,9],[4,8,5,8],[4,9,5,9],[6,8,10,8],[6,9,10,9],[16,8,17,8],[16,9,17,9]]}
[]
[null,"5. Data Quality - Agency Level Evaluation"]
[null,"Standards and practices to ensure that data are of sufficient quality to meet user needs."]
[null,"NOTE: Based on what is most representative of current/desired performance, please select only ONE current and ONE desired state maturity level.",null,null,null,"Indiv. Response Summary"]
[null,"5.1.","Data Quality Measurement and Reporting","Consensus Current Level","Consensus Desired Level","Response Count Current Level","Response Count Desired Level",null,"Comments","Improvements"]
[null,null,"Metrics and reporting to ensure user understanding of current data quality.  This sub-element assesses the extent to which data quality metrics have been defined and used to inform users about the level of currency, accuracy, coverage and completeness of a given data set.  (Note that data reliability is considered to be related to accuracy and is not distinguished here as a separate characteristic.  Data integrity, consistency and confidentiality are other important aspects of data quality that are considered as part of Assessment Elements 2 and 3.) "]
[null,"5.1.1","The agency has not pursued establishing  agency-wide policy and/or guidance related to data quality measurement and reporting. ",null,null,{"$f":"COUNTIFS('Individual Summary'!A:A,$B5,'Individual Summary'!D:D,\"1\")+COUNTIFS('Individual Summary'!A:A,$B5,'Individual Summary'!D:D,\"1.5\")","v":0},{"$f":"COUNTIFS('Individual Summary'!A:A,$B5,'Individual Summary'!E:E,\"1\")+COUNTIFS('Individual Summary'!A:A,$B5,'Individual Summary'!E:E,\"1.5\")","v":0}]
[null,"5.1.2","The agency is in the process of establishing policy and/or guidance related to data quality measurement and reporting.  Some limited guidance and assistance may be available for specific purposes (e.g. to enable data integration, or to provide location).",null,null,{"$f":"COUNTIFS('Individual Summary'!A:A,$B5,'Individual Summary'!D:D,\"2\")+COUNTIFS('Individual Summary'!A:A,$B5,'Individual Summary'!D:D,\"2.5\")","v":0},{"$f":"COUNTIFS('Individual Summary'!A:A,$B5,'Individual Summary'!E:E,\"2\")+COUNTIFS('Individual Summary'!A:A,$B5,'Individual Summary'!E:E,\"2.5\")","v":0}]
{"$rows_left_out":19}
{"sheet":"Calculations","index":5,"n_rows":43,"n_cols":30,"rows_kept":43,"cut":false,"hidden":true,"merged":[[0,13,0,17],[0,25,0,29],[0,19,0,23],[0,7,0,11],[0,1,0,5]]}
[null,"1. Data Strategy and Governance",null,null,null,null,null,"2. Data Life Cycle Management",null,null,null,null,null,"3. Data Architecture and Integration",null,null,null,null,null,"4. Data Collaboration",null,null,null,null,null,"5. Data Quality"]
[null,null,null,"Current",null,"Desired",null,null,null,"Current",null,"Desired",null,null,null,"Current",null,"Desired",null,null,null,"Current",null,"Desired",null,null,null,"Current",null,"Desired"]
[null,"1.1.",{"$f":"AVERAGE(D4:D8)","v":{"$error":"#DIV/0!"}},{"$f":"IFERROR(C3,\"\")","v":""},{"$f":"AVERAGE(F4:F8)","v":{"$error":"#DIV/0!"}},{"$f":"IFERROR(E3,\"\")","v":""},null,"2.1.",{"$f":"AVERAGE(J4:J8)","v":{"$error":"#DIV/0!"}},{"$f":"IFERROR(I3,\"\")","v":""},{"$f":"AVERAGE(L4:L8)","v":{"$error":"#DIV/0!"}},{"$f":"IFERROR(K3,\"\")","v":""},null,"3.1.",{"$f":"AVERAGE(P4:P8)","v":{"$error":"#DIV/0!"}},{"$f":"IFERROR(O3,\"\")","v":""},{"$f":"AVERAGE(R4:R8)","v":{"$error":"#DIV/0!"}},{"$f":"IFERROR(Q3,\"\")","v":""},null,"4.1.",{"$f":"AVERAGE(V4:V8)","v":{"$error":"#DIV/0!"}},{"$f":"IFERROR(U3,\"\")","v":""},{"$f":"AVERAGE(X4:X8)","v":{"$error":"#DIV/0!"}},{"$f":"IFERROR(W3,\"\")","v":""},null,"5.1.",{"$f":"AVERAGE(AB4:AB8)","v":{"$error":"#DIV/0!"}},{"$f":"IFERROR(AA3,\"\")","v":""},{"$f":"AVERAGE(AD4:AD8)","v":{"$error":"#DIV/0!"}},{"$f":"IFERROR(AC3,\"\")","v":""}]
[1,"1.1.1",false,{"$f":"IF(C4,A4,\"\")","v":""},false,{"$f":"IF(E4,A4,\"\")","v":""},1,"2.1.1",false,{"$f":"IF(I4,G4,\"\")","v":""},false,{"$f":"IF(K4,G4,\"\")","v":""},1,"3.1.1",false,{"$f":"IF(O4,M4,\"\")","v":""},false,{"$f":"IF(Q4,M4,\"\")","v":""},1,"4.1.1",false,{"$f":"IF(U4,S4,\"\")","v":""},false,{"$f":"IF(W4,S4,\"\")","v":""},1,"5.1.1",false,{"$f":"IF(AA4,Y4,\"\")","v":""},false,{"$f":"IF(AC4,Y4,\"\")","v":""}]
[2,"1.1.2",false,{"$f":"IF(C5,A5,\"\")","v":""},false,{"$f":"IF(E5,A5,\"\")","v":""},2,"2.1.2",false,{"$f":"IF(I5,G5,\"\")","v":""},false,{"$f":"IF(K5,G5,\"\")","v":""},2,"3.1.2",false,{"$f":"IF(O5,M5,\"\")","v":""},false,{"$f":"IF(Q5,M5,\"\")","v":""},2,"4.1.2",false,{"$f":"IF(U5,S5,\"\")","v":""},false,{"$f":"IF(W5,S5,\"\")","v":""},2,"1.1.2",false,{"$f":"IF(AA5,Y5,\"\")","v":""},false,{"$f":"IF(AC5,Y5,\"\")","v":""}]
[3,"1.1.3",false,{"$f":"IF(C6,A6,\"\")","v":""},false,{"$f":"IF(E6,A6,\"\")","v":""},3,"2.1.3",false,{"$f":"IF(I6,G6,\"\")","v":""},false,{"$f":"IF(K6,G6,\"\")","v":""},3,"3.1.3",false,{"$f":"IF(O6,M6,\"\")","v":""},false,{"$f":"IF(Q6,M6,\"\")","v":""},3,"4.1.3",false,{"$f":"IF(U6,S6,\"\")","v":""},false,{"$f":"IF(W6,S6,\"\")","v":""},3,"1.1.3",false,{"$f":"IF(AA6,Y6,\"\")","v":""},false,{"$f":"IF(AC6,Y6,\"\")","v":""}]
[4,"1.1.4",false,{"$f":"IF(C7,A7,\"\")","v":""},false,{"$f":"IF(E7,A7,\"\")","v":""},4,"2.1.4",false,{"$f":"IF(I7,G7,\"\")","v":""},false,{"$f":"IF(K7,G7,\"\")","v":""},4,"3.1.4",false,{"$f":"IF(O7,M7,\"\")","v":""},false,{"$f":"IF(Q7,M7,\"\")","v":""},4,"4.1.4",false,{"$f":"IF(U7,S7,\"\")","v":""},false,{"$f":"IF(W7,S7,\"\")","v":""},4,"1.1.4",false,{"$f":"IF(AA7,Y7,\"\")","v":""},false,{"$f":"IF(AC7,Y7,\"\")","v":""}]
[5,"1.1.5",false,{"$f":"IF(C8,A8,\"\")","v":""},false,{"$f":"IF(E8,A8,\"\")","v":""},5,"2.1.5",false,{"$f":"IF(I8,G8,\"\")","v":""},false,{"$f":"IF(K8,G8,\"\")","v":""},5,"3.1.5",false,{"$f":"IF(O8,M8,\"\")","v":""},false,{"$f":"IF(Q8,M8,\"\")","v":""},5,"4.1.5",false,{"$f":"IF(U8,S8,\"\")","v":""},false,{"$f":"IF(W8,S8,\"\")","v":""},5,"1.1.5",false,{"$f":"IF(AA8,Y8,\"\")","v":""},false,{"$f":"IF(AC8,Y8,\"\")","v":""}]
{"$rows_left_out":36}
{"sheet":"Assessment Summary","index":6,"n_rows":50,"n_cols":6,"rows_kept":50,"cut":false,"hidden":false,"merged":[[2,4,2,5],[2,1,2,3],[27,1,27,3]]}
[]
[null,null,"Consensus Assessment"]
[null,"Assessment Areas"]
[null,"ID","Element","Sub-Element","Consensus Current Level","Consensus Desired Level"]
[null,"1.1.","Data Strategy and Governance","Strategy and Direction",{"$f":"Calculations!D3","v":""},{"$f":"Calculations!F3","v":""}]
[null,"1.2.","Data Strategy and Governance","Roles and Accountability",{"$f":"Calculations!D10","v":""},{"$f":"Calculations!F10","v":""}]
[null,"1.3.","Data Strategy and Governance","Policies and Processes",{"$f":"Calculations!D17","v":""},{"$f":"Calculations!F17","v":""}]
[null,"1.4.","Data Strategy and Governance","Data Asset Inventory and Value",{"$f":"Calculations!D24","v":""},{"$f":"Calculations!F24","v":""}]
{"$rows_left_out":43}
{"sheet":"Improvement Identification","index":8,"n_rows":85,"n_cols":12,"rows_kept":85,"cut":false,"hidden":false,"merged":[[73,8,76,8],[77,8,80,8],[81,8,84,8],[37,8,40,8],[41,8,44,8],[45,8,48,8],[49,8,52,8],[53,8,56,8],[57,8,60,8],[61,8,64,8],[65,8,68,8],[69,8,72,8],[1,8,4,8],[5,8,8,8],[9,8,12,8],[13,8,16,8],[17,8,20,8],[21,8,24,8],[25,8,28,8],[29,8,32,8],[33,8,36,8],[81,4,84,4],[81,5,84,5],[81,6,84,6],[81,7,84,7],[73,4,76,4],[73,5,76,5],[73,6,76,6],[73,7,76,7],[77,4,80,4],[77,5,80,5],[77,6,80,6],[77,7,80,7],[65,4,68,4],[65,5,68,5],[65,6,68,6],[65,7,68,7],[69,4,72,4],[69,5,72,5],[69,6,72,6],[69,7,72,7],[57,4,60,4],[57,5,60,5],[57,6,60,6],[57,7,60,7],[61,4,64,4],[61,5,64,5],[61,6,64,6],[61,7,64,7],[49,4,52,4],[49,5,52,5],[49,6,52,6],[49,7,52,7],[53,4,56,4],[53,5,56,5],[53,6,56,6],[53,7,56,7],[41,4,44,4],[41,5,44,5],[41,6,44,6],[41,7,44,7],[45,4,48,4],[45,5,48,5],[45,6,48,6],[45,7,48,7],[33,4,36,4],[33,5,36,5],[33,6,36,6],[33,7,36,7],[37,4,40,4],[37,5,40,5],[37,6,40,6],[37,7,40,7],[25,4,28,4],[25,5,28,5],[25,6,28,6],[25,7,28,7],[29,4,32,4],[29,5,32,5],[29,6,32,6],[29,7,32,7],[17,4,20,4],[17,5,20,5],[17,6,20,6],[17,7,20,7],[21,4,24,4],[21,5,24,5],[21,6,24,6],[21,7,24,7],[9,4,12,4],[9,5,12,5],[9,6,12,6],[9,7,12,7],[13,4,16,4],[13,5,16,5],[13,6,16,6],[13,7,16,7],[1,4,4,4],[1,5,4,5],[1,6,4,6],[1,7,4,7],[5,4,8,4],[5,5,8,5],[5,6,8,6],[5,7,8,7],[81,0,84,0],[81,1,84,1],[81,2,84,2],[81,3,84,3],[73,0,76,0],[73,1,76,1],[73,2,76,2],[73,3,76,3],[77,0,80,0],[77,1,80,1],[77,2,80,2],[77,3,80,3],[65,0,68,0],[65,1,68,1],[65,2,68,2],[65,3,68,3],[69,0,72,0],[69,1,72,1],[69,2,72,2],[69,3,72,3],[57,0,60,0],[57,1,60,1],[57,2,60,2],[57,3,60,3],[61,0,64,0],[61,1,64,1],[61,2,64,2],[61,3,64,3],[49,0,52,0],[49,1,52,1],[49,2,52,2],[49,3,52,3],[53,0,56,0],[53,1,56,1],[53,2,56,2],[53,3,56,3],[41,0,44,0],[41,1,44,1],[41,2,44,2],[41,3,44,3],[45,0,48,0],[45,1,48,1],[45,2,48,2],[45,3,48,3],[33,0,36,0],[33,1,36,1],[33,2,36,2],[33,3,36,3],[37,0,40,0],[37,1,40,1],[37,2,40,2],[37,3,40,3],[25,0,28,0],[25,1,28,1],[25,2,28,2],[25,3,28,3],[29,0,32,0],[29,1,32,1],[29,2,32,2],[29,3,32,3],[1,3,4,3],[1,2,4,2],[1,1,4,1],[1,0,4,0],[21,0,24,0],[21,1,24,1],[21,2,24,2],[21,3,24,3],[9,3,12,3],[9,2,12,2],[9,1,12,1],[9,0,12,0],[5,0,8,0],[5,1,8,1],[5,2,8,2],[5,3,8,3],[17,0,20,0],[17,1,20,1],[17,2,20,2],[17,3,20,3],[13,3,16,3],[13,2,16,2],[13,1,16,1],[13,0,16,0]]}
["ID","Sub-Element","Consensus Current Level","Consensus Desired Level","Consensus Comments","Consensus Potential Improvements","Business Impacts of Taking No Action","Possible Improvements","Prioritization","Targeted Improvements","Targeted Improvement Descriptions","Include in Action Plan?\n(TBD / Yes / No)"]
["1.1.","Strategy and Direction",{"$f":"'Assessment Summary'!E5","v":""},{"$f":"'Assessment Summary'!F5","v":""},{"$f":"IF(ISBLANK('Assessment Summary'!C30),\"\",'Assessment Summary'!C30)","v":""},{"$f":"IF(ISBLANK('Assessment Summary'!D30),\"\",'Assessment Summary'!D30)","v":""},"Uncoordinated, decentralized data decisions\n\nUnproductive of lower-value data investments\n\nDuplication of data and efforts","Data Governance Bodies\n\nData Governance and Stewardship Policies\n\nData Business Plans","Medium",null,null,{"$f":"IF(ISBLANK(J2),\"\",\"TBD\")","v":""}]
[null,null,null,null,null,null,null,null,null,null,null,{"$f":"IF(ISBLANK(J3),\"\",\"TBD\")","v":""}]
[null,null,null,null,null,null,null,null,null,null,null,{"$f":"IF(ISBLANK(J4),\"\",\"TBD\")","v":""}]
[null,null,null,null,null,null,null,null,null,null,null,""]
["1.2.","Roles and Accountability",{"$f":"'Assessment Summary'!E6","v":""},{"$f":"'Assessment Summary'!F6","v":""},{"$f":"IF(ISBLANK('Assessment Summary'!C31),\"\",'Assessment Summary'!C31)","v":""},{"$f":"IF(ISBLANK('Assessment Summary'!D31),\"\",'Assessment Summary'!D31)","v":""},"Undefined or informal responsibilities\n\nInsufficient training\n\nLess consistent documentation and data quality","Data Governance Bodies\n\nData Governance and Stewardship Policies\n\nData Business Plans\n\nData Management Roles and Responsibilities",null,null,null,{"$f":"IF(ISBLANK(J6),\"\",\"TBD\")","v":""}]
[null,null,null,null,null,null,null,null,null,null,null,""]
[null,null,null,null,null,null,null,null,null,null,null,""]
{"$rows_left_out":78}
{"sheet":"Action Planning","index":9,"n_rows":11,"n_cols":14,"rows_kept":11,"cut":false,"hidden":false,"merged":[]}
["ID","Action","Sub-Elements","Business Need","Gap","Description","Benefit of Taking Action","Priority\n(High/Med/Low)","Implementation Difficulty\n(High/Med/Low)","Implementation Lead","Status\n(Proposed, Planned, In Progress, Complete)","Target Completion","Dependencies or Blockers","Comments"]
[1]
[2]
[3]
[4]
[5]
[6]
[7]
{"$rows_left_out":4}
{"sheet":"Validation Lists","index":10,"n_rows":6,"n_cols":15,"rows_kept":6,"cut":false,"hidden":true,"merged":[[0,0,0,8]]}
["Action Planning"]
["Description","Implementation Lead","Business Owner","Other Staff Support","Estimated Improvement Time","Resource Requirements","Target Completion Date","Current Status","Status Date","Next Milestone","Next Milestone Date","Business Case Documented","Comments","Prioritization","Include in Action Plan?"]
[null,null,null,null,"<3 months","Existing Project/Initiative",null,null,null,null,null,"Yes",null,"Low","TBD"]
[null,null,null,null,"3-6 months","New (In House Only)",null,null,null,null,null,"No",null,"Medium","Yes"]
[null,null,null,null,"6-12 months","New (External Support)",null,null,null,null,null,"Desired",null,"High","No"]
[null,null,null,null,">12 months",null,null,null,null,null,null,"TBD"]

{"sheet":"Individual Summary","index":11,"n_rows":1,"n_cols":6,"rows_kept":1,"cut":false,"hidden":false,"merged":[]}
["ID","Element","Sub-Element","Current Level","Desired Level","Assessed By"]

{"sheet":"Individual Notes","index":12,"n_rows":1,"n_cols":4,"rows_kept":1,"cut":false,"hidden":false,"merged":[]}
["ID","Comments","Improvements","Assessed By"]