{"text_format":"1","workbook":"xlsx","n_sheets":10,"sheets":["Menu","Instructions","Configuration","Glossary","1. Data Strategy & Governance","2. Data Life Cycle Management","3. Data Arch. & Integration","4. Data Collaboration","5. Data Quality","Results"],"not_rendered":{"charts":14,"images":0,"macros":1,"external_links":0,"defined_names":6,"comments":0,"pivot_tables":0},"unopened":[],"bounds":{"document_bytes":16777216,"sheet_cells":100000,"rows_first":2000,"rows_last":500,"rows_between":2000,"halvings":0,"cell_chars":16384,"cell_head_chars":4096},"cells_cut":0,"cells_raw":0,"read":"whole","date_system":"1900"}

{"sheet":"Menu","index":0,"n_rows":11,"n_cols":4,"rows_kept":11,"cut":false,"hidden":false,"merged":[[1,2,1,7],[2,2,2,7],[10,3,11,6]]}
[]
[null,null,"NCHRP 08-92 Data Management Assessment"]
[null,null,"Agency Level"]
[]
[]
[]
[]
[]
[]
[]
{"$rows_left_out":2}
{"sheet":"Instructions","index":1,"n_rows":53,"n_cols":13,"rows_kept":53,"cut":false,"hidden":false,"merged":[[36,1,36,18],[37,12,37,13],[1,1,1,18],[3,1,3,18]]}
[]
[null,"Instructions"]
[]
[null,"Overview"]
[null,"This tool allows the agency to self-assess the maturity level of its data management practices based on five elements:"]
[]
[null,"Data Strategy and Governance"]
[null,"Data Life Cycle Management"]
[null,"Data Architecture and Integration"]
[null,"Data Collaboration"]
{"$rows_left_out":44}
{"sheet":"Configuration","index":2,"n_rows":36,"n_cols":12,"rows_kept":36,"cut":false,"hidden":false,"merged":[[13,5,18,5],[25,1,26,1],[25,4,26,4],[4,1,4,4],[6,3,6,4],[25,5,26,5],[8,1,12,1],[13,1,18,1],[19,1,22,1],[23,1,24,1],[8,4,12,4],[13,4,18,4],[6,1,7,1],[6,2,7,2],[19,4,22,4],[23,4,24,4],[23,5,24,5],[19,5,22,5],[8,5,12,5]]}
[]
[]
[]
[]
[null,"Configuration",null,null,null,null,"Totally Disagree"]
[null,null,null,null,null,null,"Somewhat Disagree"]
[null,"Element","Sub-Element","Weights",null,null,"Somewhat Agree"]
[null,null,null,"Sub-Element","Element",null,"Totally Agree"]
[1.1000000000000001,"Data Strategy and Governance","Strategy and Direction",0.2,0.2,{"$f":"IF(OR(SUM(D9:D13)<0.99, SUM(D9:D13)>1.01),B9&\" sub-element weights must sum to 100%\",\"\")","v":""},null,null,null,null,null,0.2]
[1.2,null,"Roles and Accountability",0.2,null,null,null,null,null,null,null,0.2]
{"$rows_left_out":27}
{"sheet":"Glossary","index":3,"n_rows":32,"n_cols":6,"rows_kept":32,"cut":false,"hidden":false,"merged":[[4,1,4,4]]}
[]
[]
[]
[]
[null,"Glossary of Terms"]
[]
[null,"Business rule",null,null,null,"A formally stated constraint governing the characteristics or behavior of an object or the relationship between objects (entities). Example: the width of an Interstate lane is 12 feet."]
[null,"Change management",null,null,null,"Processes in place to review, evaluate and coordinate changes to data products, applications and systems before they are implemented to minimize impacts to users and reduce any change –related errors."]
[null,"Data architecture",null,null,null,"A master set of data models and design approaches identifying the strategic data requirements and the components of data management solutions, usually at an enterprise level."]
[null,"Data archiving",null,null,null,"The process of moving data that is no longer actively used to a separate data storage device for long-term retention."]
{"$rows_left_out":23}
{"sheet":"1. Data Strategy & Governance","index":4,"n_rows":73,"n_cols":34,"rows_kept":73,"cut":false,"hidden":false,"merged":[[66,1,67,19],[64,2,64,18],[48,2,48,18],[49,2,49,18],[60,2,60,18],[61,2,61,18],[62,2,62,18],[63,2,63,18],[51,1,52,19],[47,2,47,18],[22,2,22,18],[23,2,23,18],[24,2,24,18],[25,2,25,18],[33,2,33,18],[34,2,34,18],[35,2,35,18],[36,2,36,18],[37,2,37,18],[45,2,45,18],[46,2,46,18],[27,1,28,19],[39,1,40,19],[21,2,21,18],[9,2,9,18],[10,2,10,18],[11,2,11,18],[12,2,12,18],[13,2,13,18],[15,1,16,19]]}
[null,null,null,null,null,null,null,null,null,null,null,null,null,null,null,null,null,null,null,null,"clearCol"]
[]
[]
[null,null,null,null,null,null,null,null,null,null,null,null,null,null,null,null,null,null,null,null,null,null,null,null,null,null,null,null,null,null,null,null,"Answer",0]
[1,"1. Data Strategy and Governance - Agency Level Evaluation",null,null,null,null,null,null,null,null,null,null,null,null,null,null,null,null,null,null,null,null,null,null,null,null,null,null,null,null,null,null,"Totally Disagree",1]
[null,"Leadership and management practices to manage data as a strategic agency asset.",null,null,null,null,null,null,null,null,null,null,null,null,null,null,null,null,null,null,null,null,null,null,null,null,null,null,null,null,null,null,"Somewhat Disagree",2]
[null,null,null,null,null,null,null,null,null,null,null,null,null,null,null,null,null,null,null,null,null,null,null,null,null,null,null,null,null,null,null,null,"Somewhat Agree",3]
[1.1000000000000001,"1.1","Strategy and Direction",null,null,null,null,null,null,null,null,null,null,null,null,null,null,null,null,null,null,null,null,null,null,null,null,null,null,null,null,null,"Totally Agree",4]
[null,null,"Leadership commitment and strategic planning to maximize value of data to meet agency goals.",null,null,null,null,null,null,null,null,null,null,null,null,null,null,null,null,null,null,"answerVal","includeCheck","responseCheck"]
[1,"1.1.1","Data collection and management is performed by individual business units with little or no agency-wide direction or coordination:\nData improvements are not systematically or regularly identified - they are implemented on a reactive or opportunistic basis:",null,null,null,null,null,null,null,null,null,null,null,null,null,null,null,null,"Answer","clearRow",{"$f":"VLOOKUP(T10,$AG$4:$AH$8,2,FALSE)","v":0},{"$f":"IF(VLOOKUP($A$8,Configuration!$A$9:$E$27,4, FALSE)=0, 0, 1)","v":1},{"$f":"IF(W10=0,\"N/A\",T10)","v":"Answer"}]
{"$rows_left_out":64}
{"sheet":"2. Data Life Cycle Management","index":5,"n_rows":82,"n_cols":33,"rows_kept":82,"cut":false,"hidden":false,"merged":[[75,1,76,18],[73,2,73,17],[48,2,48,17],[49,2,49,17],[57,2,57,17],[58,2,58,17],[59,2,59,17],[60,2,60,17],[61,2,61,17],[69,2,69,17],[70,2,70,17],[71,2,71,17],[72,2,72,17],[51,1,52,18],[63,1,64,18],[47,2,47,17],[22,2,22,17],[23,2,23,17],[24,2,24,17],[25,2,25,17],[33,2,33,17],[34,2,34,17],[35,2,35,17],[36,2,36,17],[37,2,37,17],[45,2,45,17],[46,2,46,17],[27,1,28,18],[39,1,40,18],[21,2,21,17],[9,2,9,17],[10,2,10,17],[11,2,11,17],[12,2,12,17],[13,2,13,17],[15,1,16,18]]}
[null,null,null,null,null,null,null,null,null,null,null,null,null,null,null,null,null,null,null,"clearCol"]
[]
[]
[null,null,null,null,null,null,null,null,null,null,null,null,null,null,null,null,null,null,null,null,null,null,null,null,null,null,null,null,null,null,null,"Answer",0]
[2,"2. Data Life Cycle Management - Agency Level Evaluation",null,null,null,null,null,null,null,null,null,null,null,null,null,null,null,null,null,null,null,null,null,null,null,null,null,null,null,null,null,"Totally Disagree",1]
[null,"Practices for managing data throughout its life cycle from collection to archiving or deletion.",null,null,null,null,null,null,null,null,null,null,null,null,null,null,null,null,null,null,null,null,null,null,null,null,null,null,null,null,null,"Somewhat Disagree",2]
[null,null,null,null,null,null,null,null,null,null,null,null,null,null,null,null,null,null,null,null,null,null,null,null,null,null,null,null,null,null,null,"Somewhat Agree",3]
[2.1,"2.1.","Data Updating",null,null,null,null,null,null,null,null,null,null,null,null,null,null,null,null,null,null,null,null,null,null,null,null,null,null,null,null,"Totally Agree",4]
[null,null,"Well-defined and coordinated data update cycles.",null,null,null,null,null,null,null,null,null,null,null,null,null,null,null,null,null,"answerVal","includeCheck","responseCheck"]
[1,"2.1.1","Data updating cycles and business rules for data updates have not been defined:",null,null,null,null,null,null,null,null,null,null,null,null,null,null,null,"Answer","clearRow",{"$f":"VLOOKUP(S10,$AF$4:$AG$8,2,FALSE)","v":0},{"$f":"IF(VLOOKUP($A$8,Configuration!$A$9:$E$27,4, FALSE)=0, 0, 1)","v":1},{"$f":"IF(V10=0,\"N/A\",S10)","v":"Answer"}]
{"$rows_left_out":73}
{"sheet":"3. Data Arch. & Integration","index":6,"n_rows":58,"n_cols":34,"rows_kept":58,"cut":false,"hidden":false,"merged":[[51,1,52,19],[48,2,48,18],[49,2,49,18],[35,2,35,18],[36,2,36,18],[37,2,37,18],[45,2,45,18],[46,2,46,18],[47,2,47,18],[39,1,40,19],[34,2,34,18],[9,2,9,18],[10,2,10,18],[11,2,11,18],[12,2,12,18],[13,2,13,18],[21,2,21,18],[22,2,22,18],[23,2,23,18],[24,2,24,18],[25,2,25,18],[33,2,33,18],[15,1,16,19],[27,1,28,19]]}
[null,null,null,null,null,null,null,null,null,null,null,null,null,null,null,null,null,null,null,null,"clearCol"]
[]
[]
[null,null,null,null,null,null,null,null,null,null,null,null,null,null,null,null,null,null,null,null,null,null,null,null,null,null,null,null,null,null,null,null,"Answer",0]
[3,"3. Data Architecture and Integration - Agency Level Evaluation",null,null,null,null,null,null,null,null,null,null,null,null,null,null,null,null,null,null,null,null,null,null,null,null,null,null,null,null,null,null,"Totally Disagree",1]
[null,"Technical standards, processes, tools and coordination mechanisms to maximize data integration and minimize duplication.",null,null,null,null,null,null,null,null,null,null,null,null,null,null,null,null,null,null,null,null,null,null,null,null,null,null,null,null,null,null,"Somewhat Disagree",2]
[null,null,null,null,null,null,null,null,null,null,null,null,null,null,null,null,null,null,null,null,null,null,null,null,null,null,null,null,null,null,null,null,"Somewhat Agree",3]
[3.1,"3.1.","Location Referencing",null,null,null,null,null,null,null,null,null,null,null,null,null,null,null,null,null,null,null,null,null,null,null,null,null,null,null,null,null,"Totally Agree",4]
[null,null,"Common location referencing methods across agency data sets.",null,null,null,null,null,null,null,null,null,null,null,null,null,null,null,null,null,null,"answerVal","includeCheck","responseCheck"]
[1,"3.1.1","The agency does not have a single common LRS:\nData sets including location elements cannot be spatially integrated with other agency data sets:",null,null,null,null,null,null,null,null,null,null,null,null,null,null,null,null,"Answer","clearRow",{"$f":"VLOOKUP(T10,$AG$4:$AH$8,2,FALSE)","v":0},{"$f":"IF(VLOOKUP($A$8,Configuration!$A$9:$E$27,4, FALSE)=0, 0, 1)","v":1},{"$f":"IF(W10=0,\"N/A\",T10)","v":"Answer"}]
{"$rows_left_out":49}
{"sheet":"4. Data Collaboration","index":7,"n_rows":33,"n_cols":34,"rows_kept":33,"cut":false,"hidden":false,"merged":[[15,1,16,19],[27,1,28,19],[25,2,25,18],[21,2,21,18],[22,2,22,18],[23,2,23,18],[24,2,24,18],[9,2,9,18],[10,2,10,18],[11,2,11,18],[12,2,12,18],[13,2,13,18]]}
[null,null,null,null,null,null,null,null,null,null,null,null,null,null,null,null,null,null,null,null,"clearCol"]
[]
[]
[null,null,null,null,null,null,null,null,null,null,null,null,null,null,null,null,null,null,null,null,null,null,null,null,null,null,null,null,null,null,null,null,"Answer",0]
[4,"4. Data Collaboration - Agency Level Evaluation",null,null,null,null,null,null,null,null,null,null,null,null,null,null,null,null,null,null,null,null,null,null,null,null,null,null,null,null,null,null,"Totally Disagree",1]
[null,"Internal and external collaboration to maximize data sharing and avoid duplication of effort.",null,null,null,null,null,null,null,null,null,null,null,null,null,null,null,null,null,null,null,null,null,null,null,null,null,null,null,null,null,null,"Somewhat Disagree",2]
[null,null,null,null,null,null,null,null,null,null,null,null,null,null,null,null,null,null,null,null,null,null,null,null,null,null,null,null,null,null,null,null,"Somewhat Agree",3]
[4.0999999999999996,"4.1.","Internal Agency Collaboration",null,null,null,null,null,null,null,null,null,null,null,null,null,null,null,null,null,null,null,null,null,null,null,null,null,null,null,null,null,"Totally Agree",4]
[null,null,"Collaboration across agency business units to leverage opportunities for efficiencies in data collection and management",null,null,null,null,null,null,null,null,null,null,null,null,null,null,null,null,null,null,"answerVal","includeCheck","responseCheck"]
[1,"4.1.1","Most data collection efforts in the agency are independent - there have been little or no efforts to coordinate across business units:\nThe agency does not have information about the extent to which data are duplicated:",null,null,null,null,null,null,null,null,null,null,null,null,null,null,null,null,"Answer","clearRow",{"$f":"VLOOKUP(T10,$AG$4:$AH$8,2,FALSE)","v":0},{"$f":"IF(VLOOKUP($A$8,Configuration!$A$9:$E$27,4, FALSE)=0, 0, 1)","v":1},{"$f":"IF(W10=0,\"N/A\",T10)","v":"Answer"}]
{"$rows_left_out":24}
{"sheet":"5. Data Quality","index":8,"n_rows":34,"n_cols":30,"rows_kept":34,"cut":false,"hidden":false,"merged":[[27,1,28,15],[23,2,23,14],[24,2,24,14],[9,2,9,14],[10,2,10,14],[11,2,11,14],[12,2,12,14],[13,2,13,14],[15,1,16,15]]}
[null,null,null,null,null,null,null,null,null,null,null,null,null,null,null,null,"clearCol"]
[]
[]
[null,null,null,null,null,null,null,null,null,null,null,null,null,null,null,null,null,null,null,null,null,null,null,null,null,null,null,null,"Answer",0]
[5,"5. Data Quality - Agency Level Evaluation",null,null,null,null,null,null,null,null,null,null,null,null,null,null,null,null,null,null,null,null,null,null,null,null,null,null,"Totally Disagree",1]
[null,"Standards and practices to ensure that data are of sufficient quality to meet user needs.",null,null,null,null,null,null,null,null,null,null,null,null,null,null,null,null,null,null,null,null,null,null,null,null,null,null,"Somewhat Disagree",2]
[null,null,null,null,null,null,null,null,null,null,null,null,null,null,null,null,null,null,null,null,null,null,null,null,null,null,null,null,"Somewhat Agree",3]
[5.0999999999999996,"5.1.","Data Quality Measurement and Reporting",null,null,null,null,null,null,null,null,null,null,null,null,null,null,null,null,null,null,null,null,null,null,null,null,null,"Totally Agree",4]
[null,null,"Metrics and reporting to ensure user understanding of current data quality",null,null,null,null,null,null,null,null,null,null,null,null,null,null,"answerVal","includeCheck","responseCheck"]
[1,"5.1.1","There are no agency-wide activities related to data quality measurement and reporting:",null,null,null,null,null,null,null,null,null,null,null,null,"Answer","clearRow",{"$f":"VLOOKUP(P10,$AC$4:$AD$8,2,FALSE)","v":0},{"$f":"IF(VLOOKUP($A$8,Configuration!$A$9:$E$27,4, FALSE)=0, 0, 1)","v":1},{"$f":"IF(S10=0,\"N/A\",P10)","v":"Answer"}]
{"$rows_left_out":25}
{"sheet":"Results","index":9,"n_rows":19,"n_cols":15,"rows_kept":19,"cut":false,"hidden":false,"merged":[[18,13,25,13],[18,10,25,10],[18,11,25,11],[18,12,25,12],[17,10,17,14],[18,14,25,14],[4,1,4,14],[8,10,11,10],[6,10,6,14],[8,12,11,12],[8,11,11,11],[8,13,11,13],[8,14,11,14]]}
[]
[]
[]
[]
[null,"Results"]
[]
[null,null,null,"Overall Maturity Level",null,null,null,null,null,null,"Maturity Level Definitions"]
[null,null,null,{"$f":"IF(COUNTIF(C12:C16, \"<1\")>0, \"You have not completed every element\", F12)","v":"You have not completed every element"},null,null,null,null,null,null,"1-Initial","2-Developing","3-Defined","4-Functioning","5-Sustained"]
[null,null,null,null,null,null,null,null,null,null,"Ad-Hoc and event driven, success due to heroic efforts of individuals","Recognized need for improvement, pilot initiatives underway","Defined & documented processes not yet stabilized or widely socialized","Implemented processes - operating and adding value","Evaluated & improved processes, sustained over time"]
[]
{"$rows_left_out":9}