{"text_format":"1","workbook":"xlsx","n_sheets":9,"sheets":["Menu","Instructions","Configuration","Example Lists","Importance","Availability","Quality","Usability","Results"],"not_rendered":{"charts":6,"images":0,"macros":1,"external_links":2,"defined_names":38,"comments":0,"pivot_tables":0},"unopened":[],"bounds":{"document_bytes":16777216,"sheet_cells":100000,"rows_first":2000,"rows_last":500,"rows_between":2000,"halvings":0,"cell_chars":16384,"cell_head_chars":4096},"cells_cut":0,"cells_raw":0,"read":"whole","date_system":"1900"}

{"sheet":"Menu","index":0,"n_rows":10,"n_cols":4,"rows_kept":10,"cut":false,"hidden":false,"merged":[[1,2,1,7],[9,3,10,6]]}
[]
[null,null,"NCHRP 08-92 Data Value Assessment"]
[]
[]
[]
[]
[]
[]
[]
[null,null,null,"Self-Assessment Elements"]
{"$rows_left_out":1}
{"sheet":"Instructions","index":1,"n_rows":44,"n_cols":13,"rows_kept":44,"cut":false,"hidden":false,"merged":[[1,1,1,18],[3,1,3,18],[24,1,24,18],[25,12,25,13]]}
[]
[null,"Instructions"]
[]
[null,"Overview"]
[null,"This tool allows the agency to self-assess whether and how its data is adding value to a particular business area based on four elements:"]
[]
[null,"Data Importance"]
[null,"Data Availability"]
[null,"Data Quality"]
[null,"Data Usability"]
{"$rows_left_out":35}
{"sheet":"Configuration","index":2,"n_rows":54,"n_cols":3,"rows_kept":54,"cut":false,"hidden":false,"merged":[]}
[]
[null,"Configuration"]
[]
[]
[]
[]
[null,"Step 1:","Define the business area under consideration"]
[null,null,"Pavement Management"]
[]
[null,"Step 2:","List up to 20 activities related to this business area below (leave unfilled cells blank)"]
{"$rows_left_out":45}
{"sheet":"Example Lists","index":3,"n_rows":18,"n_cols":18,"rows_kept":18,"cut":false,"hidden":false,"merged":[[2,1,2,6],[2,8,2,17]]}
[]
[]
[null,"Sample Business Areas and Associated Activities",null,null,null,null,null,null,"Sample Data Types"]
["Select One","Asset Management","Maintenance Management","Project Scoping","Traffic Operations ","Safety Planning","Highway Planning","Select One","Transportation System Characteristics","Socio-Economic and Travel Demand Data","Road Asset Data","Facilities Asset Data","Travel Data","Safety Data","Financial, Program, and Project Data","Maintenance & Operations Data","Environmental Data","Organization and HR Data"]
[null,"Pavement Needs and Risk Assessment","Maintenance Budgeting","Current Conditions Assessment","Incident Management","Network Screening","Current Conditions Assessment",null,"Geospatial Foundation Data - base map, road centerlines, district/region boundaries, jurisdiction boundaries, urban boundaries","Land Use Data","Pavement Data - type, construction/layer history, condition (distress, roughness, rutting, faulting, skid)","Agency-Owned Land/Right of Way Data","Vehicle volumes - counts, classification, factors, AADT, WIM, VMT","Crash Records - Police Accident Reports, Hotspots, etc.","Organizational Budget and Expenditure Data","Maintenance Work Orders, resource utilization, accomplishment","Sensitive Habitats","Organization Chart"]
[null,"Pavement Resource Allocation and Treatment Selection","Maintenance Activity Tracking","Scope Development","Traveler Information","Countermeasure Analysis","Future Demand Analysis",null,"Route designations, lengths, linear referencing system (LRS)","Demographics (Population, Employment, etc.) - current and forecast","Structure & Bridge Data - inventory, condition","Rest Area Inventory & Condition","Bicycle and Pedestrian counts","Fatalities","Revenues/Funding Data - current and projected, total and remaining","Maintenance level of service/maintenance feature quality","Climate Vulnerability Assessments","Position Data"]
[null,"Bridge Needs and Risk Assessment","Equipment Management","Schedule and Budget Development","Signal Timing and Coordination","Countermeasure Design","Alternatives Evaluation",null,"Road classification: functional class, NHS, urban/rural, ownership, etc.",null,"Drainage/Roadside Assets (culverts, pipes, shoulders, vegetation)","Park & Ride Lot Inventory & Condition","Freight Movement Data – commodity flows, supply chain, etc.","Injuries","Annual Capital and Maintenance Outlays","Fleet/Equipment Inventory and Utilization Data","Elevation Data","Employee Data/Personnel Records"]
[null,"Bridge Resource Allocation and Treatment Selection","Materials Management",null,"Active Traffic Management","Countermeasure Evaluation","Strategy Prioritization",null,"Road operational characteristics (mainline/ramp, # lanes, direction, divided/undivided, access control, etc.)",null,"Traffic and Safety Assets (signs, barriers, signals, highway  lighting, pavement markings)","Building Inventory & Condition","Travel Time, Speeds, Bottlenecks, Congestion, Reliability ","Work Zone Safety","Program Data (including TIP/STIP)","Snow Plow Routes","Fish Passage Data"]
[null,"Other Asset Needs Assessment and Budgeting","Winter Maintenance - Snow Route Planning, Snow Plow Tracking",null,"Work Zone Management","Project Prioritization",null,null,"HPMS Data (includes multiple data elements included on this list)",null,"Other Road Assets (retaining walls, noise walls, rock fall protection sites)","Airport Inventory","Travel Patterns (Origin-Destination, Mode Split, etc.) - travel survey, demand model results","Rail Road Crossing Inventory","Program and Project Delivery Data (on-time, on-budget)","Materials Inventory and Utilization Data","Outfalls/Stormwater Inventory Data"]
[null,"Cross-Asset Tradeoffs",null,null,null,null,null,null,"Interchange and intersection characteristics",null,"Imagery/LiDAR Data","Rail Lines, Stations, Yards Inventory",null,"Medical Outcomes - Emergency Medical System data","Project Data - Scoping Documents and Design Plans","Incident Data - type, status, response time","Water Quality Data"]
{"$rows_left_out":9}
{"sheet":"Importance","index":4,"n_rows":528,"n_cols":18,"rows_kept":528,"cut":false,"hidden":false,"merged":[[525,1,526,2],[239,1,240,2],[265,1,266,2],[291,1,292,2],[317,1,318,2],[343,1,344,2],[369,1,370,2],[395,1,396,2],[421,1,422,2],[447,1,448,2],[473,1,474,2],[499,1,500,2],[213,1,214,2],[3,1,3,2],[4,1,4,2],[5,1,5,2],[6,1,6,2],[31,1,32,2],[57,1,58,2],[83,1,84,2],[109,1,110,2],[135,1,136,2],[161,1,162,2],[187,1,188,2]]}
[1,null,null,"clearCol","hideCol","calcCol","progressCol","progressCol2","usabilityWeightCol","usabilityWeightCol2","usabilityCol","qualityWeightCol","qualityWeightCol2","quality",null,null,"picklist","weight"]
[null,{"$f":"\"Data Importance Rating: \"&Configuration!C8","v":"Data Importance Rating: Pavement Management"},null,null,null,null,null,{"$f":"COUNTIFS(D10:D528, \"=clearRow\",E10:E528, \"=No\")","v":25},null,null,null,null,null,null,null,null,"Answer"]
[null,"How would you rate the importance of each data set for the following activities?",null,null,null,null,null,{"$f":"COUNT(G10:G528)","v":0},null,null,null,null,null,null,null,null,"High Importance",3]
[null,"High Importance: Essential; can’t perform this activity without it",null,null,null,null,null,{"$f":"H3/H2","v":0},null,null,null,null,null,null,null,null,"Medium Importance",2]
[null,"Medium Importance: Valuable; could do without it, but would impact value or credibility of results",null,null,null,null,null,null,null,null,null,null,null,null,null,null,"Low Importance",1]
[null,"Low Importance: Helpful; but could do without it",null,null,null,null,null,null,null,null,null,null,null,null,null,null,"NA",0]
[null,"NA: Don’t use this data source for this activity",null,null,null,null,"Progress:",{"$f":"IFERROR(H4,0)","v":0}]
[]
["lookupVal"]
["A1",{"$f":"\"Activity: \"& VLOOKUP(A10,Configuration!$B$11:$C$30,2, FALSE)","v":"Activity: Understanding System Performance"},"Importance Rating",null,{"$f":"IF(VLOOKUP(A10,Configuration!$B$11:$C$30,2,FALSE)=0,\"Yes\", \"No\")","v":"No"},null,null,null,{"$f":"SUM(I11:I30)","v":0},null,{"$f":"IF(OR(Progress4<>1, COUNT(G11:G30)<>COUNTIF(E11:E30,\"=No\")),\"\",SUMPRODUCT(J11:J30,Usability!$F$12:$F$31))","v":""},{"$f":"SUM(L11:L30)","v":0},null,{"$f":"IF(OR(Progress3<>1, COUNT(G11:G30)<>COUNTIF(E11:E30,\"=No\")),\"\",SUMPRODUCT(M11:M30,Quality!$H$13:$H$32))","v":""}]
{"$rows_left_out":519}
{"sheet":"Availability","index":5,"n_rows":33,"n_cols":13,"rows_kept":33,"cut":false,"hidden":false,"merged":[[32,1,33,2],[3,1,3,2],[4,1,4,2],[5,1,5,2],[6,1,6,2]]}
[1,null,null,"clearCol","hideCol","progressCol",null,null,null,null,null,null,"picklist"]
[null,{"$f":"\"Data Availability Rating: \"&Configuration!C8","v":"Data Availability Rating: Pavement Management"},null,null,null,{"$f":"COUNTIFS(D12:D31, \"=clearRow\",E12:E31, \"=No\")","v":5},null,null,null,null,null,null,"Answer"]
[null,"How would you rate the availability of data to help you with these activities?",null,null,null,{"$f":"COUNTIF(C12:C31, \"<>Answer\")","v":0},null,null,null,null,null,null,"Poor"]
[null,"Poor: Little or no data available to support this activity",null,null,null,{"$f":"F3/F2","v":0},null,null,null,null,null,null,"Fair"]
[null,"Fair: Limited data available - large gaps remain",null,null,null,null,null,null,null,null,null,null,"Good"]
[null,"Good: Basic data are available - some gaps remain",null,null,null,null,null,null,null,null,null,null,"Excellent"]
[null,"Excellent: Sufficient data are available to meet needs - no gaps",null,null,null,null,"Progress:",{"$f":"IFERROR(F4,0)","v":0},null,null,null,null,"NA"]
[null,"NA: Don't know - not enough information"]
[]
[]
{"$rows_left_out":24}
{"sheet":"Quality","index":6,"n_rows":57,"n_cols":17,"rows_kept":57,"cut":false,"hidden":false,"merged":[[33,1,34,4],[10,2,10,4]]}
[1,null,null,null,null,"clearCol","hideCol","calcCol","progressCol",null,null,null,null,null,"picklist","lookup","lookup2"]
[null,{"$f":"\"Data Quality Rating: \"&Configuration!C8","v":"Data Quality Rating: Pavement Management"},null,null,null,null,null,null,{"$f":"COUNTIFS(F12:F36, \"=clearRow\",G12:G36, \"=No\")*3","v":15},null,null,null,null,null,"Answer"]
[null,"How would you rate the quality of available data for these activities - considering level of detail, timeliness, completeness and consistency?",null,null,null,null,null,null,{"$f":"COUNTIF(C13:E32,\"<>Answer\")","v":0},null,null,null,null,null,"Poor",1,"Poor"]
[null,"Poor: Data aren't detailed, current, accurate or complete enough to be useful",null,null,null,null,null,null,{"$f":"I3/I2","v":0},null,null,null,null,null,"Fair",2,"Fair"]
[null,"Fair: Data are useful but lack of currency, accuracy or completeness limits value",null,null,null,null,null,null,null,null,null,null,null,null,"Good",3,"Good"]
[null,"Good: Data quality is acceptable but should be improved",null,null,null,null,null,null,null,null,null,null,null,null,"Excellent",4,"Excellent"]
[null,"Excellent: Data quality is sufficient for this activity - no improvements are needed",null,null,null,null,null,null,"Progress:",{"$f":"IFERROR(I4,0)","v":0},null,null,null,null,"NA",0,"NA"]
[null,"NA: Don't know - not enough information"]
[]
[]
{"$rows_left_out":48}
{"sheet":"Usability","index":7,"n_rows":33,"n_cols":14,"rows_kept":33,"cut":false,"hidden":false,"merged":[[3,1,3,2],[4,1,4,2],[5,1,5,2],[6,1,6,2],[32,1,33,2]]}
[1,null,null,"clearCol","hideCol","calcCol","progressCol",null,null,null,null,null,"picklist"]
[null,{"$f":"\"Data Usability Rating: \"&Configuration!C8","v":"Data Usability Rating: Pavement Management"},null,null,null,null,{"$f":"COUNTIFS(D12:D31, \"=clearRow\",E12:E31, \"=No\")","v":5},null,null,null,null,null,"Answer"]
[null,"How would you rate the ease of accessing, summarizing and using the available data?",null,null,null,null,{"$f":"COUNTIF(C12:C31,\"<>Answer\")","v":0},null,null,null,null,null,"Poor",1]
[null,"Poor: Data are available but require substantial effort to translate into usable form",null,null,null,null,{"$f":"G3/G2","v":0},null,null,null,null,null,"Fair",2]
[null,"Fair: Data are available but require moderate effort to translate into usable form",null,null,null,null,null,null,null,null,null,null,"Good",3]
[null,"Good: Data are available in a usable form but improvements to reporting capabilities would be helpful",null,null,null,null,null,null,null,null,null,null,"Excellent",4]
[null,"Excellent: Data are available in a usable form - no improvements needed",null,null,null,null,"Progress:",{"$f":"IFERROR(G4,0)","v":0},null,null,null,null,"NA",0]
[null,"NA: Don't know - not enough information"]
[]
["lookupVal"]
{"$rows_left_out":24}
{"sheet":"Results","index":8,"n_rows":76,"n_cols":12,"rows_kept":76,"cut":false,"hidden":false,"merged":[[5,3,5,5],[3,1,3,6]]}
[null,null,null,null,null,null,null,"hideCol"]
[null,null,null,null,null,null,null,null,null,1,"Poor",1]
[null,null,null,null,null,null,null,null,null,2,"Fair",2]
[null,{"$f":"\"Results: \"&Configuration!C8","v":"Results: Pavement Management"},null,null,null,null,null,null,null,3,"Good",3]
[null,null,null,null,null,null,null,null,null,4,"Excellent",4]
[null,null,null,"Quality"]
["lookupVal","Data Source","Importance","Currency","Accuracy","Completeness","Usability"]
["S1",{"$f":"VLOOKUP(A8,Configuration!$B$33:$C$52, 2, FALSE)","v":"Pavement Distress, Rutting and Roughness"},{"$f":"VLOOKUP(A8,Importance!$A$11:$F$30,6,FALSE)","v":""},{"$f":"IF(VLOOKUP(A8,Quality!$A$13:$E$32,3,FALSE)=\"Answer\",\"\", VLOOKUP(A8,Quality!$A$13:$E$32,3,FALSE))","v":""},{"$f":"IF(VLOOKUP(A8,Quality!$A$13:$E$32,4,FALSE)=\"Answer\",\"\",VLOOKUP(A8,Quality!$A$13:$E$32,4,FALSE))","v":""},{"$f":"IF(VLOOKUP(A8,Quality!$A$13:$E$32,5,FALSE)=\"Answer\", \"\", VLOOKUP(A8,Quality!$A$13:$E$32,5,FALSE))","v":""},{"$f":"IF(VLOOKUP(A8,Usability!$A$12:$C$31,3,FALSE)=\"Answer\",\"\",VLOOKUP(A8,Usability!$A$12:$C$31,3,FALSE))","v":""},{"$f":"IF(VLOOKUP(A8,Configuration!$B$33:$C$52,2,FALSE)=0, \"Yes\", \"No\")","v":"No"}]
["S2",{"$f":"VLOOKUP(A9,Configuration!$B$33:$C$52, 2, FALSE)","v":"Linear Referencing (routes, intersections, mileposts)"},{"$f":"VLOOKUP(A9,Importance!$A$11:$F$30,6,FALSE)","v":""},{"$f":"IF(VLOOKUP(A9,Quality!$A$13:$E$32,3,FALSE)=\"Answer\",\"\", VLOOKUP(A9,Quality!$A$13:$E$32,3,FALSE))","v":""},{"$f":"IF(VLOOKUP(A9,Quality!$A$13:$E$32,4,FALSE)=\"Answer\",\"\",VLOOKUP(A9,Quality!$A$13:$E$32,4,FALSE))","v":""},{"$f":"IF(VLOOKUP(A9,Quality!$A$13:$E$32,5,FALSE)=\"Answer\", \"\", VLOOKUP(A9,Quality!$A$13:$E$32,5,FALSE))","v":""},{"$f":"IF(VLOOKUP(A9,Usability!$A$12:$C$31,3,FALSE)=\"Answer\",\"\",VLOOKUP(A9,Usability!$A$12:$C$31,3,FALSE))","v":""},{"$f":"IF(VLOOKUP(A9,Configuration!$B$33:$C$52,2,FALSE)=0, \"Yes\", \"No\")","v":"No"}]
["S3",{"$f":"VLOOKUP(A10,Configuration!$B$33:$C$52, 2, FALSE)","v":"Traffic - AADT, Trucks, ESALS"},{"$f":"VLOOKUP(A10,Importance!$A$11:$F$30,6,FALSE)","v":""},{"$f":"IF(VLOOKUP(A10,Quality!$A$13:$E$32,3,FALSE)=\"Answer\",\"\", VLOOKUP(A10,Quality!$A$13:$E$32,3,FALSE))","v":""},{"$f":"IF(VLOOKUP(A10,Quality!$A$13:$E$32,4,FALSE)=\"Answer\",\"\",VLOOKUP(A10,Quality!$A$13:$E$32,4,FALSE))","v":""},{"$f":"IF(VLOOKUP(A10,Quality!$A$13:$E$32,5,FALSE)=\"Answer\", \"\", VLOOKUP(A10,Quality!$A$13:$E$32,5,FALSE))","v":""},{"$f":"IF(VLOOKUP(A10,Usability!$A$12:$C$31,3,FALSE)=\"Answer\",\"\",VLOOKUP(A10,Usability!$A$12:$C$31,3,FALSE))","v":""},{"$f":"IF(VLOOKUP(A10,Configuration!$B$33:$C$52,2,FALSE)=0, \"Yes\", \"No\")","v":"No"}]
{"$rows_left_out":66}