{"text_format":"1","workbook":"xlsx","n_sheets":9,"sheets":["Menu","Instructions","Configuration","Example Lists","Importance","Availability","Quality","Usability","Results"],"not_rendered":{"charts":6,"images":0,"macros":1,"external_links":2,"defined_names":38,"comments":0,"pivot_tables":0},"unopened":[],"bounds":{"document_bytes":16777216,"sheet_cells":100000,"rows_first":2000,"rows_last":500,"rows_between":2000,"halvings":0,"cell_chars":16384,"cell_head_chars":4096},"cells_cut":0,"cells_raw":0,"read":"whole","date_system":"1900"}

{"sheet":"Menu","index":0,"n_rows":10,"n_cols":4,"rows_kept":10,"cut":false,"hidden":false,"merged":[[1,2,1,7],[9,3,10,6]]}
[]
[null,null,"NCHRP 08-92 Data Value Assessment"]
[]
[]
[]
[]
[]
[]
[]
[null,null,null,"Self-Assessment Elements"]

{"sheet":"Instructions","index":1,"n_rows":44,"n_cols":13,"rows_kept":44,"cut":false,"hidden":false,"merged":[[1,1,1,18],[3,1,3,18],[24,1,24,18],[25,12,25,13]]}
[]
[null,"Instructions"]
[]
[null,"Overview"]
[null,"This tool allows the agency to self-assess whether and how its data is adding value to a particular business area based on four elements:"]
[]
[null,"Data Importance"]
[null,"Data Availability"]
[null,"Data Quality"]
[null,"Data Usability"]
[]
[null,"The first step is to configure the tool to list particular business activities and data sources related to the agency business area selected.   "]
[null,"For example, the user may provide the following inputs for the Maintenance Management area:"]
[]
[null,"Activities",null,null,null,"Data  Sources"]
[null,"Maintenance Budgeting",null,null,null,"Maintenance work orders, resource utilization, accomplishment"]
[null,"Maintenance Activity Tracking",null,null,null,"Maintenance level of service/maintenance feature quality"]
[null,"Equipment Management",null,null,null,"Fleet/equipment inventory and utilization data"]
[null,"Materials Management",null,null,null,"Materials inventory and utilization data"]
[]
[null,"The tool is then populated according to these activities and data sources, and the user answers questions related to each element specifically for the chosen activities and data sources."]
[]
[null,"Once the user has finished providing input, the data value results are summarized for the assessment elements at the levels of data source, activity, and business unit."]
[]
[null,"Workflow"]
[null,"Throughout this spreadsheet tool, cells that require an input from the user will have the following color:",null,null,null,null,null,null,null,null,null,null,"This is an input"]
[]
[null,"The first tab after the instructions is the Configuration tab, which allows the user to do the following:"]
[]
[null,"Enter the business area to be analyzed.  "]
[null,"Enter the activities to be analyzed within that business area "]
[null,"Enter the data sources to be analyzed within that business area "]
[]
[null,"Once  the user has entered these inputs, the user must press the Apply button to apply the changes to the rest of the spreadsheet."]
[null,"If these inputs are adjusted and the user does not press the Apply button before changing tabs, the user will be prompted to apply the changes."]
[]
[null,"The next tab is the Example Lists tab, where the user can see sample business units and associated activities, as well as sample data types and associated data sources."]
[]
[null,"Next are the four element tabs, where the user provides input for the activities and data sources associated with the business area"]
[null,"The user must answer all input questions on each element tab to complete the assessment."]
[null,"However, users do not have to complete the elements in consecutive order and do not have to finish one entirely before moving on to the next one."]
[null,"The color of the element tab will dynamically adjust from orange to dark green based on the user's progress."]
[]
[null,"Once the user is finished, the Results tab shows the data value results for the assessment elements at the levels of data source, activity, and business area"]

{"sheet":"Configuration","index":2,"n_rows":54,"n_cols":3,"rows_kept":54,"cut":false,"hidden":false,"merged":[]}
[]
[null,"Configuration"]
[]
[]
[]
[]
[null,"Step 1:","Define the business area under consideration"]
[null,null,"Pavement Management"]
[]
[null,"Step 2:","List up to 20 activities related to this business area below (leave unfilled cells blank)"]
[null,"A1","Understanding System Performance"]
[null,"A2","Tracking Accomplishments, Costs and Resource Allocation"]
[null,"A3","Anticipating Future Needs"]
[null,"A4","Performance Diagnostics"]
[null,"A5","Identifying Improvement Actions"]
[null,"A6"]
[null,"A7"]
[null,"A8"]
[null,"A9"]
[null,"A10"]
[null,"A11"]
[null,"A12"]
[null,"A13"]
[null,"A14"]
[null,"A15"]
[null,"A16"]
[null,"A17"]
[null,"A18"]
[null,"A19"]
[null,"A20"]
[]
[null,"Step 3:","List up to 20 data sources that are most important for this collection of activities (leave unfilled cells blank)"]
[null,"S1","Pavement Distress, Rutting and Roughness"]
[null,"S2","Linear Referencing (routes, intersections, mileposts)"]
[null,"S3","Traffic - AADT, Trucks, ESALS"]
[null,"S4","Pavement Structure Characteristics"]
[null,"S5","Road Inventory: # Lanes, Functional Class"]
[null,"S6"]
[null,"S7"]
[null,"S8"]
[null,"S9"]
[null,"S10"]
[null,"S11"]
[null,"S12"]
[null,"S13"]
[null,"S14"]
[null,"S15"]
[null,"S16"]
[null,"S17"]
[null,"S18"]
[null,"S19"]
[null,"S20"]
[]
[null,"Step 4:","Press Apply button"]

{"sheet":"Example Lists","index":3,"n_rows":18,"n_cols":18,"rows_kept":18,"cut":false,"hidden":false,"merged":[[2,1,2,6],[2,8,2,17]]}
[]
[]
[null,"Sample Business Areas and Associated Activities",null,null,null,null,null,null,"Sample Data Types"]
["Select One","Asset Management","Maintenance Management","Project Scoping","Traffic Operations ","Safety Planning","Highway Planning","Select One","Transportation System Characteristics","Socio-Economic and Travel Demand Data","Road Asset Data","Facilities Asset Data","Travel Data","Safety Data","Financial, Program, and Project Data","Maintenance & Operations Data","Environmental Data","Organization and HR Data"]
[null,"Pavement Needs and Risk Assessment","Maintenance Budgeting","Current Conditions Assessment","Incident Management","Network Screening","Current Conditions Assessment",null,"Geospatial Foundation Data - base map, road centerlines, district/region boundaries, jurisdiction boundaries, urban boundaries","Land Use Data","Pavement Data - type, construction/layer history, condition (distress, roughness, rutting, faulting, skid)","Agency-Owned Land/Right of Way Data","Vehicle volumes - counts, classification, factors, AADT, WIM, VMT","Crash Records - Police Accident Reports, Hotspots, etc.","Organizational Budget and Expenditure Data","Maintenance Work Orders, resource utilization, accomplishment","Sensitive Habitats","Organization Chart"]
[null,"Pavement Resource Allocation and Treatment Selection","Maintenance Activity Tracking","Scope Development","Traveler Information","Countermeasure Analysis","Future Demand Analysis",null,"Route designations, lengths, linear referencing system (LRS)","Demographics (Population, Employment, etc.) - current and forecast","Structure & Bridge Data - inventory, condition","Rest Area Inventory & Condition","Bicycle and Pedestrian counts","Fatalities","Revenues/Funding Data - current and projected, total and remaining","Maintenance level of service/maintenance feature quality","Climate Vulnerability Assessments","Position Data"]
[null,"Bridge Needs and Risk Assessment","Equipment Management","Schedule and Budget Development","Signal Timing and Coordination","Countermeasure Design","Alternatives Evaluation",null,"Road classification: functional class, NHS, urban/rural, ownership, etc.",null,"Drainage/Roadside Assets (culverts, pipes, shoulders, vegetation)","Park & Ride Lot Inventory & Condition","Freight Movement Data – commodity flows, supply chain, etc.","Injuries","Annual Capital and Maintenance Outlays","Fleet/Equipment Inventory and Utilization Data","Elevation Data","Employee Data/Personnel Records"]
[null,"Bridge Resource Allocation and Treatment Selection","Materials Management",null,"Active Traffic Management","Countermeasure Evaluation","Strategy Prioritization",null,"Road operational characteristics (mainline/ramp, # lanes, direction, divided/undivided, access control, etc.)",null,"Traffic and Safety Assets (signs, barriers, signals, highway  lighting, pavement markings)","Building Inventory & Condition","Travel Time, Speeds, Bottlenecks, Congestion, Reliability ","Work Zone Safety","Program Data (including TIP/STIP)","Snow Plow Routes","Fish Passage Data"]
[null,"Other Asset Needs Assessment and Budgeting","Winter Maintenance - Snow Route Planning, Snow Plow Tracking",null,"Work Zone Management","Project Prioritization",null,null,"HPMS Data (includes multiple data elements included on this list)",null,"Other Road Assets (retaining walls, noise walls, rock fall protection sites)","Airport Inventory","Travel Patterns (Origin-Destination, Mode Split, etc.) - travel survey, demand model results","Rail Road Crossing Inventory","Program and Project Delivery Data (on-time, on-budget)","Materials Inventory and Utilization Data","Outfalls/Stormwater Inventory Data"]
[null,"Cross-Asset Tradeoffs",null,null,null,null,null,null,"Interchange and intersection characteristics",null,"Imagery/LiDAR Data","Rail Lines, Stations, Yards Inventory",null,"Medical Outcomes - Emergency Medical System data","Project Data - Scoping Documents and Design Plans","Incident Data - type, status, response time","Water Quality Data"]
[null,null,null,null,null,null,null,null,"Bike/Pedestrian Facilities/Accommodations (bike paths, sidewalks, ADA compliance)",null,null,"Ferry Terminal Inventory",null,"Behavioral data - seat belt use, cell phone use, etc.","Environmental Data (project-related)","Road Weather Data","Air Quality Data"]
[null,null,null,null,null,null,null,null,"Transit routes - bus, rail, ferry",null,null,"Intermodal Facilities Inventory",null,"Vehicle Registration Records","ROW Transaction Data","Oversize/Overweight Permitting Data"]
[null,null,null,null,null,null,null,null,null,null,null,null,null,"Driver Licensing Records","Construction Bid Tabs","Outdoor Advertising Data"]
[null,null,null,null,null,null,null,null,null,null,null,null,null,"Citations and Adjudication data","Procurement/Contracts Data","Permits (access, right-of-way, utility, detour, etc.)"]
[null,null,null,null,null,null,null,null,null,null,null,null,null,"Commercial Vehicle Data (credentials, inspection, International Registration Plan-IRP, International Fuel  Tax Agreement - IFTA)","Project Data - Construction Phase scheduling, tracking, testing"]
[null,null,null,null,null,null,null,null,null,null,null,null,null,null,"Project Data - As-Builts"]
["Select One",null,null,null,null,null,null,null,null,null,null,null,null,null,"Vendor/Contractor Data"]
[null,null,null,null,null,null,null,null,null,null,null,null,null,null,"Timesheet and Payroll (agency staff)"]

{"sheet":"Importance","index":4,"n_rows":528,"n_cols":18,"rows_kept":528,"cut":false,"hidden":false,"merged":[[525,1,526,2],[239,1,240,2],[265,1,266,2],[291,1,292,2],[317,1,318,2],[343,1,344,2],[369,1,370,2],[395,1,396,2],[421,1,422,2],[447,1,448,2],[473,1,474,2],[499,1,500,2],[213,1,214,2],[3,1,3,2],[4,1,4,2],[5,1,5,2],[6,1,6,2],[31,1,32,2],[57,1,58,2],[83,1,84,2],[109,1,110,2],[135,1,136,2],[161,1,162,2],[187,1,188,2]]}
[1,null,null,"clearCol","hideCol","calcCol","progressCol","progressCol2","usabilityWeightCol","usabilityWeightCol2","usabilityCol","qualityWeightCol","qualityWeightCol2","quality",null,null,"picklist","weight"]
[null,{"$f":"\"Data Importance Rating: \"&Configuration!C8","v":"Data Importance Rating: Pavement Management"},null,null,null,null,null,{"$f":"COUNTIFS(D10:D528, \"=clearRow\",E10:E528, \"=No\")","v":25},null,null,null,null,null,null,null,null,"Answer"]
[null,"How would you rate the importance of each data set for the following activities?",null,null,null,null,null,{"$f":"COUNT(G10:G528)","v":0},null,null,null,null,null,null,null,null,"High Importance",3]
[null,"High Importance: Essential; can’t perform this activity without it",null,null,null,null,null,{"$f":"H3/H2","v":0},null,null,null,null,null,null,null,null,"Medium Importance",2]
[null,"Medium Importance: Valuable; could do without it, but would impact value or credibility of results",null,null,null,null,null,null,null,null,null,null,null,null,null,null,"Low Importance",1]
[null,"Low Importance: Helpful; but could do without it",null,null,null,null,null,null,null,null,null,null,null,null,null,null,"NA",0]
[null,"NA: Don’t use this data source for this activity",null,null,null,null,"Progress:",{"$f":"IFERROR(H4,0)","v":0}]
[]
["lookupVal"]
["A1",{"$f":"\"Activity: \"& VLOOKUP(A10,Configuration!$B$11:$C$30,2, FALSE)","v":"Activity: Understanding System Performance"},"Importance Rating",null,{"$f":"IF(VLOOKUP(A10,Configuration!$B$11:$C$30,2,FALSE)=0,\"Yes\", \"No\")","v":"No"},null,null,null,{"$f":"SUM(I11:I30)","v":0},null,{"$f":"IF(OR(Progress4<>1, COUNT(G11:G30)<>COUNTIF(E11:E30,\"=No\")),\"\",SUMPRODUCT(J11:J30,Usability!$F$12:$F$31))","v":""},{"$f":"SUM(L11:L30)","v":0},null,{"$f":"IF(OR(Progress3<>1, COUNT(G11:G30)<>COUNTIF(E11:E30,\"=No\")),\"\",SUMPRODUCT(M11:M30,Quality!$H$13:$H$32))","v":""}]
["S1",{"$f":"\"Data: \"& VLOOKUP(A11,Configuration!$B$33:$C$52,2,FALSE)","v":"Data: Pavement Distress, Rutting and Roughness"},"Answer","clearRow",{"$f":"IF(E10=\"Yes\", \"Yes\", IF(VLOOKUP(A11,Configuration!$B$33:$C$52,2,FALSE)=0, \"Yes\", \"No\"))","v":"No"},{"$f":"IF(COUNTIFS($A$11:$A$524,A11,$C$11:$C$524,\"High Importance\")>0,\"High Importance\",IF(COUNTIFS($A$11:$A$524,A11,$C$11:$C$524,\"Medium Importance\")>0,\"Medium Importance\",IF(COUNTIFS($A$11:$A$524,A11,$C$11:$C$524,\"Low Importance\")>0,\"Low Importance\",\"\")))","v":""},{"$f":"IF(C11<>\"Answer\",1,\"\")","v":""},null,{"$f":"IF(VLOOKUP(A11,Usability!$A$12:$C$31,3,FALSE)=\"NA\", 0, IFERROR(VLOOKUP(C11,$Q$3:$R$6, 2, FALSE),\"N/A\"))","v":"N/A"},{"$f":"IFERROR(I11/$I$10,\"N/A\")","v":"N/A"},null,{"$f":"IF(VLOOKUP(A11,Quality!$A$13:$H$32,8,FALSE)=\"NA\", 0, IFERROR(VLOOKUP(C11,$Q$3:$R$6, 2, FALSE),\"N/A\"))","v":"N/A"},{"$f":"IFERROR(L11/$L$10,\"N/A\")","v":"N/A"}]
["S2",{"$f":"\"Data: \"& VLOOKUP(A12,Configuration!$B$33:$C$52,2,FALSE)","v":"Data: Linear Referencing (routes, intersections, mileposts)"},"Answer","clearRow",{"$f":"IF(E11=\"Yes\", \"Yes\", IF(VLOOKUP(A12,Configuration!$B$33:$C$52,2,FALSE)=0, \"Yes\", \"No\"))","v":"No"},"","",null,{"$f":"IF(VLOOKUP(A12,Usability!$A$12:$C$31,3,FALSE)=\"NA\", 0, IFERROR(VLOOKUP(C12,$Q$3:$R$6, 2, FALSE),\"N/A\"))","v":"N/A"},{"$f":"IFERROR(I12/$I$10,\"N/A\")","v":"N/A"},null,{"$f":"IF(VLOOKUP(A12,Quality!$A$13:$H$32,8,FALSE)=\"NA\", 0, IFERROR(VLOOKUP(C12,$Q$3:$R$6, 2, FALSE),\"N/A\"))","v":"N/A"},"N/A"]
["S3",{"$f":"\"Data: \"& VLOOKUP(A13,Configuration!$B$33:$C$52,2,FALSE)","v":"Data: Traffic - AADT, Trucks, ESALS"},"Answer","clearRow",{"$f":"IF(E12=\"Yes\", \"Yes\", IF(VLOOKUP(A13,Configuration!$B$33:$C$52,2,FALSE)=0, \"Yes\", \"No\"))","v":"No"},"","",null,{"$f":"IF(VLOOKUP(A13,Usability!$A$12:$C$31,3,FALSE)=\"NA\", 0, IFERROR(VLOOKUP(C13,$Q$3:$R$6, 2, FALSE),\"N/A\"))","v":"N/A"},"N/A",null,{"$f":"IF(VLOOKUP(A13,Quality!$A$13:$H$32,8,FALSE)=\"NA\", 0, IFERROR(VLOOKUP(C13,$Q$3:$R$6, 2, FALSE),\"N/A\"))","v":"N/A"},"N/A"]
["S4",{"$f":"\"Data: \"& VLOOKUP(A14,Configuration!$B$33:$C$52,2,FALSE)","v":"Data: Pavement Structure Characteristics"},"Answer","clearRow",{"$f":"IF(E13=\"Yes\", \"Yes\", IF(VLOOKUP(A14,Configuration!$B$33:$C$52,2,FALSE)=0, \"Yes\", \"No\"))","v":"No"},"","",null,{"$f":"IF(VLOOKUP(A14,Usability!$A$12:$C$31,3,FALSE)=\"NA\", 0, IFERROR(VLOOKUP(C14,$Q$3:$R$6, 2, FALSE),\"N/A\"))","v":"N/A"},"N/A",null,{"$f":"IF(VLOOKUP(A14,Quality!$A$13:$H$32,8,FALSE)=\"NA\", 0, IFERROR(VLOOKUP(C14,$Q$3:$R$6, 2, FALSE),\"N/A\"))","v":"N/A"},"N/A"]
["S5",{"$f":"\"Data: \"& VLOOKUP(A15,Configuration!$B$33:$C$52,2,FALSE)","v":"Data: Road Inventory: # Lanes, Functional Class"},"Answer","clearRow",{"$f":"IF(E14=\"Yes\", \"Yes\", IF(VLOOKUP(A15,Configuration!$B$33:$C$52,2,FALSE)=0, \"Yes\", \"No\"))","v":"No"},"","",null,{"$f":"IF(VLOOKUP(A15,Usability!$A$12:$C$31,3,FALSE)=\"NA\", 0, IFERROR(VLOOKUP(C15,$Q$3:$R$6, 2, FALSE),\"N/A\"))","v":"N/A"},"N/A",null,{"$f":"IF(VLOOKUP(A15,Quality!$A$13:$H$32,8,FALSE)=\"NA\", 0, IFERROR(VLOOKUP(C15,$Q$3:$R$6, 2, FALSE),\"N/A\"))","v":"N/A"},"N/A"]
["S6",{"$f":"\"Data: \"& VLOOKUP(A16,Configuration!$B$33:$C$52,2,FALSE)","v":"Data: "},"Answer","clearRow",{"$f":"IF(E15=\"Yes\", \"Yes\", IF(VLOOKUP(A16,Configuration!$B$33:$C$52,2,FALSE)=0, \"Yes\", \"No\"))","v":"Yes"},"","",null,{"$f":"IF(VLOOKUP(A16,Usability!$A$12:$C$31,3,FALSE)=\"NA\", 0, IFERROR(VLOOKUP(C16,$Q$3:$R$6, 2, FALSE),\"N/A\"))","v":"N/A"},"N/A",null,{"$f":"IF(VLOOKUP(A16,Quality!$A$13:$H$32,8,FALSE)=\"NA\", 0, IFERROR(VLOOKUP(C16,$Q$3:$R$6, 2, FALSE),\"N/A\"))","v":"N/A"},"N/A"]
["S7",{"$f":"\"Data: \"& VLOOKUP(A17,Configuration!$B$33:$C$52,2,FALSE)","v":"Data: "},"Answer","clearRow",{"$f":"IF(E16=\"Yes\", \"Yes\", IF(VLOOKUP(A17,Configuration!$B$33:$C$52,2,FALSE)=0, \"Yes\", \"No\"))","v":"Yes"},"","",null,{"$f":"IF(VLOOKUP(A17,Usability!$A$12:$C$31,3,FALSE)=\"NA\", 0, IFERROR(VLOOKUP(C17,$Q$3:$R$6, 2, FALSE),\"N/A\"))","v":"N/A"},"N/A",null,{"$f":"IF(VLOOKUP(A17,Quality!$A$13:$H$32,8,FALSE)=\"NA\", 0, IFERROR(VLOOKUP(C17,$Q$3:$R$6, 2, FALSE),\"N/A\"))","v":"N/A"},"N/A"]
["S8",{"$f":"\"Data: \"& VLOOKUP(A18,Configuration!$B$33:$C$52,2,FALSE)","v":"Data: "},"Answer","clearRow",{"$f":"IF(E17=\"Yes\", \"Yes\", IF(VLOOKUP(A18,Configuration!$B$33:$C$52,2,FALSE)=0, \"Yes\", \"No\"))","v":"Yes"},"","",null,{"$f":"IF(VLOOKUP(A18,Usability!$A$12:$C$31,3,FALSE)=\"NA\", 0, IFERROR(VLOOKUP(C18,$Q$3:$R$6, 2, FALSE),\"N/A\"))","v":"N/A"},"N/A",null,{"$f":"IF(VLOOKUP(A18,Quality!$A$13:$H$32,8,FALSE)=\"NA\", 0, IFERROR(VLOOKUP(C18,$Q$3:$R$6, 2, FALSE),\"N/A\"))","v":"N/A"},"N/A"]
["S9",{"$f":"\"Data: \"& VLOOKUP(A19,Configuration!$B$33:$C$52,2,FALSE)","v":"Data: "},"Answer","clearRow",{"$f":"IF(E18=\"Yes\", \"Yes\", IF(VLOOKUP(A19,Configuration!$B$33:$C$52,2,FALSE)=0, \"Yes\", \"No\"))","v":"Yes"},"","",null,{"$f":"IF(VLOOKUP(A19,Usability!$A$12:$C$31,3,FALSE)=\"NA\", 0, IFERROR(VLOOKUP(C19,$Q$3:$R$6, 2, FALSE),\"N/A\"))","v":"N/A"},"N/A",null,{"$f":"IF(VLOOKUP(A19,Quality!$A$13:$H$32,8,FALSE)=\"NA\", 0, IFERROR(VLOOKUP(C19,$Q$3:$R$6, 2, FALSE),\"N/A\"))","v":"N/A"},"N/A"]
["S10",{"$f":"\"Data: \"& VLOOKUP(A20,Configuration!$B$33:$C$52,2,FALSE)","v":"Data: "},"Answer","clearRow",{"$f":"IF(E19=\"Yes\", \"Yes\", IF(VLOOKUP(A20,Configuration!$B$33:$C$52,2,FALSE)=0, \"Yes\", \"No\"))","v":"Yes"},"","",null,{"$f":"IF(VLOOKUP(A20,Usability!$A$12:$C$31,3,FALSE)=\"NA\", 0, IFERROR(VLOOKUP(C20,$Q$3:$R$6, 2, FALSE),\"N/A\"))","v":"N/A"},"N/A",null,{"$f":"IF(VLOOKUP(A20,Quality!$A$13:$H$32,8,FALSE)=\"NA\", 0, IFERROR(VLOOKUP(C20,$Q$3:$R$6, 2, FALSE),\"N/A\"))","v":"N/A"},"N/A"]
["S11",{"$f":"\"Data: \"& VLOOKUP(A21,Configuration!$B$33:$C$52,2,FALSE)","v":"Data: "},"Answer","clearRow",{"$f":"IF(E20=\"Yes\", \"Yes\", IF(VLOOKUP(A21,Configuration!$B$33:$C$52,2,FALSE)=0, \"Yes\", \"No\"))","v":"Yes"},"","",null,{"$f":"IF(VLOOKUP(A21,Usability!$A$12:$C$31,3,FALSE)=\"NA\", 0, IFERROR(VLOOKUP(C21,$Q$3:$R$6, 2, FALSE),\"N/A\"))","v":"N/A"},"N/A",null,{"$f":"IF(VLOOKUP(A21,Quality!$A$13:$H$32,8,FALSE)=\"NA\", 0, IFERROR(VLOOKUP(C21,$Q$3:$R$6, 2, FALSE),\"N/A\"))","v":"N/A"},"N/A"]
["S12",{"$f":"\"Data: \"& VLOOKUP(A22,Configuration!$B$33:$C$52,2,FALSE)","v":"Data: "},"Answer","clearRow",{"$f":"IF(E21=\"Yes\", \"Yes\", IF(VLOOKUP(A22,Configuration!$B$33:$C$52,2,FALSE)=0, \"Yes\", \"No\"))","v":"Yes"},"","",null,{"$f":"IF(VLOOKUP(A22,Usability!$A$12:$C$31,3,FALSE)=\"NA\", 0, IFERROR(VLOOKUP(C22,$Q$3:$R$6, 2, FALSE),\"N/A\"))","v":"N/A"},"N/A",null,{"$f":"IF(VLOOKUP(A22,Quality!$A$13:$H$32,8,FALSE)=\"NA\", 0, IFERROR(VLOOKUP(C22,$Q$3:$R$6, 2, FALSE),\"N/A\"))","v":"N/A"},"N/A"]
["S13",{"$f":"\"Data: \"& VLOOKUP(A23,Configuration!$B$33:$C$52,2,FALSE)","v":"Data: "},"Answer","clearRow",{"$f":"IF(E22=\"Yes\", \"Yes\", IF(VLOOKUP(A23,Configuration!$B$33:$C$52,2,FALSE)=0, \"Yes\", \"No\"))","v":"Yes"},"","",null,{"$f":"IF(VLOOKUP(A23,Usability!$A$12:$C$31,3,FALSE)=\"NA\", 0, IFERROR(VLOOKUP(C23,$Q$3:$R$6, 2, FALSE),\"N/A\"))","v":"N/A"},"N/A",null,{"$f":"IF(VLOOKUP(A23,Quality!$A$13:$H$32,8,FALSE)=\"NA\", 0, IFERROR(VLOOKUP(C23,$Q$3:$R$6, 2, FALSE),\"N/A\"))","v":"N/A"},"N/A"]
["S14",{"$f":"\"Data: \"& VLOOKUP(A24,Configuration!$B$33:$C$52,2,FALSE)","v":"Data: "},"Answer","clearRow",{"$f":"IF(E23=\"Yes\", \"Yes\", IF(VLOOKUP(A24,Configuration!$B$33:$C$52,2,FALSE)=0, \"Yes\", \"No\"))","v":"Yes"},"","",null,{"$f":"IF(VLOOKUP(A24,Usability!$A$12:$C$31,3,FALSE)=\"NA\", 0, IFERROR(VLOOKUP(C24,$Q$3:$R$6, 2, FALSE),\"N/A\"))","v":"N/A"},"N/A",null,{"$f":"IF(VLOOKUP(A24,Quality!$A$13:$H$32,8,FALSE)=\"NA\", 0, IFERROR(VLOOKUP(C24,$Q$3:$R$6, 2, FALSE),\"N/A\"))","v":"N/A"},"N/A"]
["S15",{"$f":"\"Data: \"& VLOOKUP(A25,Configuration!$B$33:$C$52,2,FALSE)","v":"Data: "},"Answer","clearRow",{"$f":"IF(E24=\"Yes\", \"Yes\", IF(VLOOKUP(A25,Configuration!$B$33:$C$52,2,FALSE)=0, \"Yes\", \"No\"))","v":"Yes"},"","",null,{"$f":"IF(VLOOKUP(A25,Usability!$A$12:$C$31,3,FALSE)=\"NA\", 0, IFERROR(VLOOKUP(C25,$Q$3:$R$6, 2, FALSE),\"N/A\"))","v":"N/A"},"N/A",null,{"$f":"IF(VLOOKUP(A25,Quality!$A$13:$H$32,8,FALSE)=\"NA\", 0, IFERROR(VLOOKUP(C25,$Q$3:$R$6, 2, FALSE),\"N/A\"))","v":"N/A"},"N/A"]
["S16",{"$f":"\"Data: \"& VLOOKUP(A26,Configuration!$B$33:$C$52,2,FALSE)","v":"Data: "},"Answer","clearRow",{"$f":"IF(E25=\"Yes\", \"Yes\", IF(VLOOKUP(A26,Configuration!$B$33:$C$52,2,FALSE)=0, \"Yes\", \"No\"))","v":"Yes"},"","",null,{"$f":"IF(VLOOKUP(A26,Usability!$A$12:$C$31,3,FALSE)=\"NA\", 0, IFERROR(VLOOKUP(C26,$Q$3:$R$6, 2, FALSE),\"N/A\"))","v":"N/A"},"N/A",null,{"$f":"IF(VLOOKUP(A26,Quality!$A$13:$H$32,8,FALSE)=\"NA\", 0, IFERROR(VLOOKUP(C26,$Q$3:$R$6, 2, FALSE),\"N/A\"))","v":"N/A"},"N/A"]
["S17",{"$f":"\"Data: \"& VLOOKUP(A27,Configuration!$B$33:$C$52,2,FALSE)","v":"Data: "},"Answer","clearRow",{"$f":"IF(E26=\"Yes\", \"Yes\", IF(VLOOKUP(A27,Configuration!$B$33:$C$52,2,FALSE)=0, \"Yes\", \"No\"))","v":"Yes"},"","",null,{"$f":"IF(VLOOKUP(A27,Usability!$A$12:$C$31,3,FALSE)=\"NA\", 0, IFERROR(VLOOKUP(C27,$Q$3:$R$6, 2, FALSE),\"N/A\"))","v":"N/A"},"N/A",null,{"$f":"IF(VLOOKUP(A27,Quality!$A$13:$H$32,8,FALSE)=\"NA\", 0, IFERROR(VLOOKUP(C27,$Q$3:$R$6, 2, FALSE),\"N/A\"))","v":"N/A"},"N/A"]
["S18",{"$f":"\"Data: \"& VLOOKUP(A28,Configuration!$B$33:$C$52,2,FALSE)","v":"Data: "},"Answer","clearRow",{"$f":"IF(E27=\"Yes\", \"Yes\", IF(VLOOKUP(A28,Configuration!$B$33:$C$52,2,FALSE)=0, \"Yes\", \"No\"))","v":"Yes"},"","",null,{"$f":"IF(VLOOKUP(A28,Usability!$A$12:$C$31,3,FALSE)=\"NA\", 0, IFERROR(VLOOKUP(C28,$Q$3:$R$6, 2, FALSE),\"N/A\"))","v":"N/A"},"N/A",null,{"$f":"IF(VLOOKUP(A28,Quality!$A$13:$H$32,8,FALSE)=\"NA\", 0, IFERROR(VLOOKUP(C28,$Q$3:$R$6, 2, FALSE),\"N/A\"))","v":"N/A"},"N/A"]
["S19",{"$f":"\"Data: \"& VLOOKUP(A29,Configuration!$B$33:$C$52,2,FALSE)","v":"Data: "},"Answer","clearRow",{"$f":"IF(E28=\"Yes\", \"Yes\", IF(VLOOKUP(A29,Configuration!$B$33:$C$52,2,FALSE)=0, \"Yes\", \"No\"))","v":"Yes"},"","",null,{"$f":"IF(VLOOKUP(A29,Usability!$A$12:$C$31,3,FALSE)=\"NA\", 0, IFERROR(VLOOKUP(C29,$Q$3:$R$6, 2, FALSE),\"N/A\"))","v":"N/A"},"N/A",null,{"$f":"IF(VLOOKUP(A29,Quality!$A$13:$H$32,8,FALSE)=\"NA\", 0, IFERROR(VLOOKUP(C29,$Q$3:$R$6, 2, FALSE),\"N/A\"))","v":"N/A"},"N/A"]
["S20",{"$f":"\"Data: \"& VLOOKUP(A30,Configuration!$B$33:$C$52,2,FALSE)","v":"Data: "},"Answer","clearRow",{"$f":"IF(E29=\"Yes\", \"Yes\", IF(VLOOKUP(A30,Configuration!$B$33:$C$52,2,FALSE)=0, \"Yes\", \"No\"))","v":"Yes"},"","",null,{"$f":"IF(VLOOKUP(A30,Usability!$A$12:$C$31,3,FALSE)=\"NA\", 0, IFERROR(VLOOKUP(C30,$Q$3:$R$6, 2, FALSE),\"N/A\"))","v":"N/A"},"N/A",null,{"$f":"IF(VLOOKUP(A30,Quality!$A$13:$H$32,8,FALSE)=\"NA\", 0, IFERROR(VLOOKUP(C30,$Q$3:$R$6, 2, FALSE),\"N/A\"))","v":"N/A"},"N/A"]
[null,null,null,null,{"$f":"IF(E10=\"Yes\", \"Yes\", \"No\")","v":"No"}]
[null,"Comments:",null,null,{"$f":"IF(E10=\"Yes\", \"Yes\", \"No\")","v":"No"}]
[null,null,null,null,{"$f":"IF(E10=\"Yes\", \"Yes\", \"No\")","v":"No"}]
[null,null,null,null,{"$f":"IF(E9=\"Yes\", \"Yes\", \"No\")","v":"No"}]
[null,null,null,null,{"$f":"IF(E10=\"Yes\", \"Yes\", \"No\")","v":"No"}]
["A2",{"$f":"\"Activity: \"& VLOOKUP(A36,Configuration!$B$11:$C$30,2, FALSE)","v":"Activity: Tracking Accomplishments, Costs and Resource Allocation"},"Importance Rating",null,{"$f":"IF(VLOOKUP(A36,Configuration!$B$11:$C$30,2,FALSE)=0,\"Yes\", \"No\")","v":"No"},null,null,null,{"$f":"SUM(I37:I56)","v":0},null,{"$f":"IF(OR(Progress4<>1, COUNT(G37:G56)<>COUNTIF(E37:E56,\"=No\")),\"\",SUMPRODUCT(J37:J56,Usability!$F$12:$F$31))","v":""},{"$f":"SUM(L37:L56)","v":0},null,{"$f":"IF(OR(Progress3<>1, COUNT(G37:G56)<>COUNTIF(E37:E56,\"=No\")),\"\",SUMPRODUCT(M37:M56,Quality!$H$13:$H$32))","v":""}]
["S1",{"$f":"\"Data: \"& VLOOKUP(A37,Configuration!$B$33:$C$52,2,FALSE)","v":"Data: Pavement Distress, Rutting and Roughness"},"Answer","clearRow",{"$f":"IF(E36=\"Yes\", \"Yes\", IF(VLOOKUP(A37,Configuration!$B$33:$C$52,2,FALSE)=0, \"Yes\", \"No\"))","v":"No"},null,{"$f":"IF(C37<>\"Answer\",1,\"\")","v":""},null,{"$f":"IF(VLOOKUP(A37,Usability!$A$12:$C$31,3,FALSE)=\"NA\", 0, IFERROR(VLOOKUP(C37,$Q$3:$R$6, 2, FALSE),\"N/A\"))","v":"N/A"},{"$f":"IFERROR(I37/$I$36,\"N/A\")","v":"N/A"},null,{"$f":"IF(VLOOKUP(A37,Quality!$A$13:$H$32,8,FALSE)=\"NA\", 0, IFERROR(VLOOKUP(C37,$Q$3:$R$6, 2, FALSE),\"N/A\"))","v":"N/A"},{"$f":"IFERROR(L37/$L$36,\"N/A\")","v":"N/A"}]
["S2",{"$f":"\"Data: \"& VLOOKUP(A38,Configuration!$B$33:$C$52,2,FALSE)","v":"Data: Linear Referencing (routes, intersections, mileposts)"},"Answer","clearRow",{"$f":"IF(E37=\"Yes\", \"Yes\", IF(VLOOKUP(A38,Configuration!$B$33:$C$52,2,FALSE)=0, \"Yes\", \"No\"))","v":"No"},null,"",null,{"$f":"IF(VLOOKUP(A38,Usability!$A$12:$C$31,3,FALSE)=\"NA\", 0, IFERROR(VLOOKUP(C38,$Q$3:$R$6, 2, FALSE),\"N/A\"))","v":"N/A"},{"$f":"IFERROR(I38/$I$36,\"N/A\")","v":"N/A"},null,{"$f":"IF(VLOOKUP(A38,Quality!$A$13:$H$32,8,FALSE)=\"NA\", 0, IFERROR(VLOOKUP(C38,$Q$3:$R$6, 2, FALSE),\"N/A\"))","v":"N/A"},"N/A"]
["S3",{"$f":"\"Data: \"& VLOOKUP(A39,Configuration!$B$33:$C$52,2,FALSE)","v":"Data: Traffic - AADT, Trucks, ESALS"},"Answer","clearRow",{"$f":"IF(E38=\"Yes\", \"Yes\", IF(VLOOKUP(A39,Configuration!$B$33:$C$52,2,FALSE)=0, \"Yes\", \"No\"))","v":"No"},null,"",null,{"$f":"IF(VLOOKUP(A39,Usability!$A$12:$C$31,3,FALSE)=\"NA\", 0, IFERROR(VLOOKUP(C39,$Q$3:$R$6, 2, FALSE),\"N/A\"))","v":"N/A"},"N/A",null,{"$f":"IF(VLOOKUP(A39,Quality!$A$13:$H$32,8,FALSE)=\"NA\", 0, IFERROR(VLOOKUP(C39,$Q$3:$R$6, 2, FALSE),\"N/A\"))","v":"N/A"},"N/A"]
["S4",{"$f":"\"Data: \"& VLOOKUP(A40,Configuration!$B$33:$C$52,2,FALSE)","v":"Data: Pavement Structure Characteristics"},"Answer","clearRow",{"$f":"IF(E39=\"Yes\", \"Yes\", IF(VLOOKUP(A40,Configuration!$B$33:$C$52,2,FALSE)=0, \"Yes\", \"No\"))","v":"No"},null,"",null,{"$f":"IF(VLOOKUP(A40,Usability!$A$12:$C$31,3,FALSE)=\"NA\", 0, IFERROR(VLOOKUP(C40,$Q$3:$R$6, 2, FALSE),\"N/A\"))","v":"N/A"},"N/A",null,{"$f":"IF(VLOOKUP(A40,Quality!$A$13:$H$32,8,FALSE)=\"NA\", 0, IFERROR(VLOOKUP(C40,$Q$3:$R$6, 2, FALSE),\"N/A\"))","v":"N/A"},"N/A"]
["S5",{"$f":"\"Data: \"& VLOOKUP(A41,Configuration!$B$33:$C$52,2,FALSE)","v":"Data: Road Inventory: # Lanes, Functional Class"},"Answer","clearRow",{"$f":"IF(E40=\"Yes\", \"Yes\", IF(VLOOKUP(A41,Configuration!$B$33:$C$52,2,FALSE)=0, \"Yes\", \"No\"))","v":"No"},null,"",null,{"$f":"IF(VLOOKUP(A41,Usability!$A$12:$C$31,3,FALSE)=\"NA\", 0, IFERROR(VLOOKUP(C41,$Q$3:$R$6, 2, FALSE),\"N/A\"))","v":"N/A"},"N/A",null,{"$f":"IF(VLOOKUP(A41,Quality!$A$13:$H$32,8,FALSE)=\"NA\", 0, IFERROR(VLOOKUP(C41,$Q$3:$R$6, 2, FALSE),\"N/A\"))","v":"N/A"},"N/A"]
["S6",{"$f":"\"Data: \"& VLOOKUP(A42,Configuration!$B$33:$C$52,2,FALSE)","v":"Data: "},"Answer","clearRow",{"$f":"IF(E41=\"Yes\", \"Yes\", IF(VLOOKUP(A42,Configuration!$B$33:$C$52,2,FALSE)=0, \"Yes\", \"No\"))","v":"Yes"},null,"",null,{"$f":"IF(VLOOKUP(A42,Usability!$A$12:$C$31,3,FALSE)=\"NA\", 0, IFERROR(VLOOKUP(C42,$Q$3:$R$6, 2, FALSE),\"N/A\"))","v":"N/A"},"N/A",null,{"$f":"IF(VLOOKUP(A42,Quality!$A$13:$H$32,8,FALSE)=\"NA\", 0, IFERROR(VLOOKUP(C42,$Q$3:$R$6, 2, FALSE),\"N/A\"))","v":"N/A"},"N/A"]
["S7",{"$f":"\"Data: \"& VLOOKUP(A43,Configuration!$B$33:$C$52,2,FALSE)","v":"Data: "},"Answer","clearRow",{"$f":"IF(E42=\"Yes\", \"Yes\", IF(VLOOKUP(A43,Configuration!$B$33:$C$52,2,FALSE)=0, \"Yes\", \"No\"))","v":"Yes"},null,"",null,{"$f":"IF(VLOOKUP(A43,Usability!$A$12:$C$31,3,FALSE)=\"NA\", 0, IFERROR(VLOOKUP(C43,$Q$3:$R$6, 2, FALSE),\"N/A\"))","v":"N/A"},"N/A",null,{"$f":"IF(VLOOKUP(A43,Quality!$A$13:$H$32,8,FALSE)=\"NA\", 0, IFERROR(VLOOKUP(C43,$Q$3:$R$6, 2, FALSE),\"N/A\"))","v":"N/A"},"N/A"]
["S8",{"$f":"\"Data: \"& VLOOKUP(A44,Configuration!$B$33:$C$52,2,FALSE)","v":"Data: "},"Answer","clearRow",{"$f":"IF(E43=\"Yes\", \"Yes\", IF(VLOOKUP(A44,Configuration!$B$33:$C$52,2,FALSE)=0, \"Yes\", \"No\"))","v":"Yes"},null,"",null,{"$f":"IF(VLOOKUP(A44,Usability!$A$12:$C$31,3,FALSE)=\"NA\", 0, IFERROR(VLOOKUP(C44,$Q$3:$R$6, 2, FALSE),\"N/A\"))","v":"N/A"},"N/A",null,{"$f":"IF(VLOOKUP(A44,Quality!$A$13:$H$32,8,FALSE)=\"NA\", 0, IFERROR(VLOOKUP(C44,$Q$3:$R$6, 2, FALSE),\"N/A\"))","v":"N/A"},"N/A"]
["S9",{"$f":"\"Data: \"& VLOOKUP(A45,Configuration!$B$33:$C$52,2,FALSE)","v":"Data: "},"Answer","clearRow",{"$f":"IF(E44=\"Yes\", \"Yes\", IF(VLOOKUP(A45,Configuration!$B$33:$C$52,2,FALSE)=0, \"Yes\", \"No\"))","v":"Yes"},null,"",null,{"$f":"IF(VLOOKUP(A45,Usability!$A$12:$C$31,3,FALSE)=\"NA\", 0, IFERROR(VLOOKUP(C45,$Q$3:$R$6, 2, FALSE),\"N/A\"))","v":"N/A"},"N/A",null,{"$f":"IF(VLOOKUP(A45,Quality!$A$13:$H$32,8,FALSE)=\"NA\", 0, IFERROR(VLOOKUP(C45,$Q$3:$R$6, 2, FALSE),\"N/A\"))","v":"N/A"},"N/A"]
["S10",{"$f":"\"Data: \"& VLOOKUP(A46,Configuration!$B$33:$C$52,2,FALSE)","v":"Data: "},"Answer","clearRow",{"$f":"IF(E45=\"Yes\", \"Yes\", IF(VLOOKUP(A46,Configuration!$B$33:$C$52,2,FALSE)=0, \"Yes\", \"No\"))","v":"Yes"},null,"",null,{"$f":"IF(VLOOKUP(A46,Usability!$A$12:$C$31,3,FALSE)=\"NA\", 0, IFERROR(VLOOKUP(C46,$Q$3:$R$6, 2, FALSE),\"N/A\"))","v":"N/A"},"N/A",null,{"$f":"IF(VLOOKUP(A46,Quality!$A$13:$H$32,8,FALSE)=\"NA\", 0, IFERROR(VLOOKUP(C46,$Q$3:$R$6, 2, FALSE),\"N/A\"))","v":"N/A"},"N/A"]
["S11",{"$f":"\"Data: \"& VLOOKUP(A47,Configuration!$B$33:$C$52,2,FALSE)","v":"Data: "},"Answer","clearRow",{"$f":"IF(E46=\"Yes\", \"Yes\", IF(VLOOKUP(A47,Configuration!$B$33:$C$52,2,FALSE)=0, \"Yes\", \"No\"))","v":"Yes"},null,"",null,{"$f":"IF(VLOOKUP(A47,Usability!$A$12:$C$31,3,FALSE)=\"NA\", 0, IFERROR(VLOOKUP(C47,$Q$3:$R$6, 2, FALSE),\"N/A\"))","v":"N/A"},"N/A",null,{"$f":"IF(VLOOKUP(A47,Quality!$A$13:$H$32,8,FALSE)=\"NA\", 0, IFERROR(VLOOKUP(C47,$Q$3:$R$6, 2, FALSE),\"N/A\"))","v":"N/A"},"N/A"]
["S12",{"$f":"\"Data: \"& VLOOKUP(A48,Configuration!$B$33:$C$52,2,FALSE)","v":"Data: "},"Answer","clearRow",{"$f":"IF(E47=\"Yes\", \"Yes\", IF(VLOOKUP(A48,Configuration!$B$33:$C$52,2,FALSE)=0, \"Yes\", \"No\"))","v":"Yes"},null,"",null,{"$f":"IF(VLOOKUP(A48,Usability!$A$12:$C$31,3,FALSE)=\"NA\", 0, IFERROR(VLOOKUP(C48,$Q$3:$R$6, 2, FALSE),\"N/A\"))","v":"N/A"},"N/A",null,{"$f":"IF(VLOOKUP(A48,Quality!$A$13:$H$32,8,FALSE)=\"NA\", 0, IFERROR(VLOOKUP(C48,$Q$3:$R$6, 2, FALSE),\"N/A\"))","v":"N/A"},"N/A"]
["S13",{"$f":"\"Data: \"& VLOOKUP(A49,Configuration!$B$33:$C$52,2,FALSE)","v":"Data: "},"Answer","clearRow",{"$f":"IF(E48=\"Yes\", \"Yes\", IF(VLOOKUP(A49,Configuration!$B$33:$C$52,2,FALSE)=0, \"Yes\", \"No\"))","v":"Yes"},null,"",null,{"$f":"IF(VLOOKUP(A49,Usability!$A$12:$C$31,3,FALSE)=\"NA\", 0, IFERROR(VLOOKUP(C49,$Q$3:$R$6, 2, FALSE),\"N/A\"))","v":"N/A"},"N/A",null,{"$f":"IF(VLOOKUP(A49,Quality!$A$13:$H$32,8,FALSE)=\"NA\", 0, IFERROR(VLOOKUP(C49,$Q$3:$R$6, 2, FALSE),\"N/A\"))","v":"N/A"},"N/A"]
["S14",{"$f":"\"Data: \"& VLOOKUP(A50,Configuration!$B$33:$C$52,2,FALSE)","v":"Data: "},"Answer","clearRow",{"$f":"IF(E49=\"Yes\", \"Yes\", IF(VLOOKUP(A50,Configuration!$B$33:$C$52,2,FALSE)=0, \"Yes\", \"No\"))","v":"Yes"},null,"",null,{"$f":"IF(VLOOKUP(A50,Usability!$A$12:$C$31,3,FALSE)=\"NA\", 0, IFERROR(VLOOKUP(C50,$Q$3:$R$6, 2, FALSE),\"N/A\"))","v":"N/A"},"N/A",null,{"$f":"IF(VLOOKUP(A50,Quality!$A$13:$H$32,8,FALSE)=\"NA\", 0, IFERROR(VLOOKUP(C50,$Q$3:$R$6, 2, FALSE),\"N/A\"))","v":"N/A"},"N/A"]
["S15",{"$f":"\"Data: \"& VLOOKUP(A51,Configuration!$B$33:$C$52,2,FALSE)","v":"Data: "},"Answer","clearRow",{"$f":"IF(E50=\"Yes\", \"Yes\", IF(VLOOKUP(A51,Configuration!$B$33:$C$52,2,FALSE)=0, \"Yes\", \"No\"))","v":"Yes"},null,"",null,{"$f":"IF(VLOOKUP(A51,Usability!$A$12:$C$31,3,FALSE)=\"NA\", 0, IFERROR(VLOOKUP(C51,$Q$3:$R$6, 2, FALSE),\"N/A\"))","v":"N/A"},"N/A",null,{"$f":"IF(VLOOKUP(A51,Quality!$A$13:$H$32,8,FALSE)=\"NA\", 0, IFERROR(VLOOKUP(C51,$Q$3:$R$6, 2, FALSE),\"N/A\"))","v":"N/A"},"N/A"]
["S16",{"$f":"\"Data: \"& VLOOKUP(A52,Configuration!$B$33:$C$52,2,FALSE)","v":"Data: "},"Answer","clearRow",{"$f":"IF(E51=\"Yes\", \"Yes\", IF(VLOOKUP(A52,Configuration!$B$33:$C$52,2,FALSE)=0, \"Yes\", \"No\"))","v":"Yes"},null,"",null,{"$f":"IF(VLOOKUP(A52,Usability!$A$12:$C$31,3,FALSE)=\"NA\", 0, IFERROR(VLOOKUP(C52,$Q$3:$R$6, 2, FALSE),\"N/A\"))","v":"N/A"},"N/A",null,{"$f":"IF(VLOOKUP(A52,Quality!$A$13:$H$32,8,FALSE)=\"NA\", 0, IFERROR(VLOOKUP(C52,$Q$3:$R$6, 2, FALSE),\"N/A\"))","v":"N/A"},"N/A"]
["S17",{"$f":"\"Data: \"& VLOOKUP(A53,Configuration!$B$33:$C$52,2,FALSE)","v":"Data: "},"Answer","clearRow",{"$f":"IF(E52=\"Yes\", \"Yes\", IF(VLOOKUP(A53,Configuration!$B$33:$C$52,2,FALSE)=0, \"Yes\", \"No\"))","v":"Yes"},null,"",null,{"$f":"IF(VLOOKUP(A53,Usability!$A$12:$C$31,3,FALSE)=\"NA\", 0, IFERROR(VLOOKUP(C53,$Q$3:$R$6, 2, FALSE),\"N/A\"))","v":"N/A"},"N/A",null,{"$f":"IF(VLOOKUP(A53,Quality!$A$13:$H$32,8,FALSE)=\"NA\", 0, IFERROR(VLOOKUP(C53,$Q$3:$R$6, 2, FALSE),\"N/A\"))","v":"N/A"},"N/A"]
["S18",{"$f":"\"Data: \"& VLOOKUP(A54,Configuration!$B$33:$C$52,2,FALSE)","v":"Data: "},"Answer","clearRow",{"$f":"IF(E53=\"Yes\", \"Yes\", IF(VLOOKUP(A54,Configuration!$B$33:$C$52,2,FALSE)=0, \"Yes\", \"No\"))","v":"Yes"},null,"",null,{"$f":"IF(VLOOKUP(A54,Usability!$A$12:$C$31,3,FALSE)=\"NA\", 0, IFERROR(VLOOKUP(C54,$Q$3:$R$6, 2, FALSE),\"N/A\"))","v":"N/A"},"N/A",null,{"$f":"IF(VLOOKUP(A54,Quality!$A$13:$H$32,8,FALSE)=\"NA\", 0, IFERROR(VLOOKUP(C54,$Q$3:$R$6, 2, FALSE),\"N/A\"))","v":"N/A"},"N/A"]
["S19",{"$f":"\"Data: \"& VLOOKUP(A55,Configuration!$B$33:$C$52,2,FALSE)","v":"Data: "},"Answer","clearRow",{"$f":"IF(E54=\"Yes\", \"Yes\", IF(VLOOKUP(A55,Configuration!$B$33:$C$52,2,FALSE)=0, \"Yes\", \"No\"))","v":"Yes"},null,"",null,{"$f":"IF(VLOOKUP(A55,Usability!$A$12:$C$31,3,FALSE)=\"NA\", 0, IFERROR(VLOOKUP(C55,$Q$3:$R$6, 2, FALSE),\"N/A\"))","v":"N/A"},"N/A",null,{"$f":"IF(VLOOKUP(A55,Quality!$A$13:$H$32,8,FALSE)=\"NA\", 0, IFERROR(VLOOKUP(C55,$Q$3:$R$6, 2, FALSE),\"N/A\"))","v":"N/A"},"N/A"]
["S20",{"$f":"\"Data: \"& VLOOKUP(A56,Configuration!$B$33:$C$52,2,FALSE)","v":"Data: "},"Answer","clearRow",{"$f":"IF(E55=\"Yes\", \"Yes\", IF(VLOOKUP(A56,Configuration!$B$33:$C$52,2,FALSE)=0, \"Yes\", \"No\"))","v":"Yes"},null,"",null,{"$f":"IF(VLOOKUP(A56,Usability!$A$12:$C$31,3,FALSE)=\"NA\", 0, IFERROR(VLOOKUP(C56,$Q$3:$R$6, 2, FALSE),\"N/A\"))","v":"N/A"},"N/A",null,{"$f":"IF(VLOOKUP(A56,Quality!$A$13:$H$32,8,FALSE)=\"NA\", 0, IFERROR(VLOOKUP(C56,$Q$3:$R$6, 2, FALSE),\"N/A\"))","v":"N/A"},"N/A"]
[null,null,null,null,{"$f":"IF(E36=\"Yes\", \"Yes\", \"No\")","v":"No"}]
[null,"Comments:",null,null,{"$f":"IF(E36=\"Yes\", \"Yes\", \"No\")","v":"No"}]
[null,null,null,null,{"$f":"IF(E36=\"Yes\", \"Yes\", \"No\")","v":"No"}]
[null,null,null,null,{"$f":"IF(E35=\"Yes\", \"Yes\", \"No\")","v":"No"}]
[null,null,null,null,{"$f":"IF(E36=\"Yes\", \"Yes\", \"No\")","v":"No"}]
["A3",{"$f":"\"Activity: \"& VLOOKUP(A62,Configuration!$B$11:$C$30,2, FALSE)","v":"Activity: Anticipating Future Needs"},"Importance Rating",null,{"$f":"IF(VLOOKUP(A62,Configuration!$B$11:$C$30,2,FALSE)=0,\"Yes\", \"No\")","v":"No"},null,null,null,{"$f":"SUM(I63:I82)","v":0},null,{"$f":"IF(OR(Progress4<>1, COUNT(G63:G82)<>COUNTIF(E63:E82,\"=No\")),\"\",SUMPRODUCT(J63:J82,Usability!$F$12:$F$31))","v":""},{"$f":"SUM(L63:L82)","v":0},null,{"$f":"IF(OR(Progress3<>1, COUNT(G63:G82)<>COUNTIF(E63:E82,\"=No\")),\"\",SUMPRODUCT(M63:M82,Quality!$H$13:$H$32))","v":""}]
["S1",{"$f":"\"Data: \"& VLOOKUP(A63,Configuration!$B$33:$C$52,2,FALSE)","v":"Data: Pavement Distress, Rutting and Roughness"},"Answer","clearRow",{"$f":"IF(E62=\"Yes\", \"Yes\", IF(VLOOKUP(A63,Configuration!$B$33:$C$52,2,FALSE)=0, \"Yes\", \"No\"))","v":"No"},null,{"$f":"IF(C63<>\"Answer\",1,\"\")","v":""},null,{"$f":"IF(VLOOKUP(A63,Usability!$A$12:$C$31,3,FALSE)=\"NA\", 0, IFERROR(VLOOKUP(C63,$Q$3:$R$6, 2, FALSE),\"N/A\"))","v":"N/A"},{"$f":"IFERROR(I63/$I$62,\"N/A\")","v":"N/A"},null,{"$f":"IF(VLOOKUP(A63,Quality!$A$13:$H$32,8,FALSE)=\"NA\", 0, IFERROR(VLOOKUP(C63,$Q$3:$R$6, 2, FALSE),\"N/A\"))","v":"N/A"},{"$f":"IFERROR(L63/$L$62,\"N/A\")","v":"N/A"}]
["S2",{"$f":"\"Data: \"& VLOOKUP(A64,Configuration!$B$33:$C$52,2,FALSE)","v":"Data: Linear Referencing (routes, intersections, mileposts)"},"Answer","clearRow",{"$f":"IF(E63=\"Yes\", \"Yes\", IF(VLOOKUP(A64,Configuration!$B$33:$C$52,2,FALSE)=0, \"Yes\", \"No\"))","v":"No"},null,"",null,{"$f":"IF(VLOOKUP(A64,Usability!$A$12:$C$31,3,FALSE)=\"NA\", 0, IFERROR(VLOOKUP(C64,$Q$3:$R$6, 2, FALSE),\"N/A\"))","v":"N/A"},{"$f":"IFERROR(I64/$I$62,\"N/A\")","v":"N/A"},null,{"$f":"IF(VLOOKUP(A64,Quality!$A$13:$H$32,8,FALSE)=\"NA\", 0, IFERROR(VLOOKUP(C64,$Q$3:$R$6, 2, FALSE),\"N/A\"))","v":"N/A"},"N/A"]
["S3",{"$f":"\"Data: \"& VLOOKUP(A65,Configuration!$B$33:$C$52,2,FALSE)","v":"Data: Traffic - AADT, Trucks, ESALS"},"Answer","clearRow",{"$f":"IF(E64=\"Yes\", \"Yes\", IF(VLOOKUP(A65,Configuration!$B$33:$C$52,2,FALSE)=0, \"Yes\", \"No\"))","v":"No"},null,"",null,{"$f":"IF(VLOOKUP(A65,Usability!$A$12:$C$31,3,FALSE)=\"NA\", 0, IFERROR(VLOOKUP(C65,$Q$3:$R$6, 2, FALSE),\"N/A\"))","v":"N/A"},"N/A",null,{"$f":"IF(VLOOKUP(A65,Quality!$A$13:$H$32,8,FALSE)=\"NA\", 0, IFERROR(VLOOKUP(C65,$Q$3:$R$6, 2, FALSE),\"N/A\"))","v":"N/A"},"N/A"]
["S4",{"$f":"\"Data: \"& VLOOKUP(A66,Configuration!$B$33:$C$52,2,FALSE)","v":"Data: Pavement Structure Characteristics"},"Answer","clearRow",{"$f":"IF(E65=\"Yes\", \"Yes\", IF(VLOOKUP(A66,Configuration!$B$33:$C$52,2,FALSE)=0, \"Yes\", \"No\"))","v":"No"},null,"",null,{"$f":"IF(VLOOKUP(A66,Usability!$A$12:$C$31,3,FALSE)=\"NA\", 0, IFERROR(VLOOKUP(C66,$Q$3:$R$6, 2, FALSE),\"N/A\"))","v":"N/A"},"N/A",null,{"$f":"IF(VLOOKUP(A66,Quality!$A$13:$H$32,8,FALSE)=\"NA\", 0, IFERROR(VLOOKUP(C66,$Q$3:$R$6, 2, FALSE),\"N/A\"))","v":"N/A"},"N/A"]
["S5",{"$f":"\"Data: \"& VLOOKUP(A67,Configuration!$B$33:$C$52,2,FALSE)","v":"Data: Road Inventory: # Lanes, Functional Class"},"Answer","clearRow",{"$f":"IF(E66=\"Yes\", \"Yes\", IF(VLOOKUP(A67,Configuration!$B$33:$C$52,2,FALSE)=0, \"Yes\", \"No\"))","v":"No"},null,"",null,{"$f":"IF(VLOOKUP(A67,Usability!$A$12:$C$31,3,FALSE)=\"NA\", 0, IFERROR(VLOOKUP(C67,$Q$3:$R$6, 2, FALSE),\"N/A\"))","v":"N/A"},"N/A",null,{"$f":"IF(VLOOKUP(A67,Quality!$A$13:$H$32,8,FALSE)=\"NA\", 0, IFERROR(VLOOKUP(C67,$Q$3:$R$6, 2, FALSE),\"N/A\"))","v":"N/A"},"N/A"]
["S6",{"$f":"\"Data: \"& VLOOKUP(A68,Configuration!$B$33:$C$52,2,FALSE)","v":"Data: "},"Answer","clearRow",{"$f":"IF(E67=\"Yes\", \"Yes\", IF(VLOOKUP(A68,Configuration!$B$33:$C$52,2,FALSE)=0, \"Yes\", \"No\"))","v":"Yes"},null,"",null,{"$f":"IF(VLOOKUP(A68,Usability!$A$12:$C$31,3,FALSE)=\"NA\", 0, IFERROR(VLOOKUP(C68,$Q$3:$R$6, 2, FALSE),\"N/A\"))","v":"N/A"},"N/A",null,{"$f":"IF(VLOOKUP(A68,Quality!$A$13:$H$32,8,FALSE)=\"NA\", 0, IFERROR(VLOOKUP(C68,$Q$3:$R$6, 2, FALSE),\"N/A\"))","v":"N/A"},"N/A"]
["S7",{"$f":"\"Data: \"& VLOOKUP(A69,Configuration!$B$33:$C$52,2,FALSE)","v":"Data: "},"Answer","clearRow",{"$f":"IF(E68=\"Yes\", \"Yes\", IF(VLOOKUP(A69,Configuration!$B$33:$C$52,2,FALSE)=0, \"Yes\", \"No\"))","v":"Yes"},null,"",null,{"$f":"IF(VLOOKUP(A69,Usability!$A$12:$C$31,3,FALSE)=\"NA\", 0, IFERROR(VLOOKUP(C69,$Q$3:$R$6, 2, FALSE),\"N/A\"))","v":"N/A"},"N/A",null,{"$f":"IF(VLOOKUP(A69,Quality!$A$13:$H$32,8,FALSE)=\"NA\", 0, IFERROR(VLOOKUP(C69,$Q$3:$R$6, 2, FALSE),\"N/A\"))","v":"N/A"},"N/A"]
["S8",{"$f":"\"Data: \"& VLOOKUP(A70,Configuration!$B$33:$C$52,2,FALSE)","v":"Data: "},"Answer","clearRow",{"$f":"IF(E69=\"Yes\", \"Yes\", IF(VLOOKUP(A70,Configuration!$B$33:$C$52,2,FALSE)=0, \"Yes\", \"No\"))","v":"Yes"},null,"",null,{"$f":"IF(VLOOKUP(A70,Usability!$A$12:$C$31,3,FALSE)=\"NA\", 0, IFERROR(VLOOKUP(C70,$Q$3:$R$6, 2, FALSE),\"N/A\"))","v":"N/A"},"N/A",null,{"$f":"IF(VLOOKUP(A70,Quality!$A$13:$H$32,8,FALSE)=\"NA\", 0, IFERROR(VLOOKUP(C70,$Q$3:$R$6, 2, FALSE),\"N/A\"))","v":"N/A"},"N/A"]
["S9",{"$f":"\"Data: \"& VLOOKUP(A71,Configuration!$B$33:$C$52,2,FALSE)","v":"Data: "},"Answer","clearRow",{"$f":"IF(E70=\"Yes\", \"Yes\", IF(VLOOKUP(A71,Configuration!$B$33:$C$52,2,FALSE)=0, \"Yes\", \"No\"))","v":"Yes"},null,"",null,{"$f":"IF(VLOOKUP(A71,Usability!$A$12:$C$31,3,FALSE)=\"NA\", 0, IFERROR(VLOOKUP(C71,$Q$3:$R$6, 2, FALSE),\"N/A\"))","v":"N/A"},"N/A",null,{"$f":"IF(VLOOKUP(A71,Quality!$A$13:$H$32,8,FALSE)=\"NA\", 0, IFERROR(VLOOKUP(C71,$Q$3:$R$6, 2, FALSE),\"N/A\"))","v":"N/A"},"N/A"]
["S10",{"$f":"\"Data: \"& VLOOKUP(A72,Configuration!$B$33:$C$52,2,FALSE)","v":"Data: "},"Answer","clearRow",{"$f":"IF(E71=\"Yes\", \"Yes\", IF(VLOOKUP(A72,Configuration!$B$33:$C$52,2,FALSE)=0, \"Yes\", \"No\"))","v":"Yes"},null,"",null,{"$f":"IF(VLOOKUP(A72,Usability!$A$12:$C$31,3,FALSE)=\"NA\", 0, IFERROR(VLOOKUP(C72,$Q$3:$R$6, 2, FALSE),\"N/A\"))","v":"N/A"},"N/A",null,{"$f":"IF(VLOOKUP(A72,Quality!$A$13:$H$32,8,FALSE)=\"NA\", 0, IFERROR(VLOOKUP(C72,$Q$3:$R$6, 2, FALSE),\"N/A\"))","v":"N/A"},"N/A"]
["S11",{"$f":"\"Data: \"& VLOOKUP(A73,Configuration!$B$33:$C$52,2,FALSE)","v":"Data: "},"Answer","clearRow",{"$f":"IF(E72=\"Yes\", \"Yes\", IF(VLOOKUP(A73,Configuration!$B$33:$C$52,2,FALSE)=0, \"Yes\", \"No\"))","v":"Yes"},null,"",null,{"$f":"IF(VLOOKUP(A73,Usability!$A$12:$C$31,3,FALSE)=\"NA\", 0, IFERROR(VLOOKUP(C73,$Q$3:$R$6, 2, FALSE),\"N/A\"))","v":"N/A"},"N/A",null,{"$f":"IF(VLOOKUP(A73,Quality!$A$13:$H$32,8,FALSE)=\"NA\", 0, IFERROR(VLOOKUP(C73,$Q$3:$R$6, 2, FALSE),\"N/A\"))","v":"N/A"},"N/A"]
["S12",{"$f":"\"Data: \"& VLOOKUP(A74,Configuration!$B$33:$C$52,2,FALSE)","v":"Data: "},"Answer","clearRow",{"$f":"IF(E73=\"Yes\", \"Yes\", IF(VLOOKUP(A74,Configuration!$B$33:$C$52,2,FALSE)=0, \"Yes\", \"No\"))","v":"Yes"},null,"",null,{"$f":"IF(VLOOKUP(A74,Usability!$A$12:$C$31,3,FALSE)=\"NA\", 0, IFERROR(VLOOKUP(C74,$Q$3:$R$6, 2, FALSE),\"N/A\"))","v":"N/A"},"N/A",null,{"$f":"IF(VLOOKUP(A74,Quality!$A$13:$H$32,8,FALSE)=\"NA\", 0, IFERROR(VLOOKUP(C74,$Q$3:$R$6, 2, FALSE),\"N/A\"))","v":"N/A"},"N/A"]
["S13",{"$f":"\"Data: \"& VLOOKUP(A75,Configuration!$B$33:$C$52,2,FALSE)","v":"Data: "},"Answer","clearRow",{"$f":"IF(E74=\"Yes\", \"Yes\", IF(VLOOKUP(A75,Configuration!$B$33:$C$52,2,FALSE)=0, \"Yes\", \"No\"))","v":"Yes"},null,"",null,{"$f":"IF(VLOOKUP(A75,Usability!$A$12:$C$31,3,FALSE)=\"NA\", 0, IFERROR(VLOOKUP(C75,$Q$3:$R$6, 2, FALSE),\"N/A\"))","v":"N/A"},"N/A",null,{"$f":"IF(VLOOKUP(A75,Quality!$A$13:$H$32,8,FALSE)=\"NA\", 0, IFERROR(VLOOKUP(C75,$Q$3:$R$6, 2, FALSE),\"N/A\"))","v":"N/A"},"N/A"]
["S14",{"$f":"\"Data: \"& VLOOKUP(A76,Configuration!$B$33:$C$52,2,FALSE)","v":"Data: "},"Answer","clearRow",{"$f":"IF(E75=\"Yes\", \"Yes\", IF(VLOOKUP(A76,Configuration!$B$33:$C$52,2,FALSE)=0, \"Yes\", \"No\"))","v":"Yes"},null,"",null,{"$f":"IF(VLOOKUP(A76,Usability!$A$12:$C$31,3,FALSE)=\"NA\", 0, IFERROR(VLOOKUP(C76,$Q$3:$R$6, 2, FALSE),\"N/A\"))","v":"N/A"},"N/A",null,{"$f":"IF(VLOOKUP(A76,Quality!$A$13:$H$32,8,FALSE)=\"NA\", 0, IFERROR(VLOOKUP(C76,$Q$3:$R$6, 2, FALSE),\"N/A\"))","v":"N/A"},"N/A"]
["S15",{"$f":"\"Data: \"& VLOOKUP(A77,Configuration!$B$33:$C$52,2,FALSE)","v":"Data: "},"Answer","clearRow",{"$f":"IF(E76=\"Yes\", \"Yes\", IF(VLOOKUP(A77,Configuration!$B$33:$C$52,2,FALSE)=0, \"Yes\", \"No\"))","v":"Yes"},null,"",null,{"$f":"IF(VLOOKUP(A77,Usability!$A$12:$C$31,3,FALSE)=\"NA\", 0, IFERROR(VLOOKUP(C77,$Q$3:$R$6, 2, FALSE),\"N/A\"))","v":"N/A"},"N/A",null,{"$f":"IF(VLOOKUP(A77,Quality!$A$13:$H$32,8,FALSE)=\"NA\", 0, IFERROR(VLOOKUP(C77,$Q$3:$R$6, 2, FALSE),\"N/A\"))","v":"N/A"},"N/A"]
["S16",{"$f":"\"Data: \"& VLOOKUP(A78,Configuration!$B$33:$C$52,2,FALSE)","v":"Data: "},"Answer","clearRow",{"$f":"IF(E77=\"Yes\", \"Yes\", IF(VLOOKUP(A78,Configuration!$B$33:$C$52,2,FALSE)=0, \"Yes\", \"No\"))","v":"Yes"},null,"",null,{"$f":"IF(VLOOKUP(A78,Usability!$A$12:$C$31,3,FALSE)=\"NA\", 0, IFERROR(VLOOKUP(C78,$Q$3:$R$6, 2, FALSE),\"N/A\"))","v":"N/A"},"N/A",null,{"$f":"IF(VLOOKUP(A78,Quality!$A$13:$H$32,8,FALSE)=\"NA\", 0, IFERROR(VLOOKUP(C78,$Q$3:$R$6, 2, FALSE),\"N/A\"))","v":"N/A"},"N/A"]
["S17",{"$f":"\"Data: \"& VLOOKUP(A79,Configuration!$B$33:$C$52,2,FALSE)","v":"Data: "},"Answer","clearRow",{"$f":"IF(E78=\"Yes\", \"Yes\", IF(VLOOKUP(A79,Configuration!$B$33:$C$52,2,FALSE)=0, \"Yes\", \"No\"))","v":"Yes"},null,"",null,{"$f":"IF(VLOOKUP(A79,Usability!$A$12:$C$31,3,FALSE)=\"NA\", 0, IFERROR(VLOOKUP(C79,$Q$3:$R$6, 2, FALSE),\"N/A\"))","v":"N/A"},"N/A",null,{"$f":"IF(VLOOKUP(A79,Quality!$A$13:$H$32,8,FALSE)=\"NA\", 0, IFERROR(VLOOKUP(C79,$Q$3:$R$6, 2, FALSE),\"N/A\"))","v":"N/A"},"N/A"]
["S18",{"$f":"\"Data: \"& VLOOKUP(A80,Configuration!$B$33:$C$52,2,FALSE)","v":"Data: "},"Answer","clearRow",{"$f":"IF(E79=\"Yes\", \"Yes\", IF(VLOOKUP(A80,Configuration!$B$33:$C$52,2,FALSE)=0, \"Yes\", \"No\"))","v":"Yes"},null,"",null,{"$f":"IF(VLOOKUP(A80,Usability!$A$12:$C$31,3,FALSE)=\"NA\", 0, IFERROR(VLOOKUP(C80,$Q$3:$R$6, 2, FALSE),\"N/A\"))","v":"N/A"},"N/A",null,{"$f":"IF(VLOOKUP(A80,Quality!$A$13:$H$32,8,FALSE)=\"NA\", 0, IFERROR(VLOOKUP(C80,$Q$3:$R$6, 2, FALSE),\"N/A\"))","v":"N/A"},"N/A"]
["S19",{"$f":"\"Data: \"& VLOOKUP(A81,Configuration!$B$33:$C$52,2,FALSE)","v":"Data: "},"Answer","clearRow",{"$f":"IF(E80=\"Yes\", \"Yes\", IF(VLOOKUP(A81,Configuration!$B$33:$C$52,2,FALSE)=0, \"Yes\", \"No\"))","v":"Yes"},null,"",null,{"$f":"IF(VLOOKUP(A81,Usability!$A$12:$C$31,3,FALSE)=\"NA\", 0, IFERROR(VLOOKUP(C81,$Q$3:$R$6, 2, FALSE),\"N/A\"))","v":"N/A"},"N/A",null,{"$f":"IF(VLOOKUP(A81,Quality!$A$13:$H$32,8,FALSE)=\"NA\", 0, IFERROR(VLOOKUP(C81,$Q$3:$R$6, 2, FALSE),\"N/A\"))","v":"N/A"},"N/A"]
["S20",{"$f":"\"Data: \"& VLOOKUP(A82,Configuration!$B$33:$C$52,2,FALSE)","v":"Data: "},"Answer","clearRow",{"$f":"IF(E81=\"Yes\", \"Yes\", IF(VLOOKUP(A82,Configuration!$B$33:$C$52,2,FALSE)=0, \"Yes\", \"No\"))","v":"Yes"},null,"",null,{"$f":"IF(VLOOKUP(A82,Usability!$A$12:$C$31,3,FALSE)=\"NA\", 0, IFERROR(VLOOKUP(C82,$Q$3:$R$6, 2, FALSE),\"N/A\"))","v":"N/A"},"N/A",null,{"$f":"IF(VLOOKUP(A82,Quality!$A$13:$H$32,8,FALSE)=\"NA\", 0, IFERROR(VLOOKUP(C82,$Q$3:$R$6, 2, FALSE),\"N/A\"))","v":"N/A"},"N/A"]
[null,null,null,null,{"$f":"IF(E62=\"Yes\", \"Yes\", \"No\")","v":"No"}]
[null,"Comments:",null,null,{"$f":"IF(E62=\"Yes\", \"Yes\", \"No\")","v":"No"}]
[null,null,null,null,{"$f":"IF(E62=\"Yes\", \"Yes\", \"No\")","v":"No"}]
[null,null,null,null,{"$f":"IF(E61=\"Yes\", \"Yes\", \"No\")","v":"No"}]
[null,null,null,null,{"$f":"IF(E62=\"Yes\", \"Yes\", \"No\")","v":"No"}]
["A4",{"$f":"\"Activity: \"& VLOOKUP(A88,Configuration!$B$11:$C$30,2, FALSE)","v":"Activity: Performance Diagnostics"},"Importance Rating",null,{"$f":"IF(VLOOKUP(A88,Configuration!$B$11:$C$30,2,FALSE)=0,\"Yes\", \"No\")","v":"No"},null,null,null,{"$f":"SUM(I89:I108)","v":0},null,{"$f":"IF(OR(Progress4<>1, COUNT(G89:G108)<>COUNTIF(E89:E108,\"=No\")),\"\",SUMPRODUCT(J89:J108,Usability!$F$12:$F$31))","v":""},{"$f":"SUM(L89:L108)","v":0},null,{"$f":"IF(OR(Progress3<>1, COUNT(G89:G108)<>COUNTIF(E89:E108,\"=No\")),\"\",SUMPRODUCT(M89:M108,Quality!$H$13:$H$32))","v":""}]
["S1",{"$f":"\"Data: \"& VLOOKUP(A89,Configuration!$B$33:$C$52,2,FALSE)","v":"Data: Pavement Distress, Rutting and Roughness"},"Answer","clearRow",{"$f":"IF(E88=\"Yes\", \"Yes\", IF(VLOOKUP(A89,Configuration!$B$33:$C$52,2,FALSE)=0, \"Yes\", \"No\"))","v":"No"},null,{"$f":"IF(C89<>\"Answer\",1,\"\")","v":""},null,{"$f":"IF(VLOOKUP(A89,Usability!$A$12:$C$31,3,FALSE)=\"NA\", 0, IFERROR(VLOOKUP(C89,$Q$3:$R$6, 2, FALSE),\"N/A\"))","v":"N/A"},{"$f":"IFERROR(I89/$I$88,\"N/A\")","v":"N/A"},null,{"$f":"IF(VLOOKUP(A89,Quality!$A$13:$H$32,8,FALSE)=\"NA\", 0, IFERROR(VLOOKUP(C89,$Q$3:$R$6, 2, FALSE),\"N/A\"))","v":"N/A"},{"$f":"IFERROR(L89/$L$88,\"N/A\")","v":"N/A"}]
["S2",{"$f":"\"Data: \"& VLOOKUP(A90,Configuration!$B$33:$C$52,2,FALSE)","v":"Data: Linear Referencing (routes, intersections, mileposts)"},"Answer","clearRow",{"$f":"IF(E89=\"Yes\", \"Yes\", IF(VLOOKUP(A90,Configuration!$B$33:$C$52,2,FALSE)=0, \"Yes\", \"No\"))","v":"No"},null,"",null,{"$f":"IF(VLOOKUP(A90,Usability!$A$12:$C$31,3,FALSE)=\"NA\", 0, IFERROR(VLOOKUP(C90,$Q$3:$R$6, 2, FALSE),\"N/A\"))","v":"N/A"},{"$f":"IFERROR(I90/$I$88,\"N/A\")","v":"N/A"},null,{"$f":"IF(VLOOKUP(A90,Quality!$A$13:$H$32,8,FALSE)=\"NA\", 0, IFERROR(VLOOKUP(C90,$Q$3:$R$6, 2, FALSE),\"N/A\"))","v":"N/A"},"N/A"]
["S3",{"$f":"\"Data: \"& VLOOKUP(A91,Configuration!$B$33:$C$52,2,FALSE)","v":"Data: Traffic - AADT, Trucks, ESALS"},"Answer","clearRow",{"$f":"IF(E90=\"Yes\", \"Yes\", IF(VLOOKUP(A91,Configuration!$B$33:$C$52,2,FALSE)=0, \"Yes\", \"No\"))","v":"No"},null,"",null,{"$f":"IF(VLOOKUP(A91,Usability!$A$12:$C$31,3,FALSE)=\"NA\", 0, IFERROR(VLOOKUP(C91,$Q$3:$R$6, 2, FALSE),\"N/A\"))","v":"N/A"},"N/A",null,{"$f":"IF(VLOOKUP(A91,Quality!$A$13:$H$32,8,FALSE)=\"NA\", 0, IFERROR(VLOOKUP(C91,$Q$3:$R$6, 2, FALSE),\"N/A\"))","v":"N/A"},"N/A"]
["S4",{"$f":"\"Data: \"& VLOOKUP(A92,Configuration!$B$33:$C$52,2,FALSE)","v":"Data: Pavement Structure Characteristics"},"Answer","clearRow",{"$f":"IF(E91=\"Yes\", \"Yes\", IF(VLOOKUP(A92,Configuration!$B$33:$C$52,2,FALSE)=0, \"Yes\", \"No\"))","v":"No"},null,"",null,{"$f":"IF(VLOOKUP(A92,Usability!$A$12:$C$31,3,FALSE)=\"NA\", 0, IFERROR(VLOOKUP(C92,$Q$3:$R$6, 2, FALSE),\"N/A\"))","v":"N/A"},"N/A",null,{"$f":"IF(VLOOKUP(A92,Quality!$A$13:$H$32,8,FALSE)=\"NA\", 0, IFERROR(VLOOKUP(C92,$Q$3:$R$6, 2, FALSE),\"N/A\"))","v":"N/A"},"N/A"]
["S5",{"$f":"\"Data: \"& VLOOKUP(A93,Configuration!$B$33:$C$52,2,FALSE)","v":"Data: Road Inventory: # Lanes, Functional Class"},"Answer","clearRow",{"$f":"IF(E92=\"Yes\", \"Yes\", IF(VLOOKUP(A93,Configuration!$B$33:$C$52,2,FALSE)=0, \"Yes\", \"No\"))","v":"No"},null,"",null,{"$f":"IF(VLOOKUP(A93,Usability!$A$12:$C$31,3,FALSE)=\"NA\", 0, IFERROR(VLOOKUP(C93,$Q$3:$R$6, 2, FALSE),\"N/A\"))","v":"N/A"},"N/A",null,{"$f":"IF(VLOOKUP(A93,Quality!$A$13:$H$32,8,FALSE)=\"NA\", 0, IFERROR(VLOOKUP(C93,$Q$3:$R$6, 2, FALSE),\"N/A\"))","v":"N/A"},"N/A"]
["S6",{"$f":"\"Data: \"& VLOOKUP(A94,Configuration!$B$33:$C$52,2,FALSE)","v":"Data: "},"Answer","clearRow",{"$f":"IF(E93=\"Yes\", \"Yes\", IF(VLOOKUP(A94,Configuration!$B$33:$C$52,2,FALSE)=0, \"Yes\", \"No\"))","v":"Yes"},null,"",null,{"$f":"IF(VLOOKUP(A94,Usability!$A$12:$C$31,3,FALSE)=\"NA\", 0, IFERROR(VLOOKUP(C94,$Q$3:$R$6, 2, FALSE),\"N/A\"))","v":"N/A"},"N/A",null,{"$f":"IF(VLOOKUP(A94,Quality!$A$13:$H$32,8,FALSE)=\"NA\", 0, IFERROR(VLOOKUP(C94,$Q$3:$R$6, 2, FALSE),\"N/A\"))","v":"N/A"},"N/A"]
["S7",{"$f":"\"Data: \"& VLOOKUP(A95,Configuration!$B$33:$C$52,2,FALSE)","v":"Data: "},"Answer","clearRow",{"$f":"IF(E94=\"Yes\", \"Yes\", IF(VLOOKUP(A95,Configuration!$B$33:$C$52,2,FALSE)=0, \"Yes\", \"No\"))","v":"Yes"},null,"",null,{"$f":"IF(VLOOKUP(A95,Usability!$A$12:$C$31,3,FALSE)=\"NA\", 0, IFERROR(VLOOKUP(C95,$Q$3:$R$6, 2, FALSE),\"N/A\"))","v":"N/A"},"N/A",null,{"$f":"IF(VLOOKUP(A95,Quality!$A$13:$H$32,8,FALSE)=\"NA\", 0, IFERROR(VLOOKUP(C95,$Q$3:$R$6, 2, FALSE),\"N/A\"))","v":"N/A"},"N/A"]
["S8",{"$f":"\"Data: \"& VLOOKUP(A96,Configuration!$B$33:$C$52,2,FALSE)","v":"Data: "},"Answer","clearRow",{"$f":"IF(E95=\"Yes\", \"Yes\", IF(VLOOKUP(A96,Configuration!$B$33:$C$52,2,FALSE)=0, \"Yes\", \"No\"))","v":"Yes"},null,"",null,{"$f":"IF(VLOOKUP(A96,Usability!$A$12:$C$31,3,FALSE)=\"NA\", 0, IFERROR(VLOOKUP(C96,$Q$3:$R$6, 2, FALSE),\"N/A\"))","v":"N/A"},"N/A",null,{"$f":"IF(VLOOKUP(A96,Quality!$A$13:$H$32,8,FALSE)=\"NA\", 0, IFERROR(VLOOKUP(C96,$Q$3:$R$6, 2, FALSE),\"N/A\"))","v":"N/A"},"N/A"]
["S9",{"$f":"\"Data: \"& VLOOKUP(A97,Configuration!$B$33:$C$52,2,FALSE)","v":"Data: "},"Answer","clearRow",{"$f":"IF(E96=\"Yes\", \"Yes\", IF(VLOOKUP(A97,Configuration!$B$33:$C$52,2,FALSE)=0, \"Yes\", \"No\"))","v":"Yes"},null,"",null,{"$f":"IF(VLOOKUP(A97,Usability!$A$12:$C$31,3,FALSE)=\"NA\", 0, IFERROR(VLOOKUP(C97,$Q$3:$R$6, 2, FALSE),\"N/A\"))","v":"N/A"},"N/A",null,{"$f":"IF(VLOOKUP(A97,Quality!$A$13:$H$32,8,FALSE)=\"NA\", 0, IFERROR(VLOOKUP(C97,$Q$3:$R$6, 2, FALSE),\"N/A\"))","v":"N/A"},"N/A"]
["S10",{"$f":"\"Data: \"& VLOOKUP(A98,Configuration!$B$33:$C$52,2,FALSE)","v":"Data: "},"Answer","clearRow",{"$f":"IF(E97=\"Yes\", \"Yes\", IF(VLOOKUP(A98,Configuration!$B$33:$C$52,2,FALSE)=0, \"Yes\", \"No\"))","v":"Yes"},null,"",null,{"$f":"IF(VLOOKUP(A98,Usability!$A$12:$C$31,3,FALSE)=\"NA\", 0, IFERROR(VLOOKUP(C98,$Q$3:$R$6, 2, FALSE),\"N/A\"))","v":"N/A"},"N/A",null,{"$f":"IF(VLOOKUP(A98,Quality!$A$13:$H$32,8,FALSE)=\"NA\", 0, IFERROR(VLOOKUP(C98,$Q$3:$R$6, 2, FALSE),\"N/A\"))","v":"N/A"},"N/A"]
["S11",{"$f":"\"Data: \"& VLOOKUP(A99,Configuration!$B$33:$C$52,2,FALSE)","v":"Data: "},"Answer","clearRow",{"$f":"IF(E98=\"Yes\", \"Yes\", IF(VLOOKUP(A99,Configuration!$B$33:$C$52,2,FALSE)=0, \"Yes\", \"No\"))","v":"Yes"},null,"",null,{"$f":"IF(VLOOKUP(A99,Usability!$A$12:$C$31,3,FALSE)=\"NA\", 0, IFERROR(VLOOKUP(C99,$Q$3:$R$6, 2, FALSE),\"N/A\"))","v":"N/A"},"N/A",null,{"$f":"IF(VLOOKUP(A99,Quality!$A$13:$H$32,8,FALSE)=\"NA\", 0, IFERROR(VLOOKUP(C99,$Q$3:$R$6, 2, FALSE),\"N/A\"))","v":"N/A"},"N/A"]
["S12",{"$f":"\"Data: \"& VLOOKUP(A100,Configuration!$B$33:$C$52,2,FALSE)","v":"Data: "},"Answer","clearRow",{"$f":"IF(E99=\"Yes\", \"Yes\", IF(VLOOKUP(A100,Configuration!$B$33:$C$52,2,FALSE)=0, \"Yes\", \"No\"))","v":"Yes"},null,"",null,{"$f":"IF(VLOOKUP(A100,Usability!$A$12:$C$31,3,FALSE)=\"NA\", 0, IFERROR(VLOOKUP(C100,$Q$3:$R$6, 2, FALSE),\"N/A\"))","v":"N/A"},"N/A",null,{"$f":"IF(VLOOKUP(A100,Quality!$A$13:$H$32,8,FALSE)=\"NA\", 0, IFERROR(VLOOKUP(C100,$Q$3:$R$6, 2, FALSE),\"N/A\"))","v":"N/A"},"N/A"]
["S13",{"$f":"\"Data: \"& VLOOKUP(A101,Configuration!$B$33:$C$52,2,FALSE)","v":"Data: "},"Answer","clearRow",{"$f":"IF(E100=\"Yes\", \"Yes\", IF(VLOOKUP(A101,Configuration!$B$33:$C$52,2,FALSE)=0, \"Yes\", \"No\"))","v":"Yes"},null,"",null,{"$f":"IF(VLOOKUP(A101,Usability!$A$12:$C$31,3,FALSE)=\"NA\", 0, IFERROR(VLOOKUP(C101,$Q$3:$R$6, 2, FALSE),\"N/A\"))","v":"N/A"},"N/A",null,{"$f":"IF(VLOOKUP(A101,Quality!$A$13:$H$32,8,FALSE)=\"NA\", 0, IFERROR(VLOOKUP(C101,$Q$3:$R$6, 2, FALSE),\"N/A\"))","v":"N/A"},"N/A"]
["S14",{"$f":"\"Data: \"& VLOOKUP(A102,Configuration!$B$33:$C$52,2,FALSE)","v":"Data: "},"Answer","clearRow",{"$f":"IF(E101=\"Yes\", \"Yes\", IF(VLOOKUP(A102,Configuration!$B$33:$C$52,2,FALSE)=0, \"Yes\", \"No\"))","v":"Yes"},null,"",null,{"$f":"IF(VLOOKUP(A102,Usability!$A$12:$C$31,3,FALSE)=\"NA\", 0, IFERROR(VLOOKUP(C102,$Q$3:$R$6, 2, FALSE),\"N/A\"))","v":"N/A"},"N/A",null,{"$f":"IF(VLOOKUP(A102,Quality!$A$13:$H$32,8,FALSE)=\"NA\", 0, IFERROR(VLOOKUP(C102,$Q$3:$R$6, 2, FALSE),\"N/A\"))","v":"N/A"},"N/A"]
["S15",{"$f":"\"Data: \"& VLOOKUP(A103,Configuration!$B$33:$C$52,2,FALSE)","v":"Data: "},"Answer","clearRow",{"$f":"IF(E102=\"Yes\", \"Yes\", IF(VLOOKUP(A103,Configuration!$B$33:$C$52,2,FALSE)=0, \"Yes\", \"No\"))","v":"Yes"},null,"",null,{"$f":"IF(VLOOKUP(A103,Usability!$A$12:$C$31,3,FALSE)=\"NA\", 0, IFERROR(VLOOKUP(C103,$Q$3:$R$6, 2, FALSE),\"N/A\"))","v":"N/A"},"N/A",null,{"$f":"IF(VLOOKUP(A103,Quality!$A$13:$H$32,8,FALSE)=\"NA\", 0, IFERROR(VLOOKUP(C103,$Q$3:$R$6, 2, FALSE),\"N/A\"))","v":"N/A"},"N/A"]
["S16",{"$f":"\"Data: \"& VLOOKUP(A104,Configuration!$B$33:$C$52,2,FALSE)","v":"Data: "},"Answer","clearRow",{"$f":"IF(E103=\"Yes\", \"Yes\", IF(VLOOKUP(A104,Configuration!$B$33:$C$52,2,FALSE)=0, \"Yes\", \"No\"))","v":"Yes"},null,"",null,{"$f":"IF(VLOOKUP(A104,Usability!$A$12:$C$31,3,FALSE)=\"NA\", 0, IFERROR(VLOOKUP(C104,$Q$3:$R$6, 2, FALSE),\"N/A\"))","v":"N/A"},"N/A",null,{"$f":"IF(VLOOKUP(A104,Quality!$A$13:$H$32,8,FALSE)=\"NA\", 0, IFERROR(VLOOKUP(C104,$Q$3:$R$6, 2, FALSE),\"N/A\"))","v":"N/A"},"N/A"]
["S17",{"$f":"\"Data: \"& VLOOKUP(A105,Configuration!$B$33:$C$52,2,FALSE)","v":"Data: "},"Answer","clearRow",{"$f":"IF(E104=\"Yes\", \"Yes\", IF(VLOOKUP(A105,Configuration!$B$33:$C$52,2,FALSE)=0, \"Yes\", \"No\"))","v":"Yes"},null,"",null,{"$f":"IF(VLOOKUP(A105,Usability!$A$12:$C$31,3,FALSE)=\"NA\", 0, IFERROR(VLOOKUP(C105,$Q$3:$R$6, 2, FALSE),\"N/A\"))","v":"N/A"},"N/A",null,{"$f":"IF(VLOOKUP(A105,Quality!$A$13:$H$32,8,FALSE)=\"NA\", 0, IFERROR(VLOOKUP(C105,$Q$3:$R$6, 2, FALSE),\"N/A\"))","v":"N/A"},"N/A"]
["S18",{"$f":"\"Data: \"& VLOOKUP(A106,Configuration!$B$33:$C$52,2,FALSE)","v":"Data: "},"Answer","clearRow",{"$f":"IF(E105=\"Yes\", \"Yes\", IF(VLOOKUP(A106,Configuration!$B$33:$C$52,2,FALSE)=0, \"Yes\", \"No\"))","v":"Yes"},null,"",null,{"$f":"IF(VLOOKUP(A106,Usability!$A$12:$C$31,3,FALSE)=\"NA\", 0, IFERROR(VLOOKUP(C106,$Q$3:$R$6, 2, FALSE),\"N/A\"))","v":"N/A"},"N/A",null,{"$f":"IF(VLOOKUP(A106,Quality!$A$13:$H$32,8,FALSE)=\"NA\", 0, IFERROR(VLOOKUP(C106,$Q$3:$R$6, 2, FALSE),\"N/A\"))","v":"N/A"},"N/A"]
["S19",{"$f":"\"Data: \"& VLOOKUP(A107,Configuration!$B$33:$C$52,2,FALSE)","v":"Data: "},"Answer","clearRow",{"$f":"IF(E106=\"Yes\", \"Yes\", IF(VLOOKUP(A107,Configuration!$B$33:$C$52,2,FALSE)=0, \"Yes\", \"No\"))","v":"Yes"},null,"",null,{"$f":"IF(VLOOKUP(A107,Usability!$A$12:$C$31,3,FALSE)=\"NA\", 0, IFERROR(VLOOKUP(C107,$Q$3:$R$6, 2, FALSE),\"N/A\"))","v":"N/A"},"N/A",null,{"$f":"IF(VLOOKUP(A107,Quality!$A$13:$H$32,8,FALSE)=\"NA\", 0, IFERROR(VLOOKUP(C107,$Q$3:$R$6, 2, FALSE),\"N/A\"))","v":"N/A"},"N/A"]
["S20",{"$f":"\"Data: \"& VLOOKUP(A108,Configuration!$B$33:$C$52,2,FALSE)","v":"Data: "},"Answer","clearRow",{"$f":"IF(E107=\"Yes\", \"Yes\", IF(VLOOKUP(A108,Configuration!$B$33:$C$52,2,FALSE)=0, \"Yes\", \"No\"))","v":"Yes"},null,"",null,{"$f":"IF(VLOOKUP(A108,Usability!$A$12:$C$31,3,FALSE)=\"NA\", 0, IFERROR(VLOOKUP(C108,$Q$3:$R$6, 2, FALSE),\"N/A\"))","v":"N/A"},"N/A",null,{"$f":"IF(VLOOKUP(A108,Quality!$A$13:$H$32,8,FALSE)=\"NA\", 0, IFERROR(VLOOKUP(C108,$Q$3:$R$6, 2, FALSE),\"N/A\"))","v":"N/A"},"N/A"]
[null,null,null,null,{"$f":"IF(E88=\"Yes\", \"Yes\", \"No\")","v":"No"}]
[null,"Comments:",null,null,{"$f":"IF(E88=\"Yes\", \"Yes\", \"No\")","v":"No"}]
[null,null,null,null,{"$f":"IF(E88=\"Yes\", \"Yes\", \"No\")","v":"No"}]
[null,null,null,null,{"$f":"IF(E87=\"Yes\", \"Yes\", \"No\")","v":"No"}]
[null,null,null,null,{"$f":"IF(E88=\"Yes\", \"Yes\", \"No\")","v":"No"}]
["A5",{"$f":"\"Activity: \"& VLOOKUP(A114,Configuration!$B$11:$C$30,2, FALSE)","v":"Activity: Identifying Improvement Actions"},"Importance Rating",null,{"$f":"IF(VLOOKUP(A114,Configuration!$B$11:$C$30,2,FALSE)=0,\"Yes\", \"No\")","v":"No"},null,null,null,{"$f":"SUM(I115:I134)","v":0},null,{"$f":"IF(OR(Progress4<>1, COUNT(G115:G134)<>COUNTIF(E115:E134,\"=No\")),\"\",SUMPRODUCT(J115:J134,Usability!$F$12:$F$31))","v":""},{"$f":"SUM(L115:L134)","v":0},null,{"$f":"IF(OR(Progress3<>1, COUNT(G115:G134)<>COUNTIF(E115:E134,\"=No\")),\"\",SUMPRODUCT(M115:M134,Quality!$H$13:$H$32))","v":""}]
["S1",{"$f":"\"Data: \"& VLOOKUP(A115,Configuration!$B$33:$C$52,2,FALSE)","v":"Data: Pavement Distress, Rutting and Roughness"},"Answer","clearRow",{"$f":"IF(E114=\"Yes\", \"Yes\", IF(VLOOKUP(A115,Configuration!$B$33:$C$52,2,FALSE)=0, \"Yes\", \"No\"))","v":"No"},null,{"$f":"IF(C115<>\"Answer\",1,\"\")","v":""},null,{"$f":"IF(VLOOKUP(A115,Usability!$A$12:$C$31,3,FALSE)=\"NA\", 0, IFERROR(VLOOKUP(C115,$Q$3:$R$6, 2, FALSE),\"N/A\"))","v":"N/A"},{"$f":"IFERROR(I115/$I$114,\"N/A\")","v":"N/A"},null,{"$f":"IF(VLOOKUP(A115,Quality!$A$13:$H$32,8,FALSE)=\"NA\", 0, IFERROR(VLOOKUP(C115,$Q$3:$R$6, 2, FALSE),\"N/A\"))","v":"N/A"},{"$f":"IFERROR(L115/$L$114,\"N/A\")","v":"N/A"}]
["S2",{"$f":"\"Data: \"& VLOOKUP(A116,Configuration!$B$33:$C$52,2,FALSE)","v":"Data: Linear Referencing (routes, intersections, mileposts)"},"Answer","clearRow",{"$f":"IF(E115=\"Yes\", \"Yes\", IF(VLOOKUP(A116,Configuration!$B$33:$C$52,2,FALSE)=0, \"Yes\", \"No\"))","v":"No"},null,"",null,{"$f":"IF(VLOOKUP(A116,Usability!$A$12:$C$31,3,FALSE)=\"NA\", 0, IFERROR(VLOOKUP(C116,$Q$3:$R$6, 2, FALSE),\"N/A\"))","v":"N/A"},{"$f":"IFERROR(I116/$I$114,\"N/A\")","v":"N/A"},null,{"$f":"IF(VLOOKUP(A116,Quality!$A$13:$H$32,8,FALSE)=\"NA\", 0, IFERROR(VLOOKUP(C116,$Q$3:$R$6, 2, FALSE),\"N/A\"))","v":"N/A"},"N/A"]
["S3",{"$f":"\"Data: \"& VLOOKUP(A117,Configuration!$B$33:$C$52,2,FALSE)","v":"Data: Traffic - AADT, Trucks, ESALS"},"Answer","clearRow",{"$f":"IF(E116=\"Yes\", \"Yes\", IF(VLOOKUP(A117,Configuration!$B$33:$C$52,2,FALSE)=0, \"Yes\", \"No\"))","v":"No"},null,"",null,{"$f":"IF(VLOOKUP(A117,Usability!$A$12:$C$31,3,FALSE)=\"NA\", 0, IFERROR(VLOOKUP(C117,$Q$3:$R$6, 2, FALSE),\"N/A\"))","v":"N/A"},"N/A",null,{"$f":"IF(VLOOKUP(A117,Quality!$A$13:$H$32,8,FALSE)=\"NA\", 0, IFERROR(VLOOKUP(C117,$Q$3:$R$6, 2, FALSE),\"N/A\"))","v":"N/A"},"N/A"]
["S4",{"$f":"\"Data: \"& VLOOKUP(A118,Configuration!$B$33:$C$52,2,FALSE)","v":"Data: Pavement Structure Characteristics"},"Answer","clearRow",{"$f":"IF(E117=\"Yes\", \"Yes\", IF(VLOOKUP(A118,Configuration!$B$33:$C$52,2,FALSE)=0, \"Yes\", \"No\"))","v":"No"},null,"",null,{"$f":"IF(VLOOKUP(A118,Usability!$A$12:$C$31,3,FALSE)=\"NA\", 0, IFERROR(VLOOKUP(C118,$Q$3:$R$6, 2, FALSE),\"N/A\"))","v":"N/A"},"N/A",null,{"$f":"IF(VLOOKUP(A118,Quality!$A$13:$H$32,8,FALSE)=\"NA\", 0, IFERROR(VLOOKUP(C118,$Q$3:$R$6, 2, FALSE),\"N/A\"))","v":"N/A"},"N/A"]
["S5",{"$f":"\"Data: \"& VLOOKUP(A119,Configuration!$B$33:$C$52,2,FALSE)","v":"Data: Road Inventory: # Lanes, Functional Class"},"Answer","clearRow",{"$f":"IF(E118=\"Yes\", \"Yes\", IF(VLOOKUP(A119,Configuration!$B$33:$C$52,2,FALSE)=0, \"Yes\", \"No\"))","v":"No"},null,"",null,{"$f":"IF(VLOOKUP(A119,Usability!$A$12:$C$31,3,FALSE)=\"NA\", 0, IFERROR(VLOOKUP(C119,$Q$3:$R$6, 2, FALSE),\"N/A\"))","v":"N/A"},"N/A",null,{"$f":"IF(VLOOKUP(A119,Quality!$A$13:$H$32,8,FALSE)=\"NA\", 0, IFERROR(VLOOKUP(C119,$Q$3:$R$6, 2, FALSE),\"N/A\"))","v":"N/A"},"N/A"]
["S6",{"$f":"\"Data: \"& VLOOKUP(A120,Configuration!$B$33:$C$52,2,FALSE)","v":"Data: "},"Answer","clearRow",{"$f":"IF(E119=\"Yes\", \"Yes\", IF(VLOOKUP(A120,Configuration!$B$33:$C$52,2,FALSE)=0, \"Yes\", \"No\"))","v":"Yes"},null,"",null,{"$f":"IF(VLOOKUP(A120,Usability!$A$12:$C$31,3,FALSE)=\"NA\", 0, IFERROR(VLOOKUP(C120,$Q$3:$R$6, 2, FALSE),\"N/A\"))","v":"N/A"},"N/A",null,{"$f":"IF(VLOOKUP(A120,Quality!$A$13:$H$32,8,FALSE)=\"NA\", 0, IFERROR(VLOOKUP(C120,$Q$3:$R$6, 2, FALSE),\"N/A\"))","v":"N/A"},"N/A"]
["S7",{"$f":"\"Data: \"& VLOOKUP(A121,Configuration!$B$33:$C$52,2,FALSE)","v":"Data: "},"Answer","clearRow",{"$f":"IF(E120=\"Yes\", \"Yes\", IF(VLOOKUP(A121,Configuration!$B$33:$C$52,2,FALSE)=0, \"Yes\", \"No\"))","v":"Yes"},null,"",null,{"$f":"IF(VLOOKUP(A121,Usability!$A$12:$C$31,3,FALSE)=\"NA\", 0, IFERROR(VLOOKUP(C121,$Q$3:$R$6, 2, FALSE),\"N/A\"))","v":"N/A"},"N/A",null,{"$f":"IF(VLOOKUP(A121,Quality!$A$13:$H$32,8,FALSE)=\"NA\", 0, IFERROR(VLOOKUP(C121,$Q$3:$R$6, 2, FALSE),\"N/A\"))","v":"N/A"},"N/A"]
["S8",{"$f":"\"Data: \"& VLOOKUP(A122,Configuration!$B$33:$C$52,2,FALSE)","v":"Data: "},"Answer","clearRow",{"$f":"IF(E121=\"Yes\", \"Yes\", IF(VLOOKUP(A122,Configuration!$B$33:$C$52,2,FALSE)=0, \"Yes\", \"No\"))","v":"Yes"},null,"",null,{"$f":"IF(VLOOKUP(A122,Usability!$A$12:$C$31,3,FALSE)=\"NA\", 0, IFERROR(VLOOKUP(C122,$Q$3:$R$6, 2, FALSE),\"N/A\"))","v":"N/A"},"N/A",null,{"$f":"IF(VLOOKUP(A122,Quality!$A$13:$H$32,8,FALSE)=\"NA\", 0, IFERROR(VLOOKUP(C122,$Q$3:$R$6, 2, FALSE),\"N/A\"))","v":"N/A"},"N/A"]
["S9",{"$f":"\"Data: \"& VLOOKUP(A123,Configuration!$B$33:$C$52,2,FALSE)","v":"Data: "},"Answer","clearRow",{"$f":"IF(E122=\"Yes\", \"Yes\", IF(VLOOKUP(A123,Configuration!$B$33:$C$52,2,FALSE)=0, \"Yes\", \"No\"))","v":"Yes"},null,"",null,{"$f":"IF(VLOOKUP(A123,Usability!$A$12:$C$31,3,FALSE)=\"NA\", 0, IFERROR(VLOOKUP(C123,$Q$3:$R$6, 2, FALSE),\"N/A\"))","v":"N/A"},"N/A",null,{"$f":"IF(VLOOKUP(A123,Quality!$A$13:$H$32,8,FALSE)=\"NA\", 0, IFERROR(VLOOKUP(C123,$Q$3:$R$6, 2, FALSE),\"N/A\"))","v":"N/A"},"N/A"]
["S10",{"$f":"\"Data: \"& VLOOKUP(A124,Configuration!$B$33:$C$52,2,FALSE)","v":"Data: "},"Answer","clearRow",{"$f":"IF(E123=\"Yes\", \"Yes\", IF(VLOOKUP(A124,Configuration!$B$33:$C$52,2,FALSE)=0, \"Yes\", \"No\"))","v":"Yes"},null,"",null,{"$f":"IF(VLOOKUP(A124,Usability!$A$12:$C$31,3,FALSE)=\"NA\", 0, IFERROR(VLOOKUP(C124,$Q$3:$R$6, 2, FALSE),\"N/A\"))","v":"N/A"},"N/A",null,{"$f":"IF(VLOOKUP(A124,Quality!$A$13:$H$32,8,FALSE)=\"NA\", 0, IFERROR(VLOOKUP(C124,$Q$3:$R$6, 2, FALSE),\"N/A\"))","v":"N/A"},"N/A"]
["S11",{"$f":"\"Data: \"& VLOOKUP(A125,Configuration!$B$33:$C$52,2,FALSE)","v":"Data: "},"Answer","clearRow",{"$f":"IF(E124=\"Yes\", \"Yes\", IF(VLOOKUP(A125,Configuration!$B$33:$C$52,2,FALSE)=0, \"Yes\", \"No\"))","v":"Yes"},null,"",null,{"$f":"IF(VLOOKUP(A125,Usability!$A$12:$C$31,3,FALSE)=\"NA\", 0, IFERROR(VLOOKUP(C125,$Q$3:$R$6, 2, FALSE),\"N/A\"))","v":"N/A"},"N/A",null,{"$f":"IF(VLOOKUP(A125,Quality!$A$13:$H$32,8,FALSE)=\"NA\", 0, IFERROR(VLOOKUP(C125,$Q$3:$R$6, 2, FALSE),\"N/A\"))","v":"N/A"},"N/A"]
["S12",{"$f":"\"Data: \"& VLOOKUP(A126,Configuration!$B$33:$C$52,2,FALSE)","v":"Data: "},"Answer","clearRow",{"$f":"IF(E125=\"Yes\", \"Yes\", IF(VLOOKUP(A126,Configuration!$B$33:$C$52,2,FALSE)=0, \"Yes\", \"No\"))","v":"Yes"},null,"",null,{"$f":"IF(VLOOKUP(A126,Usability!$A$12:$C$31,3,FALSE)=\"NA\", 0, IFERROR(VLOOKUP(C126,$Q$3:$R$6, 2, FALSE),\"N/A\"))","v":"N/A"},"N/A",null,{"$f":"IF(VLOOKUP(A126,Quality!$A$13:$H$32,8,FALSE)=\"NA\", 0, IFERROR(VLOOKUP(C126,$Q$3:$R$6, 2, FALSE),\"N/A\"))","v":"N/A"},"N/A"]
["S13",{"$f":"\"Data: \"& VLOOKUP(A127,Configuration!$B$33:$C$52,2,FALSE)","v":"Data: "},"Answer","clearRow",{"$f":"IF(E126=\"Yes\", \"Yes\", IF(VLOOKUP(A127,Configuration!$B$33:$C$52,2,FALSE)=0, \"Yes\", \"No\"))","v":"Yes"},null,"",null,{"$f":"IF(VLOOKUP(A127,Usability!$A$12:$C$31,3,FALSE)=\"NA\", 0, IFERROR(VLOOKUP(C127,$Q$3:$R$6, 2, FALSE),\"N/A\"))","v":"N/A"},"N/A",null,{"$f":"IF(VLOOKUP(A127,Quality!$A$13:$H$32,8,FALSE)=\"NA\", 0, IFERROR(VLOOKUP(C127,$Q$3:$R$6, 2, FALSE),\"N/A\"))","v":"N/A"},"N/A"]
["S14",{"$f":"\"Data: \"& VLOOKUP(A128,Configuration!$B$33:$C$52,2,FALSE)","v":"Data: "},"Answer","clearRow",{"$f":"IF(E127=\"Yes\", \"Yes\", IF(VLOOKUP(A128,Configuration!$B$33:$C$52,2,FALSE)=0, \"Yes\", \"No\"))","v":"Yes"},null,"",null,{"$f":"IF(VLOOKUP(A128,Usability!$A$12:$C$31,3,FALSE)=\"NA\", 0, IFERROR(VLOOKUP(C128,$Q$3:$R$6, 2, FALSE),\"N/A\"))","v":"N/A"},"N/A",null,{"$f":"IF(VLOOKUP(A128,Quality!$A$13:$H$32,8,FALSE)=\"NA\", 0, IFERROR(VLOOKUP(C128,$Q$3:$R$6, 2, FALSE),\"N/A\"))","v":"N/A"},"N/A"]
["S15",{"$f":"\"Data: \"& VLOOKUP(A129,Configuration!$B$33:$C$52,2,FALSE)","v":"Data: "},"Answer","clearRow",{"$f":"IF(E128=\"Yes\", \"Yes\", IF(VLOOKUP(A129,Configuration!$B$33:$C$52,2,FALSE)=0, \"Yes\", \"No\"))","v":"Yes"},null,"",null,{"$f":"IF(VLOOKUP(A129,Usability!$A$12:$C$31,3,FALSE)=\"NA\", 0, IFERROR(VLOOKUP(C129,$Q$3:$R$6, 2, FALSE),\"N/A\"))","v":"N/A"},"N/A",null,{"$f":"IF(VLOOKUP(A129,Quality!$A$13:$H$32,8,FALSE)=\"NA\", 0, IFERROR(VLOOKUP(C129,$Q$3:$R$6, 2, FALSE),\"N/A\"))","v":"N/A"},"N/A"]
["S16",{"$f":"\"Data: \"& VLOOKUP(A130,Configuration!$B$33:$C$52,2,FALSE)","v":"Data: "},"Answer","clearRow",{"$f":"IF(E129=\"Yes\", \"Yes\", IF(VLOOKUP(A130,Configuration!$B$33:$C$52,2,FALSE)=0, \"Yes\", \"No\"))","v":"Yes"},null,"",null,{"$f":"IF(VLOOKUP(A130,Usability!$A$12:$C$31,3,FALSE)=\"NA\", 0, IFERROR(VLOOKUP(C130,$Q$3:$R$6, 2, FALSE),\"N/A\"))","v":"N/A"},"N/A",null,{"$f":"IF(VLOOKUP(A130,Quality!$A$13:$H$32,8,FALSE)=\"NA\", 0, IFERROR(VLOOKUP(C130,$Q$3:$R$6, 2, FALSE),\"N/A\"))","v":"N/A"},"N/A"]
["S17",{"$f":"\"Data: \"& VLOOKUP(A131,Configuration!$B$33:$C$52,2,FALSE)","v":"Data: "},"Answer","clearRow",{"$f":"IF(E130=\"Yes\", \"Yes\", IF(VLOOKUP(A131,Configuration!$B$33:$C$52,2,FALSE)=0, \"Yes\", \"No\"))","v":"Yes"},null,"",null,{"$f":"IF(VLOOKUP(A131,Usability!$A$12:$C$31,3,FALSE)=\"NA\", 0, IFERROR(VLOOKUP(C131,$Q$3:$R$6, 2, FALSE),\"N/A\"))","v":"N/A"},"N/A",null,{"$f":"IF(VLOOKUP(A131,Quality!$A$13:$H$32,8,FALSE)=\"NA\", 0, IFERROR(VLOOKUP(C131,$Q$3:$R$6, 2, FALSE),\"N/A\"))","v":"N/A"},"N/A"]
["S18",{"$f":"\"Data: \"& VLOOKUP(A132,Configuration!$B$33:$C$52,2,FALSE)","v":"Data: "},"Answer","clearRow",{"$f":"IF(E131=\"Yes\", \"Yes\", IF(VLOOKUP(A132,Configuration!$B$33:$C$52,2,FALSE)=0, \"Yes\", \"No\"))","v":"Yes"},null,"",null,{"$f":"IF(VLOOKUP(A132,Usability!$A$12:$C$31,3,FALSE)=\"NA\", 0, IFERROR(VLOOKUP(C132,$Q$3:$R$6, 2, FALSE),\"N/A\"))","v":"N/A"},"N/A",null,{"$f":"IF(VLOOKUP(A132,Quality!$A$13:$H$32,8,FALSE)=\"NA\", 0, IFERROR(VLOOKUP(C132,$Q$3:$R$6, 2, FALSE),\"N/A\"))","v":"N/A"},"N/A"]
["S19",{"$f":"\"Data: \"& VLOOKUP(A133,Configuration!$B$33:$C$52,2,FALSE)","v":"Data: "},"Answer","clearRow",{"$f":"IF(E132=\"Yes\", \"Yes\", IF(VLOOKUP(A133,Configuration!$B$33:$C$52,2,FALSE)=0, \"Yes\", \"No\"))","v":"Yes"},null,"",null,{"$f":"IF(VLOOKUP(A133,Usability!$A$12:$C$31,3,FALSE)=\"NA\", 0, IFERROR(VLOOKUP(C133,$Q$3:$R$6, 2, FALSE),\"N/A\"))","v":"N/A"},"N/A",null,{"$f":"IF(VLOOKUP(A133,Quality!$A$13:$H$32,8,FALSE)=\"NA\", 0, IFERROR(VLOOKUP(C133,$Q$3:$R$6, 2, FALSE),\"N/A\"))","v":"N/A"},"N/A"]
["S20",{"$f":"\"Data: \"& VLOOKUP(A134,Configuration!$B$33:$C$52,2,FALSE)","v":"Data: "},"Answer","clearRow",{"$f":"IF(E133=\"Yes\", \"Yes\", IF(VLOOKUP(A134,Configuration!$B$33:$C$52,2,FALSE)=0, \"Yes\", \"No\"))","v":"Yes"},null,"",null,{"$f":"IF(VLOOKUP(A134,Usability!$A$12:$C$31,3,FALSE)=\"NA\", 0, IFERROR(VLOOKUP(C134,$Q$3:$R$6, 2, FALSE),\"N/A\"))","v":"N/A"},"N/A",null,{"$f":"IF(VLOOKUP(A134,Quality!$A$13:$H$32,8,FALSE)=\"NA\", 0, IFERROR(VLOOKUP(C134,$Q$3:$R$6, 2, FALSE),\"N/A\"))","v":"N/A"},"N/A"]
[null,null,null,null,{"$f":"IF(E114=\"Yes\", \"Yes\", \"No\")","v":"No"}]
[null,"Comments:",null,null,{"$f":"IF(E114=\"Yes\", \"Yes\", \"No\")","v":"No"}]
[null,null,null,null,{"$f":"IF(E114=\"Yes\", \"Yes\", \"No\")","v":"No"}]
[null,null,null,null,{"$f":"IF(E113=\"Yes\", \"Yes\", \"No\")","v":"No"}]
[null,null,null,null,{"$f":"IF(E114=\"Yes\", \"Yes\", \"No\")","v":"No"}]
["A6",{"$f":"\"Activity: \"& VLOOKUP(A140,Configuration!$B$11:$C$30,2, FALSE)","v":"Activity: "},"Importance Rating",null,{"$f":"IF(VLOOKUP(A140,Configuration!$B$11:$C$30,2,FALSE)=0,\"Yes\", \"No\")","v":"Yes"},null,null,null,{"$f":"SUM(I141:I160)","v":0},null,{"$f":"IF(OR(Progress4<>1, COUNT(G141:G160)<>COUNTIF(E141:E160,\"=No\")),\"\",SUMPRODUCT(J141:J160,Usability!$F$12:$F$31))","v":""},{"$f":"SUM(L141:L160)","v":0},null,{"$f":"IF(OR(Progress3<>1, COUNT(G141:G160)<>COUNTIF(E141:E160,\"=No\")),\"\",SUMPRODUCT(M141:M160,Quality!$H$13:$H$32))","v":""}]
["S1",{"$f":"\"Data: \"& VLOOKUP(A141,Configuration!$B$33:$C$52,2,FALSE)","v":"Data: Pavement Distress, Rutting and Roughness"},"Answer","clearRow",{"$f":"IF(E140=\"Yes\", \"Yes\", IF(VLOOKUP(A141,Configuration!$B$33:$C$52,2,FALSE)=0, \"Yes\", \"No\"))","v":"Yes"},null,{"$f":"IF(C141<>\"Answer\",1,\"\")","v":""},null,{"$f":"IF(VLOOKUP(A141,Usability!$A$12:$C$31,3,FALSE)=\"NA\", 0, IFERROR(VLOOKUP(C141,$Q$3:$R$6, 2, FALSE),\"N/A\"))","v":"N/A"},{"$f":"IFERROR(I141/$I$140,\"N/A\")","v":"N/A"},null,{"$f":"IF(VLOOKUP(A141,Quality!$A$13:$H$32,8,FALSE)=\"NA\", 0, IFERROR(VLOOKUP(C141,$Q$3:$R$6, 2, FALSE),\"N/A\"))","v":"N/A"},{"$f":"IFERROR(L141/$L$140,\"N/A\")","v":"N/A"}]
["S2",{"$f":"\"Data: \"& VLOOKUP(A142,Configuration!$B$33:$C$52,2,FALSE)","v":"Data: Linear Referencing (routes, intersections, mileposts)"},"Answer","clearRow",{"$f":"IF(E141=\"Yes\", \"Yes\", IF(VLOOKUP(A142,Configuration!$B$33:$C$52,2,FALSE)=0, \"Yes\", \"No\"))","v":"Yes"},null,"",null,{"$f":"IF(VLOOKUP(A142,Usability!$A$12:$C$31,3,FALSE)=\"NA\", 0, IFERROR(VLOOKUP(C142,$Q$3:$R$6, 2, FALSE),\"N/A\"))","v":"N/A"},{"$f":"IFERROR(I142/$I$140,\"N/A\")","v":"N/A"},null,{"$f":"IF(VLOOKUP(A142,Quality!$A$13:$H$32,8,FALSE)=\"NA\", 0, IFERROR(VLOOKUP(C142,$Q$3:$R$6, 2, FALSE),\"N/A\"))","v":"N/A"},"N/A"]
["S3",{"$f":"\"Data: \"& VLOOKUP(A143,Configuration!$B$33:$C$52,2,FALSE)","v":"Data: Traffic - AADT, Trucks, ESALS"},"Answer","clearRow",{"$f":"IF(E142=\"Yes\", \"Yes\", IF(VLOOKUP(A143,Configuration!$B$33:$C$52,2,FALSE)=0, \"Yes\", \"No\"))","v":"Yes"},null,"",null,{"$f":"IF(VLOOKUP(A143,Usability!$A$12:$C$31,3,FALSE)=\"NA\", 0, IFERROR(VLOOKUP(C143,$Q$3:$R$6, 2, FALSE),\"N/A\"))","v":"N/A"},"N/A",null,{"$f":"IF(VLOOKUP(A143,Quality!$A$13:$H$32,8,FALSE)=\"NA\", 0, IFERROR(VLOOKUP(C143,$Q$3:$R$6, 2, FALSE),\"N/A\"))","v":"N/A"},"N/A"]
["S4",{"$f":"\"Data: \"& VLOOKUP(A144,Configuration!$B$33:$C$52,2,FALSE)","v":"Data: Pavement Structure Characteristics"},"Answer","clearRow",{"$f":"IF(E143=\"Yes\", \"Yes\", IF(VLOOKUP(A144,Configuration!$B$33:$C$52,2,FALSE)=0, \"Yes\", \"No\"))","v":"Yes"},null,"",null,{"$f":"IF(VLOOKUP(A144,Usability!$A$12:$C$31,3,FALSE)=\"NA\", 0, IFERROR(VLOOKUP(C144,$Q$3:$R$6, 2, FALSE),\"N/A\"))","v":"N/A"},"N/A",null,{"$f":"IF(VLOOKUP(A144,Quality!$A$13:$H$32,8,FALSE)=\"NA\", 0, IFERROR(VLOOKUP(C144,$Q$3:$R$6, 2, FALSE),\"N/A\"))","v":"N/A"},"N/A"]
["S5",{"$f":"\"Data: \"& VLOOKUP(A145,Configuration!$B$33:$C$52,2,FALSE)","v":"Data: Road Inventory: # Lanes, Functional Class"},"Answer","clearRow",{"$f":"IF(E144=\"Yes\", \"Yes\", IF(VLOOKUP(A145,Configuration!$B$33:$C$52,2,FALSE)=0, \"Yes\", \"No\"))","v":"Yes"},null,"",null,{"$f":"IF(VLOOKUP(A145,Usability!$A$12:$C$31,3,FALSE)=\"NA\", 0, IFERROR(VLOOKUP(C145,$Q$3:$R$6, 2, FALSE),\"N/A\"))","v":"N/A"},"N/A",null,{"$f":"IF(VLOOKUP(A145,Quality!$A$13:$H$32,8,FALSE)=\"NA\", 0, IFERROR(VLOOKUP(C145,$Q$3:$R$6, 2, FALSE),\"N/A\"))","v":"N/A"},"N/A"]
["S6",{"$f":"\"Data: \"& VLOOKUP(A146,Configuration!$B$33:$C$52,2,FALSE)","v":"Data: "},"Answer","clearRow",{"$f":"IF(E145=\"Yes\", \"Yes\", IF(VLOOKUP(A146,Configuration!$B$33:$C$52,2,FALSE)=0, \"Yes\", \"No\"))","v":"Yes"},null,"",null,{"$f":"IF(VLOOKUP(A146,Usability!$A$12:$C$31,3,FALSE)=\"NA\", 0, IFERROR(VLOOKUP(C146,$Q$3:$R$6, 2, FALSE),\"N/A\"))","v":"N/A"},"N/A",null,{"$f":"IF(VLOOKUP(A146,Quality!$A$13:$H$32,8,FALSE)=\"NA\", 0, IFERROR(VLOOKUP(C146,$Q$3:$R$6, 2, FALSE),\"N/A\"))","v":"N/A"},"N/A"]
["S7",{"$f":"\"Data: \"& VLOOKUP(A147,Configuration!$B$33:$C$52,2,FALSE)","v":"Data: "},"Answer","clearRow",{"$f":"IF(E146=\"Yes\", \"Yes\", IF(VLOOKUP(A147,Configuration!$B$33:$C$52,2,FALSE)=0, \"Yes\", \"No\"))","v":"Yes"},null,"",null,{"$f":"IF(VLOOKUP(A147,Usability!$A$12:$C$31,3,FALSE)=\"NA\", 0, IFERROR(VLOOKUP(C147,$Q$3:$R$6, 2, FALSE),\"N/A\"))","v":"N/A"},"N/A",null,{"$f":"IF(VLOOKUP(A147,Quality!$A$13:$H$32,8,FALSE)=\"NA\", 0, IFERROR(VLOOKUP(C147,$Q$3:$R$6, 2, FALSE),\"N/A\"))","v":"N/A"},"N/A"]
["S8",{"$f":"\"Data: \"& VLOOKUP(A148,Configuration!$B$33:$C$52,2,FALSE)","v":"Data: "},"Answer","clearRow",{"$f":"IF(E147=\"Yes\", \"Yes\", IF(VLOOKUP(A148,Configuration!$B$33:$C$52,2,FALSE)=0, \"Yes\", \"No\"))","v":"Yes"},null,"",null,{"$f":"IF(VLOOKUP(A148,Usability!$A$12:$C$31,3,FALSE)=\"NA\", 0, IFERROR(VLOOKUP(C148,$Q$3:$R$6, 2, FALSE),\"N/A\"))","v":"N/A"},"N/A",null,{"$f":"IF(VLOOKUP(A148,Quality!$A$13:$H$32,8,FALSE)=\"NA\", 0, IFERROR(VLOOKUP(C148,$Q$3:$R$6, 2, FALSE),\"N/A\"))","v":"N/A"},"N/A"]
["S9",{"$f":"\"Data: \"& VLOOKUP(A149,Configuration!$B$33:$C$52,2,FALSE)","v":"Data: "},"Answer","clearRow",{"$f":"IF(E148=\"Yes\", \"Yes\", IF(VLOOKUP(A149,Configuration!$B$33:$C$52,2,FALSE)=0, \"Yes\", \"No\"))","v":"Yes"},null,"",null,{"$f":"IF(VLOOKUP(A149,Usability!$A$12:$C$31,3,FALSE)=\"NA\", 0, IFERROR(VLOOKUP(C149,$Q$3:$R$6, 2, FALSE),\"N/A\"))","v":"N/A"},"N/A",null,{"$f":"IF(VLOOKUP(A149,Quality!$A$13:$H$32,8,FALSE)=\"NA\", 0, IFERROR(VLOOKUP(C149,$Q$3:$R$6, 2, FALSE),\"N/A\"))","v":"N/A"},"N/A"]
["S10",{"$f":"\"Data: \"& VLOOKUP(A150,Configuration!$B$33:$C$52,2,FALSE)","v":"Data: "},"Answer","clearRow",{"$f":"IF(E149=\"Yes\", \"Yes\", IF(VLOOKUP(A150,Configuration!$B$33:$C$52,2,FALSE)=0, \"Yes\", \"No\"))","v":"Yes"},null,"",null,{"$f":"IF(VLOOKUP(A150,Usability!$A$12:$C$31,3,FALSE)=\"NA\", 0, IFERROR(VLOOKUP(C150,$Q$3:$R$6, 2, FALSE),\"N/A\"))","v":"N/A"},"N/A",null,{"$f":"IF(VLOOKUP(A150,Quality!$A$13:$H$32,8,FALSE)=\"NA\", 0, IFERROR(VLOOKUP(C150,$Q$3:$R$6, 2, FALSE),\"N/A\"))","v":"N/A"},"N/A"]
["S11",{"$f":"\"Data: \"& VLOOKUP(A151,Configuration!$B$33:$C$52,2,FALSE)","v":"Data: "},"Answer","clearRow",{"$f":"IF(E150=\"Yes\", \"Yes\", IF(VLOOKUP(A151,Configuration!$B$33:$C$52,2,FALSE)=0, \"Yes\", \"No\"))","v":"Yes"},null,"",null,{"$f":"IF(VLOOKUP(A151,Usability!$A$12:$C$31,3,FALSE)=\"NA\", 0, IFERROR(VLOOKUP(C151,$Q$3:$R$6, 2, FALSE),\"N/A\"))","v":"N/A"},"N/A",null,{"$f":"IF(VLOOKUP(A151,Quality!$A$13:$H$32,8,FALSE)=\"NA\", 0, IFERROR(VLOOKUP(C151,$Q$3:$R$6, 2, FALSE),\"N/A\"))","v":"N/A"},"N/A"]
["S12",{"$f":"\"Data: \"& VLOOKUP(A152,Configuration!$B$33:$C$52,2,FALSE)","v":"Data: "},"Answer","clearRow",{"$f":"IF(E151=\"Yes\", \"Yes\", IF(VLOOKUP(A152,Configuration!$B$33:$C$52,2,FALSE)=0, \"Yes\", \"No\"))","v":"Yes"},null,"",null,{"$f":"IF(VLOOKUP(A152,Usability!$A$12:$C$31,3,FALSE)=\"NA\", 0, IFERROR(VLOOKUP(C152,$Q$3:$R$6, 2, FALSE),\"N/A\"))","v":"N/A"},"N/A",null,{"$f":"IF(VLOOKUP(A152,Quality!$A$13:$H$32,8,FALSE)=\"NA\", 0, IFERROR(VLOOKUP(C152,$Q$3:$R$6, 2, FALSE),\"N/A\"))","v":"N/A"},"N/A"]
["S13",{"$f":"\"Data: \"& VLOOKUP(A153,Configuration!$B$33:$C$52,2,FALSE)","v":"Data: "},"Answer","clearRow",{"$f":"IF(E152=\"Yes\", \"Yes\", IF(VLOOKUP(A153,Configuration!$B$33:$C$52,2,FALSE)=0, \"Yes\", \"No\"))","v":"Yes"},null,"",null,{"$f":"IF(VLOOKUP(A153,Usability!$A$12:$C$31,3,FALSE)=\"NA\", 0, IFERROR(VLOOKUP(C153,$Q$3:$R$6, 2, FALSE),\"N/A\"))","v":"N/A"},"N/A",null,{"$f":"IF(VLOOKUP(A153,Quality!$A$13:$H$32,8,FALSE)=\"NA\", 0, IFERROR(VLOOKUP(C153,$Q$3:$R$6, 2, FALSE),\"N/A\"))","v":"N/A"},"N/A"]
["S14",{"$f":"\"Data: \"& VLOOKUP(A154,Configuration!$B$33:$C$52,2,FALSE)","v":"Data: "},"Answer","clearRow",{"$f":"IF(E153=\"Yes\", \"Yes\", IF(VLOOKUP(A154,Configuration!$B$33:$C$52,2,FALSE)=0, \"Yes\", \"No\"))","v":"Yes"},null,"",null,{"$f":"IF(VLOOKUP(A154,Usability!$A$12:$C$31,3,FALSE)=\"NA\", 0, IFERROR(VLOOKUP(C154,$Q$3:$R$6, 2, FALSE),\"N/A\"))","v":"N/A"},"N/A",null,{"$f":"IF(VLOOKUP(A154,Quality!$A$13:$H$32,8,FALSE)=\"NA\", 0, IFERROR(VLOOKUP(C154,$Q$3:$R$6, 2, FALSE),\"N/A\"))","v":"N/A"},"N/A"]
["S15",{"$f":"\"Data: \"& VLOOKUP(A155,Configuration!$B$33:$C$52,2,FALSE)","v":"Data: "},"Answer","clearRow",{"$f":"IF(E154=\"Yes\", \"Yes\", IF(VLOOKUP(A155,Configuration!$B$33:$C$52,2,FALSE)=0, \"Yes\", \"No\"))","v":"Yes"},null,"",null,{"$f":"IF(VLOOKUP(A155,Usability!$A$12:$C$31,3,FALSE)=\"NA\", 0, IFERROR(VLOOKUP(C155,$Q$3:$R$6, 2, FALSE),\"N/A\"))","v":"N/A"},"N/A",null,{"$f":"IF(VLOOKUP(A155,Quality!$A$13:$H$32,8,FALSE)=\"NA\", 0, IFERROR(VLOOKUP(C155,$Q$3:$R$6, 2, FALSE),\"N/A\"))","v":"N/A"},"N/A"]
["S16",{"$f":"\"Data: \"& VLOOKUP(A156,Configuration!$B$33:$C$52,2,FALSE)","v":"Data: "},"Answer","clearRow",{"$f":"IF(E155=\"Yes\", \"Yes\", IF(VLOOKUP(A156,Configuration!$B$33:$C$52,2,FALSE)=0, \"Yes\", \"No\"))","v":"Yes"},null,"",null,{"$f":"IF(VLOOKUP(A156,Usability!$A$12:$C$31,3,FALSE)=\"NA\", 0, IFERROR(VLOOKUP(C156,$Q$3:$R$6, 2, FALSE),\"N/A\"))","v":"N/A"},"N/A",null,{"$f":"IF(VLOOKUP(A156,Quality!$A$13:$H$32,8,FALSE)=\"NA\", 0, IFERROR(VLOOKUP(C156,$Q$3:$R$6, 2, FALSE),\"N/A\"))","v":"N/A"},"N/A"]
["S17",{"$f":"\"Data: \"& VLOOKUP(A157,Configuration!$B$33:$C$52,2,FALSE)","v":"Data: "},"Answer","clearRow",{"$f":"IF(E156=\"Yes\", \"Yes\", IF(VLOOKUP(A157,Configuration!$B$33:$C$52,2,FALSE)=0, \"Yes\", \"No\"))","v":"Yes"},null,"",null,{"$f":"IF(VLOOKUP(A157,Usability!$A$12:$C$31,3,FALSE)=\"NA\", 0, IFERROR(VLOOKUP(C157,$Q$3:$R$6, 2, FALSE),\"N/A\"))","v":"N/A"},"N/A",null,{"$f":"IF(VLOOKUP(A157,Quality!$A$13:$H$32,8,FALSE)=\"NA\", 0, IFERROR(VLOOKUP(C157,$Q$3:$R$6, 2, FALSE),\"N/A\"))","v":"N/A"},"N/A"]
["S18",{"$f":"\"Data: \"& VLOOKUP(A158,Configuration!$B$33:$C$52,2,FALSE)","v":"Data: "},"Answer","clearRow",{"$f":"IF(E157=\"Yes\", \"Yes\", IF(VLOOKUP(A158,Configuration!$B$33:$C$52,2,FALSE)=0, \"Yes\", \"No\"))","v":"Yes"},null,"",null,{"$f":"IF(VLOOKUP(A158,Usability!$A$12:$C$31,3,FALSE)=\"NA\", 0, IFERROR(VLOOKUP(C158,$Q$3:$R$6, 2, FALSE),\"N/A\"))","v":"N/A"},"N/A",null,{"$f":"IF(VLOOKUP(A158,Quality!$A$13:$H$32,8,FALSE)=\"NA\", 0, IFERROR(VLOOKUP(C158,$Q$3:$R$6, 2, FALSE),\"N/A\"))","v":"N/A"},"N/A"]
["S19",{"$f":"\"Data: \"& VLOOKUP(A159,Configuration!$B$33:$C$52,2,FALSE)","v":"Data: "},"Answer","clearRow",{"$f":"IF(E158=\"Yes\", \"Yes\", IF(VLOOKUP(A159,Configuration!$B$33:$C$52,2,FALSE)=0, \"Yes\", \"No\"))","v":"Yes"},null,"",null,{"$f":"IF(VLOOKUP(A159,Usability!$A$12:$C$31,3,FALSE)=\"NA\", 0, IFERROR(VLOOKUP(C159,$Q$3:$R$6, 2, FALSE),\"N/A\"))","v":"N/A"},"N/A",null,{"$f":"IF(VLOOKUP(A159,Quality!$A$13:$H$32,8,FALSE)=\"NA\", 0, IFERROR(VLOOKUP(C159,$Q$3:$R$6, 2, FALSE),\"N/A\"))","v":"N/A"},"N/A"]
["S20",{"$f":"\"Data: \"& VLOOKUP(A160,Configuration!$B$33:$C$52,2,FALSE)","v":"Data: "},"Answer","clearRow",{"$f":"IF(E159=\"Yes\", \"Yes\", IF(VLOOKUP(A160,Configuration!$B$33:$C$52,2,FALSE)=0, \"Yes\", \"No\"))","v":"Yes"},null,"",null,{"$f":"IF(VLOOKUP(A160,Usability!$A$12:$C$31,3,FALSE)=\"NA\", 0, IFERROR(VLOOKUP(C160,$Q$3:$R$6, 2, FALSE),\"N/A\"))","v":"N/A"},"N/A",null,{"$f":"IF(VLOOKUP(A160,Quality!$A$13:$H$32,8,FALSE)=\"NA\", 0, IFERROR(VLOOKUP(C160,$Q$3:$R$6, 2, FALSE),\"N/A\"))","v":"N/A"},"N/A"]
[null,null,null,null,{"$f":"IF(E140=\"Yes\", \"Yes\", \"No\")","v":"Yes"}]
[null,"Comments:",null,null,{"$f":"IF(E140=\"Yes\", \"Yes\", \"No\")","v":"Yes"}]
[null,null,null,null,{"$f":"IF(E140=\"Yes\", \"Yes\", \"No\")","v":"Yes"}]
[null,null,null,null,{"$f":"IF(E139=\"Yes\", \"Yes\", \"No\")","v":"No"}]
[null,null,null,null,{"$f":"IF(E140=\"Yes\", \"Yes\", \"No\")","v":"Yes"}]
["A7",{"$f":"\"Activity: \"& VLOOKUP(A166,Configuration!$B$11:$C$30,2, FALSE)","v":"Activity: "},"Importance Rating",null,{"$f":"IF(VLOOKUP(A166,Configuration!$B$11:$C$30,2,FALSE)=0,\"Yes\", \"No\")","v":"Yes"},null,null,null,{"$f":"SUM(I167:I186)","v":0},null,{"$f":"IF(OR(Progress4<>1, COUNT(G167:G186)<>COUNTIF(E167:E186,\"=No\")),\"\",SUMPRODUCT(J167:J186,Usability!$F$12:$F$31))","v":""},{"$f":"SUM(L167:L186)","v":0},null,{"$f":"IF(OR(Progress3<>1, COUNT(G167:G186)<>COUNTIF(E167:E186,\"=No\")),\"\",SUMPRODUCT(M167:M186,Quality!$H$13:$H$32))","v":""}]
["S1",{"$f":"\"Data: \"& VLOOKUP(A167,Configuration!$B$33:$C$52,2,FALSE)","v":"Data: Pavement Distress, Rutting and Roughness"},"Answer","clearRow",{"$f":"IF(E166=\"Yes\", \"Yes\", IF(VLOOKUP(A167,Configuration!$B$33:$C$52,2,FALSE)=0, \"Yes\", \"No\"))","v":"Yes"},null,{"$f":"IF(C167<>\"Answer\",1,\"\")","v":""},null,{"$f":"IF(VLOOKUP(A167,Usability!$A$12:$C$31,3,FALSE)=\"NA\", 0, IFERROR(VLOOKUP(C167,$Q$3:$R$6, 2, FALSE),\"N/A\"))","v":"N/A"},{"$f":"IFERROR(I167/$I$166,\"N/A\")","v":"N/A"},null,{"$f":"IF(VLOOKUP(A167,Quality!$A$13:$H$32,8,FALSE)=\"NA\", 0, IFERROR(VLOOKUP(C167,$Q$3:$R$6, 2, FALSE),\"N/A\"))","v":"N/A"},{"$f":"IFERROR(L167/$L$166,\"N/A\")","v":"N/A"}]
["S2",{"$f":"\"Data: \"& VLOOKUP(A168,Configuration!$B$33:$C$52,2,FALSE)","v":"Data: Linear Referencing (routes, intersections, mileposts)"},"Answer","clearRow",{"$f":"IF(E167=\"Yes\", \"Yes\", IF(VLOOKUP(A168,Configuration!$B$33:$C$52,2,FALSE)=0, \"Yes\", \"No\"))","v":"Yes"},null,"",null,{"$f":"IF(VLOOKUP(A168,Usability!$A$12:$C$31,3,FALSE)=\"NA\", 0, IFERROR(VLOOKUP(C168,$Q$3:$R$6, 2, FALSE),\"N/A\"))","v":"N/A"},{"$f":"IFERROR(I168/$I$166,\"N/A\")","v":"N/A"},null,{"$f":"IF(VLOOKUP(A168,Quality!$A$13:$H$32,8,FALSE)=\"NA\", 0, IFERROR(VLOOKUP(C168,$Q$3:$R$6, 2, FALSE),\"N/A\"))","v":"N/A"},"N/A"]
["S3",{"$f":"\"Data: \"& VLOOKUP(A169,Configuration!$B$33:$C$52,2,FALSE)","v":"Data: Traffic - AADT, Trucks, ESALS"},"Answer","clearRow",{"$f":"IF(E168=\"Yes\", \"Yes\", IF(VLOOKUP(A169,Configuration!$B$33:$C$52,2,FALSE)=0, \"Yes\", \"No\"))","v":"Yes"},null,"",null,{"$f":"IF(VLOOKUP(A169,Usability!$A$12:$C$31,3,FALSE)=\"NA\", 0, IFERROR(VLOOKUP(C169,$Q$3:$R$6, 2, FALSE),\"N/A\"))","v":"N/A"},"N/A",null,{"$f":"IF(VLOOKUP(A169,Quality!$A$13:$H$32,8,FALSE)=\"NA\", 0, IFERROR(VLOOKUP(C169,$Q$3:$R$6, 2, FALSE),\"N/A\"))","v":"N/A"},"N/A"]
["S4",{"$f":"\"Data: \"& VLOOKUP(A170,Configuration!$B$33:$C$52,2,FALSE)","v":"Data: Pavement Structure Characteristics"},"Answer","clearRow",{"$f":"IF(E169=\"Yes\", \"Yes\", IF(VLOOKUP(A170,Configuration!$B$33:$C$52,2,FALSE)=0, \"Yes\", \"No\"))","v":"Yes"},null,"",null,{"$f":"IF(VLOOKUP(A170,Usability!$A$12:$C$31,3,FALSE)=\"NA\", 0, IFERROR(VLOOKUP(C170,$Q$3:$R$6, 2, FALSE),\"N/A\"))","v":"N/A"},"N/A",null,{"$f":"IF(VLOOKUP(A170,Quality!$A$13:$H$32,8,FALSE)=\"NA\", 0, IFERROR(VLOOKUP(C170,$Q$3:$R$6, 2, FALSE),\"N/A\"))","v":"N/A"},"N/A"]
["S5",{"$f":"\"Data: \"& VLOOKUP(A171,Configuration!$B$33:$C$52,2,FALSE)","v":"Data: Road Inventory: # Lanes, Functional Class"},"Answer","clearRow",{"$f":"IF(E170=\"Yes\", \"Yes\", IF(VLOOKUP(A171,Configuration!$B$33:$C$52,2,FALSE)=0, \"Yes\", \"No\"))","v":"Yes"},null,"",null,{"$f":"IF(VLOOKUP(A171,Usability!$A$12:$C$31,3,FALSE)=\"NA\", 0, IFERROR(VLOOKUP(C171,$Q$3:$R$6, 2, FALSE),\"N/A\"))","v":"N/A"},"N/A",null,{"$f":"IF(VLOOKUP(A171,Quality!$A$13:$H$32,8,FALSE)=\"NA\", 0, IFERROR(VLOOKUP(C171,$Q$3:$R$6, 2, FALSE),\"N/A\"))","v":"N/A"},"N/A"]
["S6",{"$f":"\"Data: \"& VLOOKUP(A172,Configuration!$B$33:$C$52,2,FALSE)","v":"Data: "},"Answer","clearRow",{"$f":"IF(E171=\"Yes\", \"Yes\", IF(VLOOKUP(A172,Configuration!$B$33:$C$52,2,FALSE)=0, \"Yes\", \"No\"))","v":"Yes"},null,"",null,{"$f":"IF(VLOOKUP(A172,Usability!$A$12:$C$31,3,FALSE)=\"NA\", 0, IFERROR(VLOOKUP(C172,$Q$3:$R$6, 2, FALSE),\"N/A\"))","v":"N/A"},"N/A",null,{"$f":"IF(VLOOKUP(A172,Quality!$A$13:$H$32,8,FALSE)=\"NA\", 0, IFERROR(VLOOKUP(C172,$Q$3:$R$6, 2, FALSE),\"N/A\"))","v":"N/A"},"N/A"]
["S7",{"$f":"\"Data: \"& VLOOKUP(A173,Configuration!$B$33:$C$52,2,FALSE)","v":"Data: "},"Answer","clearRow",{"$f":"IF(E172=\"Yes\", \"Yes\", IF(VLOOKUP(A173,Configuration!$B$33:$C$52,2,FALSE)=0, \"Yes\", \"No\"))","v":"Yes"},null,"",null,{"$f":"IF(VLOOKUP(A173,Usability!$A$12:$C$31,3,FALSE)=\"NA\", 0, IFERROR(VLOOKUP(C173,$Q$3:$R$6, 2, FALSE),\"N/A\"))","v":"N/A"},"N/A",null,{"$f":"IF(VLOOKUP(A173,Quality!$A$13:$H$32,8,FALSE)=\"NA\", 0, IFERROR(VLOOKUP(C173,$Q$3:$R$6, 2, FALSE),\"N/A\"))","v":"N/A"},"N/A"]
["S8",{"$f":"\"Data: \"& VLOOKUP(A174,Configuration!$B$33:$C$52,2,FALSE)","v":"Data: "},"Answer","clearRow",{"$f":"IF(E173=\"Yes\", \"Yes\", IF(VLOOKUP(A174,Configuration!$B$33:$C$52,2,FALSE)=0, \"Yes\", \"No\"))","v":"Yes"},null,"",null,{"$f":"IF(VLOOKUP(A174,Usability!$A$12:$C$31,3,FALSE)=\"NA\", 0, IFERROR(VLOOKUP(C174,$Q$3:$R$6, 2, FALSE),\"N/A\"))","v":"N/A"},"N/A",null,{"$f":"IF(VLOOKUP(A174,Quality!$A$13:$H$32,8,FALSE)=\"NA\", 0, IFERROR(VLOOKUP(C174,$Q$3:$R$6, 2, FALSE),\"N/A\"))","v":"N/A"},"N/A"]
["S9",{"$f":"\"Data: \"& VLOOKUP(A175,Configuration!$B$33:$C$52,2,FALSE)","v":"Data: "},"Answer","clearRow",{"$f":"IF(E174=\"Yes\", \"Yes\", IF(VLOOKUP(A175,Configuration!$B$33:$C$52,2,FALSE)=0, \"Yes\", \"No\"))","v":"Yes"},null,"",null,{"$f":"IF(VLOOKUP(A175,Usability!$A$12:$C$31,3,FALSE)=\"NA\", 0, IFERROR(VLOOKUP(C175,$Q$3:$R$6, 2, FALSE),\"N/A\"))","v":"N/A"},"N/A",null,{"$f":"IF(VLOOKUP(A175,Quality!$A$13:$H$32,8,FALSE)=\"NA\", 0, IFERROR(VLOOKUP(C175,$Q$3:$R$6, 2, FALSE),\"N/A\"))","v":"N/A"},"N/A"]
["S10",{"$f":"\"Data: \"& VLOOKUP(A176,Configuration!$B$33:$C$52,2,FALSE)","v":"Data: "},"Answer","clearRow",{"$f":"IF(E175=\"Yes\", \"Yes\", IF(VLOOKUP(A176,Configuration!$B$33:$C$52,2,FALSE)=0, \"Yes\", \"No\"))","v":"Yes"},null,"",null,{"$f":"IF(VLOOKUP(A176,Usability!$A$12:$C$31,3,FALSE)=\"NA\", 0, IFERROR(VLOOKUP(C176,$Q$3:$R$6, 2, FALSE),\"N/A\"))","v":"N/A"},"N/A",null,{"$f":"IF(VLOOKUP(A176,Quality!$A$13:$H$32,8,FALSE)=\"NA\", 0, IFERROR(VLOOKUP(C176,$Q$3:$R$6, 2, FALSE),\"N/A\"))","v":"N/A"},"N/A"]
["S11",{"$f":"\"Data: \"& VLOOKUP(A177,Configuration!$B$33:$C$52,2,FALSE)","v":"Data: "},"Answer","clearRow",{"$f":"IF(E176=\"Yes\", \"Yes\", IF(VLOOKUP(A177,Configuration!$B$33:$C$52,2,FALSE)=0, \"Yes\", \"No\"))","v":"Yes"},null,"",null,{"$f":"IF(VLOOKUP(A177,Usability!$A$12:$C$31,3,FALSE)=\"NA\", 0, IFERROR(VLOOKUP(C177,$Q$3:$R$6, 2, FALSE),\"N/A\"))","v":"N/A"},"N/A",null,{"$f":"IF(VLOOKUP(A177,Quality!$A$13:$H$32,8,FALSE)=\"NA\", 0, IFERROR(VLOOKUP(C177,$Q$3:$R$6, 2, FALSE),\"N/A\"))","v":"N/A"},"N/A"]
["S12",{"$f":"\"Data: \"& VLOOKUP(A178,Configuration!$B$33:$C$52,2,FALSE)","v":"Data: "},"Answer","clearRow",{"$f":"IF(E177=\"Yes\", \"Yes\", IF(VLOOKUP(A178,Configuration!$B$33:$C$52,2,FALSE)=0, \"Yes\", \"No\"))","v":"Yes"},null,"",null,{"$f":"IF(VLOOKUP(A178,Usability!$A$12:$C$31,3,FALSE)=\"NA\", 0, IFERROR(VLOOKUP(C178,$Q$3:$R$6, 2, FALSE),\"N/A\"))","v":"N/A"},"N/A",null,{"$f":"IF(VLOOKUP(A178,Quality!$A$13:$H$32,8,FALSE)=\"NA\", 0, IFERROR(VLOOKUP(C178,$Q$3:$R$6, 2, FALSE),\"N/A\"))","v":"N/A"},"N/A"]
["S13",{"$f":"\"Data: \"& VLOOKUP(A179,Configuration!$B$33:$C$52,2,FALSE)","v":"Data: "},"Answer","clearRow",{"$f":"IF(E178=\"Yes\", \"Yes\", IF(VLOOKUP(A179,Configuration!$B$33:$C$52,2,FALSE)=0, \"Yes\", \"No\"))","v":"Yes"},null,"",null,{"$f":"IF(VLOOKUP(A179,Usability!$A$12:$C$31,3,FALSE)=\"NA\", 0, IFERROR(VLOOKUP(C179,$Q$3:$R$6, 2, FALSE),\"N/A\"))","v":"N/A"},"N/A",null,{"$f":"IF(VLOOKUP(A179,Quality!$A$13:$H$32,8,FALSE)=\"NA\", 0, IFERROR(VLOOKUP(C179,$Q$3:$R$6, 2, FALSE),\"N/A\"))","v":"N/A"},"N/A"]
["S14",{"$f":"\"Data: \"& VLOOKUP(A180,Configuration!$B$33:$C$52,2,FALSE)","v":"Data: "},"Answer","clearRow",{"$f":"IF(E179=\"Yes\", \"Yes\", IF(VLOOKUP(A180,Configuration!$B$33:$C$52,2,FALSE)=0, \"Yes\", \"No\"))","v":"Yes"},null,"",null,{"$f":"IF(VLOOKUP(A180,Usability!$A$12:$C$31,3,FALSE)=\"NA\", 0, IFERROR(VLOOKUP(C180,$Q$3:$R$6, 2, FALSE),\"N/A\"))","v":"N/A"},"N/A",null,{"$f":"IF(VLOOKUP(A180,Quality!$A$13:$H$32,8,FALSE)=\"NA\", 0, IFERROR(VLOOKUP(C180,$Q$3:$R$6, 2, FALSE),\"N/A\"))","v":"N/A"},"N/A"]
["S15",{"$f":"\"Data: \"& VLOOKUP(A181,Configuration!$B$33:$C$52,2,FALSE)","v":"Data: "},"Answer","clearRow",{"$f":"IF(E180=\"Yes\", \"Yes\", IF(VLOOKUP(A181,Configuration!$B$33:$C$52,2,FALSE)=0, \"Yes\", \"No\"))","v":"Yes"},null,"",null,{"$f":"IF(VLOOKUP(A181,Usability!$A$12:$C$31,3,FALSE)=\"NA\", 0, IFERROR(VLOOKUP(C181,$Q$3:$R$6, 2, FALSE),\"N/A\"))","v":"N/A"},"N/A",null,{"$f":"IF(VLOOKUP(A181,Quality!$A$13:$H$32,8,FALSE)=\"NA\", 0, IFERROR(VLOOKUP(C181,$Q$3:$R$6, 2, FALSE),\"N/A\"))","v":"N/A"},"N/A"]
["S16",{"$f":"\"Data: \"& VLOOKUP(A182,Configuration!$B$33:$C$52,2,FALSE)","v":"Data: "},"Answer","clearRow",{"$f":"IF(E181=\"Yes\", \"Yes\", IF(VLOOKUP(A182,Configuration!$B$33:$C$52,2,FALSE)=0, \"Yes\", \"No\"))","v":"Yes"},null,"",null,{"$f":"IF(VLOOKUP(A182,Usability!$A$12:$C$31,3,FALSE)=\"NA\", 0, IFERROR(VLOOKUP(C182,$Q$3:$R$6, 2, FALSE),\"N/A\"))","v":"N/A"},"N/A",null,{"$f":"IF(VLOOKUP(A182,Quality!$A$13:$H$32,8,FALSE)=\"NA\", 0, IFERROR(VLOOKUP(C182,$Q$3:$R$6, 2, FALSE),\"N/A\"))","v":"N/A"},"N/A"]
["S17",{"$f":"\"Data: \"& VLOOKUP(A183,Configuration!$B$33:$C$52,2,FALSE)","v":"Data: "},"Answer","clearRow",{"$f":"IF(E182=\"Yes\", \"Yes\", IF(VLOOKUP(A183,Configuration!$B$33:$C$52,2,FALSE)=0, \"Yes\", \"No\"))","v":"Yes"},null,"",null,{"$f":"IF(VLOOKUP(A183,Usability!$A$12:$C$31,3,FALSE)=\"NA\", 0, IFERROR(VLOOKUP(C183,$Q$3:$R$6, 2, FALSE),\"N/A\"))","v":"N/A"},"N/A",null,{"$f":"IF(VLOOKUP(A183,Quality!$A$13:$H$32,8,FALSE)=\"NA\", 0, IFERROR(VLOOKUP(C183,$Q$3:$R$6, 2, FALSE),\"N/A\"))","v":"N/A"},"N/A"]
["S18",{"$f":"\"Data: \"& VLOOKUP(A184,Configuration!$B$33:$C$52,2,FALSE)","v":"Data: "},"Answer","clearRow",{"$f":"IF(E183=\"Yes\", \"Yes\", IF(VLOOKUP(A184,Configuration!$B$33:$C$52,2,FALSE)=0, \"Yes\", \"No\"))","v":"Yes"},null,"",null,{"$f":"IF(VLOOKUP(A184,Usability!$A$12:$C$31,3,FALSE)=\"NA\", 0, IFERROR(VLOOKUP(C184,$Q$3:$R$6, 2, FALSE),\"N/A\"))","v":"N/A"},"N/A",null,{"$f":"IF(VLOOKUP(A184,Quality!$A$13:$H$32,8,FALSE)=\"NA\", 0, IFERROR(VLOOKUP(C184,$Q$3:$R$6, 2, FALSE),\"N/A\"))","v":"N/A"},"N/A"]
["S19",{"$f":"\"Data: \"& VLOOKUP(A185,Configuration!$B$33:$C$52,2,FALSE)","v":"Data: "},"Answer","clearRow",{"$f":"IF(E184=\"Yes\", \"Yes\", IF(VLOOKUP(A185,Configuration!$B$33:$C$52,2,FALSE)=0, \"Yes\", \"No\"))","v":"Yes"},null,"",null,{"$f":"IF(VLOOKUP(A185,Usability!$A$12:$C$31,3,FALSE)=\"NA\", 0, IFERROR(VLOOKUP(C185,$Q$3:$R$6, 2, FALSE),\"N/A\"))","v":"N/A"},"N/A",null,{"$f":"IF(VLOOKUP(A185,Quality!$A$13:$H$32,8,FALSE)=\"NA\", 0, IFERROR(VLOOKUP(C185,$Q$3:$R$6, 2, FALSE),\"N/A\"))","v":"N/A"},"N/A"]
["S20",{"$f":"\"Data: \"& VLOOKUP(A186,Configuration!$B$33:$C$52,2,FALSE)","v":"Data: "},"Answer","clearRow",{"$f":"IF(E185=\"Yes\", \"Yes\", IF(VLOOKUP(A186,Configuration!$B$33:$C$52,2,FALSE)=0, \"Yes\", \"No\"))","v":"Yes"},null,"",null,{"$f":"IF(VLOOKUP(A186,Usability!$A$12:$C$31,3,FALSE)=\"NA\", 0, IFERROR(VLOOKUP(C186,$Q$3:$R$6, 2, FALSE),\"N/A\"))","v":"N/A"},"N/A",null,{"$f":"IF(VLOOKUP(A186,Quality!$A$13:$H$32,8,FALSE)=\"NA\", 0, IFERROR(VLOOKUP(C186,$Q$3:$R$6, 2, FALSE),\"N/A\"))","v":"N/A"},"N/A"]
[null,null,null,null,{"$f":"IF(E166=\"Yes\", \"Yes\", \"No\")","v":"Yes"}]
[null,"Comments:",null,null,{"$f":"IF(E166=\"Yes\", \"Yes\", \"No\")","v":"Yes"}]
[null,null,null,null,{"$f":"IF(E166=\"Yes\", \"Yes\", \"No\")","v":"Yes"}]
[null,null,null,null,{"$f":"IF(E165=\"Yes\", \"Yes\", \"No\")","v":"Yes"}]
[null,null,null,null,{"$f":"IF(E166=\"Yes\", \"Yes\", \"No\")","v":"Yes"}]
["A8",{"$f":"\"Activity: \"& VLOOKUP(A192,Configuration!$B$11:$C$30,2, FALSE)","v":"Activity: "},"Importance Rating",null,{"$f":"IF(VLOOKUP(A192,Configuration!$B$11:$C$30,2,FALSE)=0,\"Yes\", \"No\")","v":"Yes"},null,null,null,{"$f":"SUM(I193:I212)","v":0},null,{"$f":"IF(OR(Progress4<>1, COUNT(G193:G212)<>COUNTIF(E193:E212,\"=No\")),\"\",SUMPRODUCT(J193:J212,Usability!$F$12:$F$31))","v":""},{"$f":"SUM(L193:L212)","v":0},null,{"$f":"IF(OR(Progress3<>1, COUNT(G193:G212)<>COUNTIF(E193:E212,\"=No\")),\"\",SUMPRODUCT(M193:M212,Quality!$H$13:$H$32))","v":""}]
["S1",{"$f":"\"Data: \"& VLOOKUP(A193,Configuration!$B$33:$C$52,2,FALSE)","v":"Data: Pavement Distress, Rutting and Roughness"},"Answer","clearRow",{"$f":"IF(E192=\"Yes\", \"Yes\", IF(VLOOKUP(A193,Configuration!$B$33:$C$52,2,FALSE)=0, \"Yes\", \"No\"))","v":"Yes"},null,{"$f":"IF(C193<>\"Answer\",1,\"\")","v":""},null,{"$f":"IF(VLOOKUP(A193,Usability!$A$12:$C$31,3,FALSE)=\"NA\", 0, IFERROR(VLOOKUP(C193,$Q$3:$R$6, 2, FALSE),\"N/A\"))","v":"N/A"},{"$f":"IFERROR(I193/$I$192,\"N/A\")","v":"N/A"},null,{"$f":"IF(VLOOKUP(A193,Quality!$A$13:$H$32,8,FALSE)=\"NA\", 0, IFERROR(VLOOKUP(C193,$Q$3:$R$6, 2, FALSE),\"N/A\"))","v":"N/A"},{"$f":"IFERROR(L193/$L$192,\"N/A\")","v":"N/A"}]
["S2",{"$f":"\"Data: \"& VLOOKUP(A194,Configuration!$B$33:$C$52,2,FALSE)","v":"Data: Linear Referencing (routes, intersections, mileposts)"},"Answer","clearRow",{"$f":"IF(E193=\"Yes\", \"Yes\", IF(VLOOKUP(A194,Configuration!$B$33:$C$52,2,FALSE)=0, \"Yes\", \"No\"))","v":"Yes"},null,"",null,{"$f":"IF(VLOOKUP(A194,Usability!$A$12:$C$31,3,FALSE)=\"NA\", 0, IFERROR(VLOOKUP(C194,$Q$3:$R$6, 2, FALSE),\"N/A\"))","v":"N/A"},{"$f":"IFERROR(I194/$I$192,\"N/A\")","v":"N/A"},null,{"$f":"IF(VLOOKUP(A194,Quality!$A$13:$H$32,8,FALSE)=\"NA\", 0, IFERROR(VLOOKUP(C194,$Q$3:$R$6, 2, FALSE),\"N/A\"))","v":"N/A"},"N/A"]
["S3",{"$f":"\"Data: \"& VLOOKUP(A195,Configuration!$B$33:$C$52,2,FALSE)","v":"Data: Traffic - AADT, Trucks, ESALS"},"Answer","clearRow",{"$f":"IF(E194=\"Yes\", \"Yes\", IF(VLOOKUP(A195,Configuration!$B$33:$C$52,2,FALSE)=0, \"Yes\", \"No\"))","v":"Yes"},null,"",null,{"$f":"IF(VLOOKUP(A195,Usability!$A$12:$C$31,3,FALSE)=\"NA\", 0, IFERROR(VLOOKUP(C195,$Q$3:$R$6, 2, FALSE),\"N/A\"))","v":"N/A"},"N/A",null,{"$f":"IF(VLOOKUP(A195,Quality!$A$13:$H$32,8,FALSE)=\"NA\", 0, IFERROR(VLOOKUP(C195,$Q$3:$R$6, 2, FALSE),\"N/A\"))","v":"N/A"},"N/A"]
["S4",{"$f":"\"Data: \"& VLOOKUP(A196,Configuration!$B$33:$C$52,2,FALSE)","v":"Data: Pavement Structure Characteristics"},"Answer","clearRow",{"$f":"IF(E195=\"Yes\", \"Yes\", IF(VLOOKUP(A196,Configuration!$B$33:$C$52,2,FALSE)=0, \"Yes\", \"No\"))","v":"Yes"},null,"",null,{"$f":"IF(VLOOKUP(A196,Usability!$A$12:$C$31,3,FALSE)=\"NA\", 0, IFERROR(VLOOKUP(C196,$Q$3:$R$6, 2, FALSE),\"N/A\"))","v":"N/A"},"N/A",null,{"$f":"IF(VLOOKUP(A196,Quality!$A$13:$H$32,8,FALSE)=\"NA\", 0, IFERROR(VLOOKUP(C196,$Q$3:$R$6, 2, FALSE),\"N/A\"))","v":"N/A"},"N/A"]
["S5",{"$f":"\"Data: \"& VLOOKUP(A197,Configuration!$B$33:$C$52,2,FALSE)","v":"Data: Road Inventory: # Lanes, Functional Class"},"Answer","clearRow",{"$f":"IF(E196=\"Yes\", \"Yes\", IF(VLOOKUP(A197,Configuration!$B$33:$C$52,2,FALSE)=0, \"Yes\", \"No\"))","v":"Yes"},null,"",null,{"$f":"IF(VLOOKUP(A197,Usability!$A$12:$C$31,3,FALSE)=\"NA\", 0, IFERROR(VLOOKUP(C197,$Q$3:$R$6, 2, FALSE),\"N/A\"))","v":"N/A"},"N/A",null,{"$f":"IF(VLOOKUP(A197,Quality!$A$13:$H$32,8,FALSE)=\"NA\", 0, IFERROR(VLOOKUP(C197,$Q$3:$R$6, 2, FALSE),\"N/A\"))","v":"N/A"},"N/A"]
["S6",{"$f":"\"Data: \"& VLOOKUP(A198,Configuration!$B$33:$C$52,2,FALSE)","v":"Data: "},"Answer","clearRow",{"$f":"IF(E197=\"Yes\", \"Yes\", IF(VLOOKUP(A198,Configuration!$B$33:$C$52,2,FALSE)=0, \"Yes\", \"No\"))","v":"Yes"},null,"",null,{"$f":"IF(VLOOKUP(A198,Usability!$A$12:$C$31,3,FALSE)=\"NA\", 0, IFERROR(VLOOKUP(C198,$Q$3:$R$6, 2, FALSE),\"N/A\"))","v":"N/A"},"N/A",null,{"$f":"IF(VLOOKUP(A198,Quality!$A$13:$H$32,8,FALSE)=\"NA\", 0, IFERROR(VLOOKUP(C198,$Q$3:$R$6, 2, FALSE),\"N/A\"))","v":"N/A"},"N/A"]
["S7",{"$f":"\"Data: \"& VLOOKUP(A199,Configuration!$B$33:$C$52,2,FALSE)","v":"Data: "},"Answer","clearRow",{"$f":"IF(E198=\"Yes\", \"Yes\", IF(VLOOKUP(A199,Configuration!$B$33:$C$52,2,FALSE)=0, \"Yes\", \"No\"))","v":"Yes"},null,"",null,{"$f":"IF(VLOOKUP(A199,Usability!$A$12:$C$31,3,FALSE)=\"NA\", 0, IFERROR(VLOOKUP(C199,$Q$3:$R$6, 2, FALSE),\"N/A\"))","v":"N/A"},"N/A",null,{"$f":"IF(VLOOKUP(A199,Quality!$A$13:$H$32,8,FALSE)=\"NA\", 0, IFERROR(VLOOKUP(C199,$Q$3:$R$6, 2, FALSE),\"N/A\"))","v":"N/A"},"N/A"]
["S8",{"$f":"\"Data: \"& VLOOKUP(A200,Configuration!$B$33:$C$52,2,FALSE)","v":"Data: "},"Answer","clearRow",{"$f":"IF(E199=\"Yes\", \"Yes\", IF(VLOOKUP(A200,Configuration!$B$33:$C$52,2,FALSE)=0, \"Yes\", \"No\"))","v":"Yes"},null,"",null,{"$f":"IF(VLOOKUP(A200,Usability!$A$12:$C$31,3,FALSE)=\"NA\", 0, IFERROR(VLOOKUP(C200,$Q$3:$R$6, 2, FALSE),\"N/A\"))","v":"N/A"},"N/A",null,{"$f":"IF(VLOOKUP(A200,Quality!$A$13:$H$32,8,FALSE)=\"NA\", 0, IFERROR(VLOOKUP(C200,$Q$3:$R$6, 2, FALSE),\"N/A\"))","v":"N/A"},"N/A"]
["S9",{"$f":"\"Data: \"& VLOOKUP(A201,Configuration!$B$33:$C$52,2,FALSE)","v":"Data: "},"Answer","clearRow",{"$f":"IF(E200=\"Yes\", \"Yes\", IF(VLOOKUP(A201,Configuration!$B$33:$C$52,2,FALSE)=0, \"Yes\", \"No\"))","v":"Yes"},null,"",null,{"$f":"IF(VLOOKUP(A201,Usability!$A$12:$C$31,3,FALSE)=\"NA\", 0, IFERROR(VLOOKUP(C201,$Q$3:$R$6, 2, FALSE),\"N/A\"))","v":"N/A"},"N/A",null,{"$f":"IF(VLOOKUP(A201,Quality!$A$13:$H$32,8,FALSE)=\"NA\", 0, IFERROR(VLOOKUP(C201,$Q$3:$R$6, 2, FALSE),\"N/A\"))","v":"N/A"},"N/A"]
["S10",{"$f":"\"Data: \"& VLOOKUP(A202,Configuration!$B$33:$C$52,2,FALSE)","v":"Data: "},"Answer","clearRow",{"$f":"IF(E201=\"Yes\", \"Yes\", IF(VLOOKUP(A202,Configuration!$B$33:$C$52,2,FALSE)=0, \"Yes\", \"No\"))","v":"Yes"},null,"",null,{"$f":"IF(VLOOKUP(A202,Usability!$A$12:$C$31,3,FALSE)=\"NA\", 0, IFERROR(VLOOKUP(C202,$Q$3:$R$6, 2, FALSE),\"N/A\"))","v":"N/A"},"N/A",null,{"$f":"IF(VLOOKUP(A202,Quality!$A$13:$H$32,8,FALSE)=\"NA\", 0, IFERROR(VLOOKUP(C202,$Q$3:$R$6, 2, FALSE),\"N/A\"))","v":"N/A"},"N/A"]
["S11",{"$f":"\"Data: \"& VLOOKUP(A203,Configuration!$B$33:$C$52,2,FALSE)","v":"Data: "},"Answer","clearRow",{"$f":"IF(E202=\"Yes\", \"Yes\", IF(VLOOKUP(A203,Configuration!$B$33:$C$52,2,FALSE)=0, \"Yes\", \"No\"))","v":"Yes"},null,"",null,{"$f":"IF(VLOOKUP(A203,Usability!$A$12:$C$31,3,FALSE)=\"NA\", 0, IFERROR(VLOOKUP(C203,$Q$3:$R$6, 2, FALSE),\"N/A\"))","v":"N/A"},"N/A",null,{"$f":"IF(VLOOKUP(A203,Quality!$A$13:$H$32,8,FALSE)=\"NA\", 0, IFERROR(VLOOKUP(C203,$Q$3:$R$6, 2, FALSE),\"N/A\"))","v":"N/A"},"N/A"]
["S12",{"$f":"\"Data: \"& VLOOKUP(A204,Configuration!$B$33:$C$52,2,FALSE)","v":"Data: "},"Answer","clearRow",{"$f":"IF(E203=\"Yes\", \"Yes\", IF(VLOOKUP(A204,Configuration!$B$33:$C$52,2,FALSE)=0, \"Yes\", \"No\"))","v":"Yes"},null,"",null,{"$f":"IF(VLOOKUP(A204,Usability!$A$12:$C$31,3,FALSE)=\"NA\", 0, IFERROR(VLOOKUP(C204,$Q$3:$R$6, 2, FALSE),\"N/A\"))","v":"N/A"},"N/A",null,{"$f":"IF(VLOOKUP(A204,Quality!$A$13:$H$32,8,FALSE)=\"NA\", 0, IFERROR(VLOOKUP(C204,$Q$3:$R$6, 2, FALSE),\"N/A\"))","v":"N/A"},"N/A"]
["S13",{"$f":"\"Data: \"& VLOOKUP(A205,Configuration!$B$33:$C$52,2,FALSE)","v":"Data: "},"Answer","clearRow",{"$f":"IF(E204=\"Yes\", \"Yes\", IF(VLOOKUP(A205,Configuration!$B$33:$C$52,2,FALSE)=0, \"Yes\", \"No\"))","v":"Yes"},null,"",null,{"$f":"IF(VLOOKUP(A205,Usability!$A$12:$C$31,3,FALSE)=\"NA\", 0, IFERROR(VLOOKUP(C205,$Q$3:$R$6, 2, FALSE),\"N/A\"))","v":"N/A"},"N/A",null,{"$f":"IF(VLOOKUP(A205,Quality!$A$13:$H$32,8,FALSE)=\"NA\", 0, IFERROR(VLOOKUP(C205,$Q$3:$R$6, 2, FALSE),\"N/A\"))","v":"N/A"},"N/A"]
["S14",{"$f":"\"Data: \"& VLOOKUP(A206,Configuration!$B$33:$C$52,2,FALSE)","v":"Data: "},"Answer","clearRow",{"$f":"IF(E205=\"Yes\", \"Yes\", IF(VLOOKUP(A206,Configuration!$B$33:$C$52,2,FALSE)=0, \"Yes\", \"No\"))","v":"Yes"},null,"",null,{"$f":"IF(VLOOKUP(A206,Usability!$A$12:$C$31,3,FALSE)=\"NA\", 0, IFERROR(VLOOKUP(C206,$Q$3:$R$6, 2, FALSE),\"N/A\"))","v":"N/A"},"N/A",null,{"$f":"IF(VLOOKUP(A206,Quality!$A$13:$H$32,8,FALSE)=\"NA\", 0, IFERROR(VLOOKUP(C206,$Q$3:$R$6, 2, FALSE),\"N/A\"))","v":"N/A"},"N/A"]
["S15",{"$f":"\"Data: \"& VLOOKUP(A207,Configuration!$B$33:$C$52,2,FALSE)","v":"Data: "},"Answer","clearRow",{"$f":"IF(E206=\"Yes\", \"Yes\", IF(VLOOKUP(A207,Configuration!$B$33:$C$52,2,FALSE)=0, \"Yes\", \"No\"))","v":"Yes"},null,"",null,{"$f":"IF(VLOOKUP(A207,Usability!$A$12:$C$31,3,FALSE)=\"NA\", 0, IFERROR(VLOOKUP(C207,$Q$3:$R$6, 2, FALSE),\"N/A\"))","v":"N/A"},"N/A",null,{"$f":"IF(VLOOKUP(A207,Quality!$A$13:$H$32,8,FALSE)=\"NA\", 0, IFERROR(VLOOKUP(C207,$Q$3:$R$6, 2, FALSE),\"N/A\"))","v":"N/A"},"N/A"]
["S16",{"$f":"\"Data: \"& VLOOKUP(A208,Configuration!$B$33:$C$52,2,FALSE)","v":"Data: "},"Answer","clearRow",{"$f":"IF(E207=\"Yes\", \"Yes\", IF(VLOOKUP(A208,Configuration!$B$33:$C$52,2,FALSE)=0, \"Yes\", \"No\"))","v":"Yes"},null,"",null,{"$f":"IF(VLOOKUP(A208,Usability!$A$12:$C$31,3,FALSE)=\"NA\", 0, IFERROR(VLOOKUP(C208,$Q$3:$R$6, 2, FALSE),\"N/A\"))","v":"N/A"},"N/A",null,{"$f":"IF(VLOOKUP(A208,Quality!$A$13:$H$32,8,FALSE)=\"NA\", 0, IFERROR(VLOOKUP(C208,$Q$3:$R$6, 2, FALSE),\"N/A\"))","v":"N/A"},"N/A"]
["S17",{"$f":"\"Data: \"& VLOOKUP(A209,Configuration!$B$33:$C$52,2,FALSE)","v":"Data: "},"Answer","clearRow",{"$f":"IF(E208=\"Yes\", \"Yes\", IF(VLOOKUP(A209,Configuration!$B$33:$C$52,2,FALSE)=0, \"Yes\", \"No\"))","v":"Yes"},null,"",null,{"$f":"IF(VLOOKUP(A209,Usability!$A$12:$C$31,3,FALSE)=\"NA\", 0, IFERROR(VLOOKUP(C209,$Q$3:$R$6, 2, FALSE),\"N/A\"))","v":"N/A"},"N/A",null,{"$f":"IF(VLOOKUP(A209,Quality!$A$13:$H$32,8,FALSE)=\"NA\", 0, IFERROR(VLOOKUP(C209,$Q$3:$R$6, 2, FALSE),\"N/A\"))","v":"N/A"},"N/A"]
["S18",{"$f":"\"Data: \"& VLOOKUP(A210,Configuration!$B$33:$C$52,2,FALSE)","v":"Data: "},"Answer","clearRow",{"$f":"IF(E209=\"Yes\", \"Yes\", IF(VLOOKUP(A210,Configuration!$B$33:$C$52,2,FALSE)=0, \"Yes\", \"No\"))","v":"Yes"},null,"",null,{"$f":"IF(VLOOKUP(A210,Usability!$A$12:$C$31,3,FALSE)=\"NA\", 0, IFERROR(VLOOKUP(C210,$Q$3:$R$6, 2, FALSE),\"N/A\"))","v":"N/A"},"N/A",null,{"$f":"IF(VLOOKUP(A210,Quality!$A$13:$H$32,8,FALSE)=\"NA\", 0, IFERROR(VLOOKUP(C210,$Q$3:$R$6, 2, FALSE),\"N/A\"))","v":"N/A"},"N/A"]
["S19",{"$f":"\"Data: \"& VLOOKUP(A211,Configuration!$B$33:$C$52,2,FALSE)","v":"Data: "},"Answer","clearRow",{"$f":"IF(E210=\"Yes\", \"Yes\", IF(VLOOKUP(A211,Configuration!$B$33:$C$52,2,FALSE)=0, \"Yes\", \"No\"))","v":"Yes"},null,"",null,{"$f":"IF(VLOOKUP(A211,Usability!$A$12:$C$31,3,FALSE)=\"NA\", 0, IFERROR(VLOOKUP(C211,$Q$3:$R$6, 2, FALSE),\"N/A\"))","v":"N/A"},"N/A",null,{"$f":"IF(VLOOKUP(A211,Quality!$A$13:$H$32,8,FALSE)=\"NA\", 0, IFERROR(VLOOKUP(C211,$Q$3:$R$6, 2, FALSE),\"N/A\"))","v":"N/A"},"N/A"]
["S20",{"$f":"\"Data: \"& VLOOKUP(A212,Configuration!$B$33:$C$52,2,FALSE)","v":"Data: "},"Answer","clearRow",{"$f":"IF(E211=\"Yes\", \"Yes\", IF(VLOOKUP(A212,Configuration!$B$33:$C$52,2,FALSE)=0, \"Yes\", \"No\"))","v":"Yes"},null,"",null,{"$f":"IF(VLOOKUP(A212,Usability!$A$12:$C$31,3,FALSE)=\"NA\", 0, IFERROR(VLOOKUP(C212,$Q$3:$R$6, 2, FALSE),\"N/A\"))","v":"N/A"},"N/A",null,{"$f":"IF(VLOOKUP(A212,Quality!$A$13:$H$32,8,FALSE)=\"NA\", 0, IFERROR(VLOOKUP(C212,$Q$3:$R$6, 2, FALSE),\"N/A\"))","v":"N/A"},"N/A"]
[null,null,null,null,{"$f":"IF(E192=\"Yes\", \"Yes\", \"No\")","v":"Yes"}]
[null,"Comments:",null,null,{"$f":"IF(E192=\"Yes\", \"Yes\", \"No\")","v":"Yes"}]
[null,null,null,null,{"$f":"IF(E192=\"Yes\", \"Yes\", \"No\")","v":"Yes"}]
[null,null,null,null,{"$f":"IF(E191=\"Yes\", \"Yes\", \"No\")","v":"Yes"}]
[null,null,null,null,{"$f":"IF(E192=\"Yes\", \"Yes\", \"No\")","v":"Yes"}]
["A9",{"$f":"\"Activity: \"& VLOOKUP(A218,Configuration!$B$11:$C$30,2, FALSE)","v":"Activity: "},"Importance Rating",null,{"$f":"IF(VLOOKUP(A218,Configuration!$B$11:$C$30,2,FALSE)=0,\"Yes\", \"No\")","v":"Yes"},null,null,null,{"$f":"SUM(I219:I238)","v":0},null,{"$f":"IF(OR(Progress4<>1, COUNT(G219:G238)<>COUNTIF(E219:E238,\"=No\")),\"\",SUMPRODUCT(J219:J238,Usability!$F$12:$F$31))","v":""},{"$f":"SUM(L219:L238)","v":0},null,{"$f":"IF(OR(Progress3<>1, COUNT(G219:G238)<>COUNTIF(E219:E238,\"=No\")),\"\",SUMPRODUCT(M219:M238,Quality!$H$13:$H$32))","v":""}]
["S1",{"$f":"\"Data: \"& VLOOKUP(A219,Configuration!$B$33:$C$52,2,FALSE)","v":"Data: Pavement Distress, Rutting and Roughness"},"Answer","clearRow",{"$f":"IF(E218=\"Yes\", \"Yes\", IF(VLOOKUP(A219,Configuration!$B$33:$C$52,2,FALSE)=0, \"Yes\", \"No\"))","v":"Yes"},null,{"$f":"IF(C219<>\"Answer\",1,\"\")","v":""},null,{"$f":"IF(VLOOKUP(A219,Usability!$A$12:$C$31,3,FALSE)=\"NA\", 0, IFERROR(VLOOKUP(C219,$Q$3:$R$6, 2, FALSE),\"N/A\"))","v":"N/A"},{"$f":"IFERROR(I219/$I$218,\"N/A\")","v":"N/A"},null,{"$f":"IF(VLOOKUP(A219,Quality!$A$13:$H$32,8,FALSE)=\"NA\", 0, IFERROR(VLOOKUP(C219,$Q$3:$R$6, 2, FALSE),\"N/A\"))","v":"N/A"},{"$f":"IFERROR(L219/$L$218,\"N/A\")","v":"N/A"}]
["S2",{"$f":"\"Data: \"& VLOOKUP(A220,Configuration!$B$33:$C$52,2,FALSE)","v":"Data: Linear Referencing (routes, intersections, mileposts)"},"Answer","clearRow",{"$f":"IF(E219=\"Yes\", \"Yes\", IF(VLOOKUP(A220,Configuration!$B$33:$C$52,2,FALSE)=0, \"Yes\", \"No\"))","v":"Yes"},null,"",null,{"$f":"IF(VLOOKUP(A220,Usability!$A$12:$C$31,3,FALSE)=\"NA\", 0, IFERROR(VLOOKUP(C220,$Q$3:$R$6, 2, FALSE),\"N/A\"))","v":"N/A"},{"$f":"IFERROR(I220/$I$218,\"N/A\")","v":"N/A"},null,{"$f":"IF(VLOOKUP(A220,Quality!$A$13:$H$32,8,FALSE)=\"NA\", 0, IFERROR(VLOOKUP(C220,$Q$3:$R$6, 2, FALSE),\"N/A\"))","v":"N/A"},"N/A"]
["S3",{"$f":"\"Data: \"& VLOOKUP(A221,Configuration!$B$33:$C$52,2,FALSE)","v":"Data: Traffic - AADT, Trucks, ESALS"},"Answer","clearRow",{"$f":"IF(E220=\"Yes\", \"Yes\", IF(VLOOKUP(A221,Configuration!$B$33:$C$52,2,FALSE)=0, \"Yes\", \"No\"))","v":"Yes"},null,"",null,{"$f":"IF(VLOOKUP(A221,Usability!$A$12:$C$31,3,FALSE)=\"NA\", 0, IFERROR(VLOOKUP(C221,$Q$3:$R$6, 2, FALSE),\"N/A\"))","v":"N/A"},"N/A",null,{"$f":"IF(VLOOKUP(A221,Quality!$A$13:$H$32,8,FALSE)=\"NA\", 0, IFERROR(VLOOKUP(C221,$Q$3:$R$6, 2, FALSE),\"N/A\"))","v":"N/A"},"N/A"]
["S4",{"$f":"\"Data: \"& VLOOKUP(A222,Configuration!$B$33:$C$52,2,FALSE)","v":"Data: Pavement Structure Characteristics"},"Answer","clearRow",{"$f":"IF(E221=\"Yes\", \"Yes\", IF(VLOOKUP(A222,Configuration!$B$33:$C$52,2,FALSE)=0, \"Yes\", \"No\"))","v":"Yes"},null,"",null,{"$f":"IF(VLOOKUP(A222,Usability!$A$12:$C$31,3,FALSE)=\"NA\", 0, IFERROR(VLOOKUP(C222,$Q$3:$R$6, 2, FALSE),\"N/A\"))","v":"N/A"},"N/A",null,{"$f":"IF(VLOOKUP(A222,Quality!$A$13:$H$32,8,FALSE)=\"NA\", 0, IFERROR(VLOOKUP(C222,$Q$3:$R$6, 2, FALSE),\"N/A\"))","v":"N/A"},"N/A"]
["S5",{"$f":"\"Data: \"& VLOOKUP(A223,Configuration!$B$33:$C$52,2,FALSE)","v":"Data: Road Inventory: # Lanes, Functional Class"},"Answer","clearRow",{"$f":"IF(E222=\"Yes\", \"Yes\", IF(VLOOKUP(A223,Configuration!$B$33:$C$52,2,FALSE)=0, \"Yes\", \"No\"))","v":"Yes"},null,"",null,{"$f":"IF(VLOOKUP(A223,Usability!$A$12:$C$31,3,FALSE)=\"NA\", 0, IFERROR(VLOOKUP(C223,$Q$3:$R$6, 2, FALSE),\"N/A\"))","v":"N/A"},"N/A",null,{"$f":"IF(VLOOKUP(A223,Quality!$A$13:$H$32,8,FALSE)=\"NA\", 0, IFERROR(VLOOKUP(C223,$Q$3:$R$6, 2, FALSE),\"N/A\"))","v":"N/A"},"N/A"]
["S6",{"$f":"\"Data: \"& VLOOKUP(A224,Configuration!$B$33:$C$52,2,FALSE)","v":"Data: "},"Answer","clearRow",{"$f":"IF(E223=\"Yes\", \"Yes\", IF(VLOOKUP(A224,Configuration!$B$33:$C$52,2,FALSE)=0, \"Yes\", \"No\"))","v":"Yes"},null,"",null,{"$f":"IF(VLOOKUP(A224,Usability!$A$12:$C$31,3,FALSE)=\"NA\", 0, IFERROR(VLOOKUP(C224,$Q$3:$R$6, 2, FALSE),\"N/A\"))","v":"N/A"},"N/A",null,{"$f":"IF(VLOOKUP(A224,Quality!$A$13:$H$32,8,FALSE)=\"NA\", 0, IFERROR(VLOOKUP(C224,$Q$3:$R$6, 2, FALSE),\"N/A\"))","v":"N/A"},"N/A"]
["S7",{"$f":"\"Data: \"& VLOOKUP(A225,Configuration!$B$33:$C$52,2,FALSE)","v":"Data: "},"Answer","clearRow",{"$f":"IF(E224=\"Yes\", \"Yes\", IF(VLOOKUP(A225,Configuration!$B$33:$C$52,2,FALSE)=0, \"Yes\", \"No\"))","v":"Yes"},null,"",null,{"$f":"IF(VLOOKUP(A225,Usability!$A$12:$C$31,3,FALSE)=\"NA\", 0, IFERROR(VLOOKUP(C225,$Q$3:$R$6, 2, FALSE),\"N/A\"))","v":"N/A"},"N/A",null,{"$f":"IF(VLOOKUP(A225,Quality!$A$13:$H$32,8,FALSE)=\"NA\", 0, IFERROR(VLOOKUP(C225,$Q$3:$R$6, 2, FALSE),\"N/A\"))","v":"N/A"},"N/A"]
["S8",{"$f":"\"Data: \"& VLOOKUP(A226,Configuration!$B$33:$C$52,2,FALSE)","v":"Data: "},"Answer","clearRow",{"$f":"IF(E225=\"Yes\", \"Yes\", IF(VLOOKUP(A226,Configuration!$B$33:$C$52,2,FALSE)=0, \"Yes\", \"No\"))","v":"Yes"},null,"",null,{"$f":"IF(VLOOKUP(A226,Usability!$A$12:$C$31,3,FALSE)=\"NA\", 0, IFERROR(VLOOKUP(C226,$Q$3:$R$6, 2, FALSE),\"N/A\"))","v":"N/A"},"N/A",null,{"$f":"IF(VLOOKUP(A226,Quality!$A$13:$H$32,8,FALSE)=\"NA\", 0, IFERROR(VLOOKUP(C226,$Q$3:$R$6, 2, FALSE),\"N/A\"))","v":"N/A"},"N/A"]
["S9",{"$f":"\"Data: \"& VLOOKUP(A227,Configuration!$B$33:$C$52,2,FALSE)","v":"Data: "},"Answer","clearRow",{"$f":"IF(E226=\"Yes\", \"Yes\", IF(VLOOKUP(A227,Configuration!$B$33:$C$52,2,FALSE)=0, \"Yes\", \"No\"))","v":"Yes"},null,"",null,{"$f":"IF(VLOOKUP(A227,Usability!$A$12:$C$31,3,FALSE)=\"NA\", 0, IFERROR(VLOOKUP(C227,$Q$3:$R$6, 2, FALSE),\"N/A\"))","v":"N/A"},"N/A",null,{"$f":"IF(VLOOKUP(A227,Quality!$A$13:$H$32,8,FALSE)=\"NA\", 0, IFERROR(VLOOKUP(C227,$Q$3:$R$6, 2, FALSE),\"N/A\"))","v":"N/A"},"N/A"]
["S10",{"$f":"\"Data: \"& VLOOKUP(A228,Configuration!$B$33:$C$52,2,FALSE)","v":"Data: "},"Answer","clearRow",{"$f":"IF(E227=\"Yes\", \"Yes\", IF(VLOOKUP(A228,Configuration!$B$33:$C$52,2,FALSE)=0, \"Yes\", \"No\"))","v":"Yes"},null,"",null,{"$f":"IF(VLOOKUP(A228,Usability!$A$12:$C$31,3,FALSE)=\"NA\", 0, IFERROR(VLOOKUP(C228,$Q$3:$R$6, 2, FALSE),\"N/A\"))","v":"N/A"},"N/A",null,{"$f":"IF(VLOOKUP(A228,Quality!$A$13:$H$32,8,FALSE)=\"NA\", 0, IFERROR(VLOOKUP(C228,$Q$3:$R$6, 2, FALSE),\"N/A\"))","v":"N/A"},"N/A"]
["S11",{"$f":"\"Data: \"& VLOOKUP(A229,Configuration!$B$33:$C$52,2,FALSE)","v":"Data: "},"Answer","clearRow",{"$f":"IF(E228=\"Yes\", \"Yes\", IF(VLOOKUP(A229,Configuration!$B$33:$C$52,2,FALSE)=0, \"Yes\", \"No\"))","v":"Yes"},null,"",null,{"$f":"IF(VLOOKUP(A229,Usability!$A$12:$C$31,3,FALSE)=\"NA\", 0, IFERROR(VLOOKUP(C229,$Q$3:$R$6, 2, FALSE),\"N/A\"))","v":"N/A"},"N/A",null,{"$f":"IF(VLOOKUP(A229,Quality!$A$13:$H$32,8,FALSE)=\"NA\", 0, IFERROR(VLOOKUP(C229,$Q$3:$R$6, 2, FALSE),\"N/A\"))","v":"N/A"},"N/A"]
["S12",{"$f":"\"Data: \"& VLOOKUP(A230,Configuration!$B$33:$C$52,2,FALSE)","v":"Data: "},"Answer","clearRow",{"$f":"IF(E229=\"Yes\", \"Yes\", IF(VLOOKUP(A230,Configuration!$B$33:$C$52,2,FALSE)=0, \"Yes\", \"No\"))","v":"Yes"},null,"",null,{"$f":"IF(VLOOKUP(A230,Usability!$A$12:$C$31,3,FALSE)=\"NA\", 0, IFERROR(VLOOKUP(C230,$Q$3:$R$6, 2, FALSE),\"N/A\"))","v":"N/A"},"N/A",null,{"$f":"IF(VLOOKUP(A230,Quality!$A$13:$H$32,8,FALSE)=\"NA\", 0, IFERROR(VLOOKUP(C230,$Q$3:$R$6, 2, FALSE),\"N/A\"))","v":"N/A"},"N/A"]
["S13",{"$f":"\"Data: \"& VLOOKUP(A231,Configuration!$B$33:$C$52,2,FALSE)","v":"Data: "},"Answer","clearRow",{"$f":"IF(E230=\"Yes\", \"Yes\", IF(VLOOKUP(A231,Configuration!$B$33:$C$52,2,FALSE)=0, \"Yes\", \"No\"))","v":"Yes"},null,"",null,{"$f":"IF(VLOOKUP(A231,Usability!$A$12:$C$31,3,FALSE)=\"NA\", 0, IFERROR(VLOOKUP(C231,$Q$3:$R$6, 2, FALSE),\"N/A\"))","v":"N/A"},"N/A",null,{"$f":"IF(VLOOKUP(A231,Quality!$A$13:$H$32,8,FALSE)=\"NA\", 0, IFERROR(VLOOKUP(C231,$Q$3:$R$6, 2, FALSE),\"N/A\"))","v":"N/A"},"N/A"]
["S14",{"$f":"\"Data: \"& VLOOKUP(A232,Configuration!$B$33:$C$52,2,FALSE)","v":"Data: "},"Answer","clearRow",{"$f":"IF(E231=\"Yes\", \"Yes\", IF(VLOOKUP(A232,Configuration!$B$33:$C$52,2,FALSE)=0, \"Yes\", \"No\"))","v":"Yes"},null,"",null,{"$f":"IF(VLOOKUP(A232,Usability!$A$12:$C$31,3,FALSE)=\"NA\", 0, IFERROR(VLOOKUP(C232,$Q$3:$R$6, 2, FALSE),\"N/A\"))","v":"N/A"},"N/A",null,{"$f":"IF(VLOOKUP(A232,Quality!$A$13:$H$32,8,FALSE)=\"NA\", 0, IFERROR(VLOOKUP(C232,$Q$3:$R$6, 2, FALSE),\"N/A\"))","v":"N/A"},"N/A"]
["S15",{"$f":"\"Data: \"& VLOOKUP(A233,Configuration!$B$33:$C$52,2,FALSE)","v":"Data: "},"Answer","clearRow",{"$f":"IF(E232=\"Yes\", \"Yes\", IF(VLOOKUP(A233,Configuration!$B$33:$C$52,2,FALSE)=0, \"Yes\", \"No\"))","v":"Yes"},null,"",null,{"$f":"IF(VLOOKUP(A233,Usability!$A$12:$C$31,3,FALSE)=\"NA\", 0, IFERROR(VLOOKUP(C233,$Q$3:$R$6, 2, FALSE),\"N/A\"))","v":"N/A"},"N/A",null,{"$f":"IF(VLOOKUP(A233,Quality!$A$13:$H$32,8,FALSE)=\"NA\", 0, IFERROR(VLOOKUP(C233,$Q$3:$R$6, 2, FALSE),\"N/A\"))","v":"N/A"},"N/A"]
["S16",{"$f":"\"Data: \"& VLOOKUP(A234,Configuration!$B$33:$C$52,2,FALSE)","v":"Data: "},"Answer","clearRow",{"$f":"IF(E233=\"Yes\", \"Yes\", IF(VLOOKUP(A234,Configuration!$B$33:$C$52,2,FALSE)=0, \"Yes\", \"No\"))","v":"Yes"},null,"",null,{"$f":"IF(VLOOKUP(A234,Usability!$A$12:$C$31,3,FALSE)=\"NA\", 0, IFERROR(VLOOKUP(C234,$Q$3:$R$6, 2, FALSE),\"N/A\"))","v":"N/A"},"N/A",null,{"$f":"IF(VLOOKUP(A234,Quality!$A$13:$H$32,8,FALSE)=\"NA\", 0, IFERROR(VLOOKUP(C234,$Q$3:$R$6, 2, FALSE),\"N/A\"))","v":"N/A"},"N/A"]
["S17",{"$f":"\"Data: \"& VLOOKUP(A235,Configuration!$B$33:$C$52,2,FALSE)","v":"Data: "},"Answer","clearRow",{"$f":"IF(E234=\"Yes\", \"Yes\", IF(VLOOKUP(A235,Configuration!$B$33:$C$52,2,FALSE)=0, \"Yes\", \"No\"))","v":"Yes"},null,"",null,{"$f":"IF(VLOOKUP(A235,Usability!$A$12:$C$31,3,FALSE)=\"NA\", 0, IFERROR(VLOOKUP(C235,$Q$3:$R$6, 2, FALSE),\"N/A\"))","v":"N/A"},"N/A",null,{"$f":"IF(VLOOKUP(A235,Quality!$A$13:$H$32,8,FALSE)=\"NA\", 0, IFERROR(VLOOKUP(C235,$Q$3:$R$6, 2, FALSE),\"N/A\"))","v":"N/A"},"N/A"]
["S18",{"$f":"\"Data: \"& VLOOKUP(A236,Configuration!$B$33:$C$52,2,FALSE)","v":"Data: "},"Answer","clearRow",{"$f":"IF(E235=\"Yes\", \"Yes\", IF(VLOOKUP(A236,Configuration!$B$33:$C$52,2,FALSE)=0, \"Yes\", \"No\"))","v":"Yes"},null,"",null,{"$f":"IF(VLOOKUP(A236,Usability!$A$12:$C$31,3,FALSE)=\"NA\", 0, IFERROR(VLOOKUP(C236,$Q$3:$R$6, 2, FALSE),\"N/A\"))","v":"N/A"},"N/A",null,{"$f":"IF(VLOOKUP(A236,Quality!$A$13:$H$32,8,FALSE)=\"NA\", 0, IFERROR(VLOOKUP(C236,$Q$3:$R$6, 2, FALSE),\"N/A\"))","v":"N/A"},"N/A"]
["S19",{"$f":"\"Data: \"& VLOOKUP(A237,Configuration!$B$33:$C$52,2,FALSE)","v":"Data: "},"Answer","clearRow",{"$f":"IF(E236=\"Yes\", \"Yes\", IF(VLOOKUP(A237,Configuration!$B$33:$C$52,2,FALSE)=0, \"Yes\", \"No\"))","v":"Yes"},null,"",null,{"$f":"IF(VLOOKUP(A237,Usability!$A$12:$C$31,3,FALSE)=\"NA\", 0, IFERROR(VLOOKUP(C237,$Q$3:$R$6, 2, FALSE),\"N/A\"))","v":"N/A"},"N/A",null,{"$f":"IF(VLOOKUP(A237,Quality!$A$13:$H$32,8,FALSE)=\"NA\", 0, IFERROR(VLOOKUP(C237,$Q$3:$R$6, 2, FALSE),\"N/A\"))","v":"N/A"},"N/A"]
["S20",{"$f":"\"Data: \"& VLOOKUP(A238,Configuration!$B$33:$C$52,2,FALSE)","v":"Data: "},"Answer","clearRow",{"$f":"IF(E237=\"Yes\", \"Yes\", IF(VLOOKUP(A238,Configuration!$B$33:$C$52,2,FALSE)=0, \"Yes\", \"No\"))","v":"Yes"},null,"",null,{"$f":"IF(VLOOKUP(A238,Usability!$A$12:$C$31,3,FALSE)=\"NA\", 0, IFERROR(VLOOKUP(C238,$Q$3:$R$6, 2, FALSE),\"N/A\"))","v":"N/A"},"N/A",null,{"$f":"IF(VLOOKUP(A238,Quality!$A$13:$H$32,8,FALSE)=\"NA\", 0, IFERROR(VLOOKUP(C238,$Q$3:$R$6, 2, FALSE),\"N/A\"))","v":"N/A"},"N/A"]
[null,null,null,null,{"$f":"IF(E218=\"Yes\", \"Yes\", \"No\")","v":"Yes"}]
[null,"Comments:",null,null,{"$f":"IF(E218=\"Yes\", \"Yes\", \"No\")","v":"Yes"}]
[null,null,null,null,{"$f":"IF(E218=\"Yes\", \"Yes\", \"No\")","v":"Yes"}]
[null,null,null,null,{"$f":"IF(E217=\"Yes\", \"Yes\", \"No\")","v":"Yes"}]
[null,null,null,null,{"$f":"IF(E218=\"Yes\", \"Yes\", \"No\")","v":"Yes"}]
["A10",{"$f":"\"Activity: \"& VLOOKUP(A244,Configuration!$B$11:$C$30,2, FALSE)","v":"Activity: "},"Importance Rating",null,{"$f":"IF(VLOOKUP(A244,Configuration!$B$11:$C$30,2,FALSE)=0,\"Yes\", \"No\")","v":"Yes"},null,null,null,{"$f":"SUM(I245:I264)","v":0},null,{"$f":"IF(OR(Progress4<>1, COUNT(G245:G264)<>COUNTIF(E245:E264,\"=No\")),\"\",SUMPRODUCT(J245:J264,Usability!$F$12:$F$31))","v":""},{"$f":"SUM(L245:L264)","v":0},null,{"$f":"IF(OR(Progress3<>1, COUNT(G245:G264)<>COUNTIF(E245:E264,\"=No\")),\"\",SUMPRODUCT(M245:M264,Quality!$H$13:$H$32))","v":""}]
["S1",{"$f":"\"Data: \"& VLOOKUP(A245,Configuration!$B$33:$C$52,2,FALSE)","v":"Data: Pavement Distress, Rutting and Roughness"},"Answer","clearRow",{"$f":"IF(E244=\"Yes\", \"Yes\", IF(VLOOKUP(A245,Configuration!$B$33:$C$52,2,FALSE)=0, \"Yes\", \"No\"))","v":"Yes"},null,{"$f":"IF(C245<>\"Answer\",1,\"\")","v":""},null,{"$f":"IF(VLOOKUP(A245,Usability!$A$12:$C$31,3,FALSE)=\"NA\", 0, IFERROR(VLOOKUP(C245,$Q$3:$R$6, 2, FALSE),\"N/A\"))","v":"N/A"},{"$f":"IFERROR(I245/$I$244,\"N/A\")","v":"N/A"},null,{"$f":"IF(VLOOKUP(A245,Quality!$A$13:$H$32,8,FALSE)=\"NA\", 0, IFERROR(VLOOKUP(C245,$Q$3:$R$6, 2, FALSE),\"N/A\"))","v":"N/A"},{"$f":"IFERROR(L245/$L$244,\"N/A\")","v":"N/A"}]
["S2",{"$f":"\"Data: \"& VLOOKUP(A246,Configuration!$B$33:$C$52,2,FALSE)","v":"Data: Linear Referencing (routes, intersections, mileposts)"},"Answer","clearRow",{"$f":"IF(E245=\"Yes\", \"Yes\", IF(VLOOKUP(A246,Configuration!$B$33:$C$52,2,FALSE)=0, \"Yes\", \"No\"))","v":"Yes"},null,"",null,{"$f":"IF(VLOOKUP(A246,Usability!$A$12:$C$31,3,FALSE)=\"NA\", 0, IFERROR(VLOOKUP(C246,$Q$3:$R$6, 2, FALSE),\"N/A\"))","v":"N/A"},{"$f":"IFERROR(I246/$I$244,\"N/A\")","v":"N/A"},null,{"$f":"IF(VLOOKUP(A246,Quality!$A$13:$H$32,8,FALSE)=\"NA\", 0, IFERROR(VLOOKUP(C246,$Q$3:$R$6, 2, FALSE),\"N/A\"))","v":"N/A"},"N/A"]
["S3",{"$f":"\"Data: \"& VLOOKUP(A247,Configuration!$B$33:$C$52,2,FALSE)","v":"Data: Traffic - AADT, Trucks, ESALS"},"Answer","clearRow",{"$f":"IF(E246=\"Yes\", \"Yes\", IF(VLOOKUP(A247,Configuration!$B$33:$C$52,2,FALSE)=0, \"Yes\", \"No\"))","v":"Yes"},null,"",null,{"$f":"IF(VLOOKUP(A247,Usability!$A$12:$C$31,3,FALSE)=\"NA\", 0, IFERROR(VLOOKUP(C247,$Q$3:$R$6, 2, FALSE),\"N/A\"))","v":"N/A"},"N/A",null,{"$f":"IF(VLOOKUP(A247,Quality!$A$13:$H$32,8,FALSE)=\"NA\", 0, IFERROR(VLOOKUP(C247,$Q$3:$R$6, 2, FALSE),\"N/A\"))","v":"N/A"},"N/A"]
["S4",{"$f":"\"Data: \"& VLOOKUP(A248,Configuration!$B$33:$C$52,2,FALSE)","v":"Data: Pavement Structure Characteristics"},"Answer","clearRow",{"$f":"IF(E247=\"Yes\", \"Yes\", IF(VLOOKUP(A248,Configuration!$B$33:$C$52,2,FALSE)=0, \"Yes\", \"No\"))","v":"Yes"},null,"",null,{"$f":"IF(VLOOKUP(A248,Usability!$A$12:$C$31,3,FALSE)=\"NA\", 0, IFERROR(VLOOKUP(C248,$Q$3:$R$6, 2, FALSE),\"N/A\"))","v":"N/A"},"N/A",null,{"$f":"IF(VLOOKUP(A248,Quality!$A$13:$H$32,8,FALSE)=\"NA\", 0, IFERROR(VLOOKUP(C248,$Q$3:$R$6, 2, FALSE),\"N/A\"))","v":"N/A"},"N/A"]
["S5",{"$f":"\"Data: \"& VLOOKUP(A249,Configuration!$B$33:$C$52,2,FALSE)","v":"Data: Road Inventory: # Lanes, Functional Class"},"Answer","clearRow",{"$f":"IF(E248=\"Yes\", \"Yes\", IF(VLOOKUP(A249,Configuration!$B$33:$C$52,2,FALSE)=0, \"Yes\", \"No\"))","v":"Yes"},null,"",null,{"$f":"IF(VLOOKUP(A249,Usability!$A$12:$C$31,3,FALSE)=\"NA\", 0, IFERROR(VLOOKUP(C249,$Q$3:$R$6, 2, FALSE),\"N/A\"))","v":"N/A"},"N/A",null,{"$f":"IF(VLOOKUP(A249,Quality!$A$13:$H$32,8,FALSE)=\"NA\", 0, IFERROR(VLOOKUP(C249,$Q$3:$R$6, 2, FALSE),\"N/A\"))","v":"N/A"},"N/A"]
["S6",{"$f":"\"Data: \"& VLOOKUP(A250,Configuration!$B$33:$C$52,2,FALSE)","v":"Data: "},"Answer","clearRow",{"$f":"IF(E249=\"Yes\", \"Yes\", IF(VLOOKUP(A250,Configuration!$B$33:$C$52,2,FALSE)=0, \"Yes\", \"No\"))","v":"Yes"},null,"",null,{"$f":"IF(VLOOKUP(A250,Usability!$A$12:$C$31,3,FALSE)=\"NA\", 0, IFERROR(VLOOKUP(C250,$Q$3:$R$6, 2, FALSE),\"N/A\"))","v":"N/A"},"N/A",null,{"$f":"IF(VLOOKUP(A250,Quality!$A$13:$H$32,8,FALSE)=\"NA\", 0, IFERROR(VLOOKUP(C250,$Q$3:$R$6, 2, FALSE),\"N/A\"))","v":"N/A"},"N/A"]
["S7",{"$f":"\"Data: \"& VLOOKUP(A251,Configuration!$B$33:$C$52,2,FALSE)","v":"Data: "},"Answer","clearRow",{"$f":"IF(E250=\"Yes\", \"Yes\", IF(VLOOKUP(A251,Configuration!$B$33:$C$52,2,FALSE)=0, \"Yes\", \"No\"))","v":"Yes"},null,"",null,{"$f":"IF(VLOOKUP(A251,Usability!$A$12:$C$31,3,FALSE)=\"NA\", 0, IFERROR(VLOOKUP(C251,$Q$3:$R$6, 2, FALSE),\"N/A\"))","v":"N/A"},"N/A",null,{"$f":"IF(VLOOKUP(A251,Quality!$A$13:$H$32,8,FALSE)=\"NA\", 0, IFERROR(VLOOKUP(C251,$Q$3:$R$6, 2, FALSE),\"N/A\"))","v":"N/A"},"N/A"]
["S8",{"$f":"\"Data: \"& VLOOKUP(A252,Configuration!$B$33:$C$52,2,FALSE)","v":"Data: "},"Answer","clearRow",{"$f":"IF(E251=\"Yes\", \"Yes\", IF(VLOOKUP(A252,Configuration!$B$33:$C$52,2,FALSE)=0, \"Yes\", \"No\"))","v":"Yes"},null,"",null,{"$f":"IF(VLOOKUP(A252,Usability!$A$12:$C$31,3,FALSE)=\"NA\", 0, IFERROR(VLOOKUP(C252,$Q$3:$R$6, 2, FALSE),\"N/A\"))","v":"N/A"},"N/A",null,{"$f":"IF(VLOOKUP(A252,Quality!$A$13:$H$32,8,FALSE)=\"NA\", 0, IFERROR(VLOOKUP(C252,$Q$3:$R$6, 2, FALSE),\"N/A\"))","v":"N/A"},"N/A"]
["S9",{"$f":"\"Data: \"& VLOOKUP(A253,Configuration!$B$33:$C$52,2,FALSE)","v":"Data: "},"Answer","clearRow",{"$f":"IF(E252=\"Yes\", \"Yes\", IF(VLOOKUP(A253,Configuration!$B$33:$C$52,2,FALSE)=0, \"Yes\", \"No\"))","v":"Yes"},null,"",null,{"$f":"IF(VLOOKUP(A253,Usability!$A$12:$C$31,3,FALSE)=\"NA\", 0, IFERROR(VLOOKUP(C253,$Q$3:$R$6, 2, FALSE),\"N/A\"))","v":"N/A"},"N/A",null,{"$f":"IF(VLOOKUP(A253,Quality!$A$13:$H$32,8,FALSE)=\"NA\", 0, IFERROR(VLOOKUP(C253,$Q$3:$R$6, 2, FALSE),\"N/A\"))","v":"N/A"},"N/A"]
["S10",{"$f":"\"Data: \"& VLOOKUP(A254,Configuration!$B$33:$C$52,2,FALSE)","v":"Data: "},"Answer","clearRow",{"$f":"IF(E253=\"Yes\", \"Yes\", IF(VLOOKUP(A254,Configuration!$B$33:$C$52,2,FALSE)=0, \"Yes\", \"No\"))","v":"Yes"},null,"",null,{"$f":"IF(VLOOKUP(A254,Usability!$A$12:$C$31,3,FALSE)=\"NA\", 0, IFERROR(VLOOKUP(C254,$Q$3:$R$6, 2, FALSE),\"N/A\"))","v":"N/A"},"N/A",null,{"$f":"IF(VLOOKUP(A254,Quality!$A$13:$H$32,8,FALSE)=\"NA\", 0, IFERROR(VLOOKUP(C254,$Q$3:$R$6, 2, FALSE),\"N/A\"))","v":"N/A"},"N/A"]
["S11",{"$f":"\"Data: \"& VLOOKUP(A255,Configuration!$B$33:$C$52,2,FALSE)","v":"Data: "},"Answer","clearRow",{"$f":"IF(E254=\"Yes\", \"Yes\", IF(VLOOKUP(A255,Configuration!$B$33:$C$52,2,FALSE)=0, \"Yes\", \"No\"))","v":"Yes"},null,"",null,{"$f":"IF(VLOOKUP(A255,Usability!$A$12:$C$31,3,FALSE)=\"NA\", 0, IFERROR(VLOOKUP(C255,$Q$3:$R$6, 2, FALSE),\"N/A\"))","v":"N/A"},"N/A",null,{"$f":"IF(VLOOKUP(A255,Quality!$A$13:$H$32,8,FALSE)=\"NA\", 0, IFERROR(VLOOKUP(C255,$Q$3:$R$6, 2, FALSE),\"N/A\"))","v":"N/A"},"N/A"]
["S12",{"$f":"\"Data: \"& VLOOKUP(A256,Configuration!$B$33:$C$52,2,FALSE)","v":"Data: "},"Answer","clearRow",{"$f":"IF(E255=\"Yes\", \"Yes\", IF(VLOOKUP(A256,Configuration!$B$33:$C$52,2,FALSE)=0, \"Yes\", \"No\"))","v":"Yes"},null,"",null,{"$f":"IF(VLOOKUP(A256,Usability!$A$12:$C$31,3,FALSE)=\"NA\", 0, IFERROR(VLOOKUP(C256,$Q$3:$R$6, 2, FALSE),\"N/A\"))","v":"N/A"},"N/A",null,{"$f":"IF(VLOOKUP(A256,Quality!$A$13:$H$32,8,FALSE)=\"NA\", 0, IFERROR(VLOOKUP(C256,$Q$3:$R$6, 2, FALSE),\"N/A\"))","v":"N/A"},"N/A"]
["S13",{"$f":"\"Data: \"& VLOOKUP(A257,Configuration!$B$33:$C$52,2,FALSE)","v":"Data: "},"Answer","clearRow",{"$f":"IF(E256=\"Yes\", \"Yes\", IF(VLOOKUP(A257,Configuration!$B$33:$C$52,2,FALSE)=0, \"Yes\", \"No\"))","v":"Yes"},null,"",null,{"$f":"IF(VLOOKUP(A257,Usability!$A$12:$C$31,3,FALSE)=\"NA\", 0, IFERROR(VLOOKUP(C257,$Q$3:$R$6, 2, FALSE),\"N/A\"))","v":"N/A"},"N/A",null,{"$f":"IF(VLOOKUP(A257,Quality!$A$13:$H$32,8,FALSE)=\"NA\", 0, IFERROR(VLOOKUP(C257,$Q$3:$R$6, 2, FALSE),\"N/A\"))","v":"N/A"},"N/A"]
["S14",{"$f":"\"Data: \"& VLOOKUP(A258,Configuration!$B$33:$C$52,2,FALSE)","v":"Data: "},"Answer","clearRow",{"$f":"IF(E257=\"Yes\", \"Yes\", IF(VLOOKUP(A258,Configuration!$B$33:$C$52,2,FALSE)=0, \"Yes\", \"No\"))","v":"Yes"},null,"",null,{"$f":"IF(VLOOKUP(A258,Usability!$A$12:$C$31,3,FALSE)=\"NA\", 0, IFERROR(VLOOKUP(C258,$Q$3:$R$6, 2, FALSE),\"N/A\"))","v":"N/A"},"N/A",null,{"$f":"IF(VLOOKUP(A258,Quality!$A$13:$H$32,8,FALSE)=\"NA\", 0, IFERROR(VLOOKUP(C258,$Q$3:$R$6, 2, FALSE),\"N/A\"))","v":"N/A"},"N/A"]
["S15",{"$f":"\"Data: \"& VLOOKUP(A259,Configuration!$B$33:$C$52,2,FALSE)","v":"Data: "},"Answer","clearRow",{"$f":"IF(E258=\"Yes\", \"Yes\", IF(VLOOKUP(A259,Configuration!$B$33:$C$52,2,FALSE)=0, \"Yes\", \"No\"))","v":"Yes"},null,"",null,{"$f":"IF(VLOOKUP(A259,Usability!$A$12:$C$31,3,FALSE)=\"NA\", 0, IFERROR(VLOOKUP(C259,$Q$3:$R$6, 2, FALSE),\"N/A\"))","v":"N/A"},"N/A",null,{"$f":"IF(VLOOKUP(A259,Quality!$A$13:$H$32,8,FALSE)=\"NA\", 0, IFERROR(VLOOKUP(C259,$Q$3:$R$6, 2, FALSE),\"N/A\"))","v":"N/A"},"N/A"]
["S16",{"$f":"\"Data: \"& VLOOKUP(A260,Configuration!$B$33:$C$52,2,FALSE)","v":"Data: "},"Answer","clearRow",{"$f":"IF(E259=\"Yes\", \"Yes\", IF(VLOOKUP(A260,Configuration!$B$33:$C$52,2,FALSE)=0, \"Yes\", \"No\"))","v":"Yes"},null,"",null,{"$f":"IF(VLOOKUP(A260,Usability!$A$12:$C$31,3,FALSE)=\"NA\", 0, IFERROR(VLOOKUP(C260,$Q$3:$R$6, 2, FALSE),\"N/A\"))","v":"N/A"},"N/A",null,{"$f":"IF(VLOOKUP(A260,Quality!$A$13:$H$32,8,FALSE)=\"NA\", 0, IFERROR(VLOOKUP(C260,$Q$3:$R$6, 2, FALSE),\"N/A\"))","v":"N/A"},"N/A"]
["S17",{"$f":"\"Data: \"& VLOOKUP(A261,Configuration!$B$33:$C$52,2,FALSE)","v":"Data: "},"Answer","clearRow",{"$f":"IF(E260=\"Yes\", \"Yes\", IF(VLOOKUP(A261,Configuration!$B$33:$C$52,2,FALSE)=0, \"Yes\", \"No\"))","v":"Yes"},null,"",null,{"$f":"IF(VLOOKUP(A261,Usability!$A$12:$C$31,3,FALSE)=\"NA\", 0, IFERROR(VLOOKUP(C261,$Q$3:$R$6, 2, FALSE),\"N/A\"))","v":"N/A"},"N/A",null,{"$f":"IF(VLOOKUP(A261,Quality!$A$13:$H$32,8,FALSE)=\"NA\", 0, IFERROR(VLOOKUP(C261,$Q$3:$R$6, 2, FALSE),\"N/A\"))","v":"N/A"},"N/A"]
["S18",{"$f":"\"Data: \"& VLOOKUP(A262,Configuration!$B$33:$C$52,2,FALSE)","v":"Data: "},"Answer","clearRow",{"$f":"IF(E261=\"Yes\", \"Yes\", IF(VLOOKUP(A262,Configuration!$B$33:$C$52,2,FALSE)=0, \"Yes\", \"No\"))","v":"Yes"},null,"",null,{"$f":"IF(VLOOKUP(A262,Usability!$A$12:$C$31,3,FALSE)=\"NA\", 0, IFERROR(VLOOKUP(C262,$Q$3:$R$6, 2, FALSE),\"N/A\"))","v":"N/A"},"N/A",null,{"$f":"IF(VLOOKUP(A262,Quality!$A$13:$H$32,8,FALSE)=\"NA\", 0, IFERROR(VLOOKUP(C262,$Q$3:$R$6, 2, FALSE),\"N/A\"))","v":"N/A"},"N/A"]
["S19",{"$f":"\"Data: \"& VLOOKUP(A263,Configuration!$B$33:$C$52,2,FALSE)","v":"Data: "},"Answer","clearRow",{"$f":"IF(E262=\"Yes\", \"Yes\", IF(VLOOKUP(A263,Configuration!$B$33:$C$52,2,FALSE)=0, \"Yes\", \"No\"))","v":"Yes"},null,"",null,{"$f":"IF(VLOOKUP(A263,Usability!$A$12:$C$31,3,FALSE)=\"NA\", 0, IFERROR(VLOOKUP(C263,$Q$3:$R$6, 2, FALSE),\"N/A\"))","v":"N/A"},"N/A",null,{"$f":"IF(VLOOKUP(A263,Quality!$A$13:$H$32,8,FALSE)=\"NA\", 0, IFERROR(VLOOKUP(C263,$Q$3:$R$6, 2, FALSE),\"N/A\"))","v":"N/A"},"N/A"]
["S20",{"$f":"\"Data: \"& VLOOKUP(A264,Configuration!$B$33:$C$52,2,FALSE)","v":"Data: "},"Answer","clearRow",{"$f":"IF(E263=\"Yes\", \"Yes\", IF(VLOOKUP(A264,Configuration!$B$33:$C$52,2,FALSE)=0, \"Yes\", \"No\"))","v":"Yes"},null,"",null,{"$f":"IF(VLOOKUP(A264,Usability!$A$12:$C$31,3,FALSE)=\"NA\", 0, IFERROR(VLOOKUP(C264,$Q$3:$R$6, 2, FALSE),\"N/A\"))","v":"N/A"},"N/A",null,{"$f":"IF(VLOOKUP(A264,Quality!$A$13:$H$32,8,FALSE)=\"NA\", 0, IFERROR(VLOOKUP(C264,$Q$3:$R$6, 2, FALSE),\"N/A\"))","v":"N/A"},"N/A"]
[null,null,null,null,{"$f":"IF(E244=\"Yes\", \"Yes\", \"No\")","v":"Yes"}]
[null,"Comments:",null,null,{"$f":"IF(E244=\"Yes\", \"Yes\", \"No\")","v":"Yes"}]
[null,null,null,null,{"$f":"IF(E244=\"Yes\", \"Yes\", \"No\")","v":"Yes"}]
[null,null,null,null,{"$f":"IF(E242=\"Yes\", \"Yes\", \"No\")","v":"Yes"}]
[null,null,null,null,{"$f":"IF(E243=\"Yes\", \"Yes\", \"No\")","v":"Yes"}]
["A11",{"$f":"\"Activity: \"& VLOOKUP(A270,Configuration!$B$11:$C$30,2, FALSE)","v":"Activity: "},"Importance Rating",null,{"$f":"IF(VLOOKUP(A270,Configuration!$B$11:$C$30,2,FALSE)=0,\"Yes\", \"No\")","v":"Yes"},null,null,null,{"$f":"SUM(I271:I290)","v":0},null,{"$f":"IF(OR(Progress4<>1, COUNT(G271:G290)<>COUNTIF(E271:E290,\"=No\")),\"\",SUMPRODUCT(J271:J290,Usability!$F$12:$F$31))","v":""},{"$f":"SUM(L271:L290)","v":0},null,{"$f":"IF(OR(Progress3<>1, COUNT(G271:G290)<>COUNTIF(E271:E290,\"=No\")),\"\",SUMPRODUCT(M271:M290,Quality!$H$13:$H$32))","v":""}]
["S1",{"$f":"\"Data: \"& VLOOKUP(A271,Configuration!$B$33:$C$52,2,FALSE)","v":"Data: Pavement Distress, Rutting and Roughness"},"Answer","clearRow",{"$f":"IF(E270=\"Yes\", \"Yes\", IF(VLOOKUP(A271,Configuration!$B$33:$C$52,2,FALSE)=0, \"Yes\", \"No\"))","v":"Yes"},null,{"$f":"IF(C271<>\"Answer\",1,\"\")","v":""},null,{"$f":"IF(VLOOKUP(A271,Usability!$A$12:$C$31,3,FALSE)=\"NA\", 0, IFERROR(VLOOKUP(C271,$Q$3:$R$6, 2, FALSE),\"N/A\"))","v":"N/A"},{"$f":"IFERROR(I271/$I$270,\"N/A\")","v":"N/A"},null,{"$f":"IF(VLOOKUP(A271,Quality!$A$13:$H$32,8,FALSE)=\"NA\", 0, IFERROR(VLOOKUP(C271,$Q$3:$R$6, 2, FALSE),\"N/A\"))","v":"N/A"},{"$f":"IFERROR(L271/$L$270,\"N/A\")","v":"N/A"}]
["S2",{"$f":"\"Data: \"& VLOOKUP(A272,Configuration!$B$33:$C$52,2,FALSE)","v":"Data: Linear Referencing (routes, intersections, mileposts)"},"Answer","clearRow",{"$f":"IF(E271=\"Yes\", \"Yes\", IF(VLOOKUP(A272,Configuration!$B$33:$C$52,2,FALSE)=0, \"Yes\", \"No\"))","v":"Yes"},null,"",null,{"$f":"IF(VLOOKUP(A272,Usability!$A$12:$C$31,3,FALSE)=\"NA\", 0, IFERROR(VLOOKUP(C272,$Q$3:$R$6, 2, FALSE),\"N/A\"))","v":"N/A"},{"$f":"IFERROR(I272/$I$270,\"N/A\")","v":"N/A"},null,{"$f":"IF(VLOOKUP(A272,Quality!$A$13:$H$32,8,FALSE)=\"NA\", 0, IFERROR(VLOOKUP(C272,$Q$3:$R$6, 2, FALSE),\"N/A\"))","v":"N/A"},"N/A"]
["S3",{"$f":"\"Data: \"& VLOOKUP(A273,Configuration!$B$33:$C$52,2,FALSE)","v":"Data: Traffic - AADT, Trucks, ESALS"},"Answer","clearRow",{"$f":"IF(E272=\"Yes\", \"Yes\", IF(VLOOKUP(A273,Configuration!$B$33:$C$52,2,FALSE)=0, \"Yes\", \"No\"))","v":"Yes"},null,"",null,{"$f":"IF(VLOOKUP(A273,Usability!$A$12:$C$31,3,FALSE)=\"NA\", 0, IFERROR(VLOOKUP(C273,$Q$3:$R$6, 2, FALSE),\"N/A\"))","v":"N/A"},"N/A",null,{"$f":"IF(VLOOKUP(A273,Quality!$A$13:$H$32,8,FALSE)=\"NA\", 0, IFERROR(VLOOKUP(C273,$Q$3:$R$6, 2, FALSE),\"N/A\"))","v":"N/A"},"N/A"]
["S4",{"$f":"\"Data: \"& VLOOKUP(A274,Configuration!$B$33:$C$52,2,FALSE)","v":"Data: Pavement Structure Characteristics"},"Answer","clearRow",{"$f":"IF(E273=\"Yes\", \"Yes\", IF(VLOOKUP(A274,Configuration!$B$33:$C$52,2,FALSE)=0, \"Yes\", \"No\"))","v":"Yes"},null,"",null,{"$f":"IF(VLOOKUP(A274,Usability!$A$12:$C$31,3,FALSE)=\"NA\", 0, IFERROR(VLOOKUP(C274,$Q$3:$R$6, 2, FALSE),\"N/A\"))","v":"N/A"},"N/A",null,{"$f":"IF(VLOOKUP(A274,Quality!$A$13:$H$32,8,FALSE)=\"NA\", 0, IFERROR(VLOOKUP(C274,$Q$3:$R$6, 2, FALSE),\"N/A\"))","v":"N/A"},"N/A"]
["S5",{"$f":"\"Data: \"& VLOOKUP(A275,Configuration!$B$33:$C$52,2,FALSE)","v":"Data: Road Inventory: # Lanes, Functional Class"},"Answer","clearRow",{"$f":"IF(E274=\"Yes\", \"Yes\", IF(VLOOKUP(A275,Configuration!$B$33:$C$52,2,FALSE)=0, \"Yes\", \"No\"))","v":"Yes"},null,"",null,{"$f":"IF(VLOOKUP(A275,Usability!$A$12:$C$31,3,FALSE)=\"NA\", 0, IFERROR(VLOOKUP(C275,$Q$3:$R$6, 2, FALSE),\"N/A\"))","v":"N/A"},"N/A",null,{"$f":"IF(VLOOKUP(A275,Quality!$A$13:$H$32,8,FALSE)=\"NA\", 0, IFERROR(VLOOKUP(C275,$Q$3:$R$6, 2, FALSE),\"N/A\"))","v":"N/A"},"N/A"]
["S6",{"$f":"\"Data: \"& VLOOKUP(A276,Configuration!$B$33:$C$52,2,FALSE)","v":"Data: "},"Answer","clearRow",{"$f":"IF(E275=\"Yes\", \"Yes\", IF(VLOOKUP(A276,Configuration!$B$33:$C$52,2,FALSE)=0, \"Yes\", \"No\"))","v":"Yes"},null,"",null,{"$f":"IF(VLOOKUP(A276,Usability!$A$12:$C$31,3,FALSE)=\"NA\", 0, IFERROR(VLOOKUP(C276,$Q$3:$R$6, 2, FALSE),\"N/A\"))","v":"N/A"},"N/A",null,{"$f":"IF(VLOOKUP(A276,Quality!$A$13:$H$32,8,FALSE)=\"NA\", 0, IFERROR(VLOOKUP(C276,$Q$3:$R$6, 2, FALSE),\"N/A\"))","v":"N/A"},"N/A"]
["S7",{"$f":"\"Data: \"& VLOOKUP(A277,Configuration!$B$33:$C$52,2,FALSE)","v":"Data: "},"Answer","clearRow",{"$f":"IF(E276=\"Yes\", \"Yes\", IF(VLOOKUP(A277,Configuration!$B$33:$C$52,2,FALSE)=0, \"Yes\", \"No\"))","v":"Yes"},null,"",null,{"$f":"IF(VLOOKUP(A277,Usability!$A$12:$C$31,3,FALSE)=\"NA\", 0, IFERROR(VLOOKUP(C277,$Q$3:$R$6, 2, FALSE),\"N/A\"))","v":"N/A"},"N/A",null,{"$f":"IF(VLOOKUP(A277,Quality!$A$13:$H$32,8,FALSE)=\"NA\", 0, IFERROR(VLOOKUP(C277,$Q$3:$R$6, 2, FALSE),\"N/A\"))","v":"N/A"},"N/A"]
["S8",{"$f":"\"Data: \"& VLOOKUP(A278,Configuration!$B$33:$C$52,2,FALSE)","v":"Data: "},"Answer","clearRow",{"$f":"IF(E277=\"Yes\", \"Yes\", IF(VLOOKUP(A278,Configuration!$B$33:$C$52,2,FALSE)=0, \"Yes\", \"No\"))","v":"Yes"},null,"",null,{"$f":"IF(VLOOKUP(A278,Usability!$A$12:$C$31,3,FALSE)=\"NA\", 0, IFERROR(VLOOKUP(C278,$Q$3:$R$6, 2, FALSE),\"N/A\"))","v":"N/A"},"N/A",null,{"$f":"IF(VLOOKUP(A278,Quality!$A$13:$H$32,8,FALSE)=\"NA\", 0, IFERROR(VLOOKUP(C278,$Q$3:$R$6, 2, FALSE),\"N/A\"))","v":"N/A"},"N/A"]
["S9",{"$f":"\"Data: \"& VLOOKUP(A279,Configuration!$B$33:$C$52,2,FALSE)","v":"Data: "},"Answer","clearRow",{"$f":"IF(E278=\"Yes\", \"Yes\", IF(VLOOKUP(A279,Configuration!$B$33:$C$52,2,FALSE)=0, \"Yes\", \"No\"))","v":"Yes"},null,"",null,{"$f":"IF(VLOOKUP(A279,Usability!$A$12:$C$31,3,FALSE)=\"NA\", 0, IFERROR(VLOOKUP(C279,$Q$3:$R$6, 2, FALSE),\"N/A\"))","v":"N/A"},"N/A",null,{"$f":"IF(VLOOKUP(A279,Quality!$A$13:$H$32,8,FALSE)=\"NA\", 0, IFERROR(VLOOKUP(C279,$Q$3:$R$6, 2, FALSE),\"N/A\"))","v":"N/A"},"N/A"]
["S10",{"$f":"\"Data: \"& VLOOKUP(A280,Configuration!$B$33:$C$52,2,FALSE)","v":"Data: "},"Answer","clearRow",{"$f":"IF(E279=\"Yes\", \"Yes\", IF(VLOOKUP(A280,Configuration!$B$33:$C$52,2,FALSE)=0, \"Yes\", \"No\"))","v":"Yes"},null,"",null,{"$f":"IF(VLOOKUP(A280,Usability!$A$12:$C$31,3,FALSE)=\"NA\", 0, IFERROR(VLOOKUP(C280,$Q$3:$R$6, 2, FALSE),\"N/A\"))","v":"N/A"},"N/A",null,{"$f":"IF(VLOOKUP(A280,Quality!$A$13:$H$32,8,FALSE)=\"NA\", 0, IFERROR(VLOOKUP(C280,$Q$3:$R$6, 2, FALSE),\"N/A\"))","v":"N/A"},"N/A"]
["S11",{"$f":"\"Data: \"& VLOOKUP(A281,Configuration!$B$33:$C$52,2,FALSE)","v":"Data: "},"Answer","clearRow",{"$f":"IF(E280=\"Yes\", \"Yes\", IF(VLOOKUP(A281,Configuration!$B$33:$C$52,2,FALSE)=0, \"Yes\", \"No\"))","v":"Yes"},null,"",null,{"$f":"IF(VLOOKUP(A281,Usability!$A$12:$C$31,3,FALSE)=\"NA\", 0, IFERROR(VLOOKUP(C281,$Q$3:$R$6, 2, FALSE),\"N/A\"))","v":"N/A"},"N/A",null,{"$f":"IF(VLOOKUP(A281,Quality!$A$13:$H$32,8,FALSE)=\"NA\", 0, IFERROR(VLOOKUP(C281,$Q$3:$R$6, 2, FALSE),\"N/A\"))","v":"N/A"},"N/A"]
["S12",{"$f":"\"Data: \"& VLOOKUP(A282,Configuration!$B$33:$C$52,2,FALSE)","v":"Data: "},"Answer","clearRow",{"$f":"IF(E281=\"Yes\", \"Yes\", IF(VLOOKUP(A282,Configuration!$B$33:$C$52,2,FALSE)=0, \"Yes\", \"No\"))","v":"Yes"},null,"",null,{"$f":"IF(VLOOKUP(A282,Usability!$A$12:$C$31,3,FALSE)=\"NA\", 0, IFERROR(VLOOKUP(C282,$Q$3:$R$6, 2, FALSE),\"N/A\"))","v":"N/A"},"N/A",null,{"$f":"IF(VLOOKUP(A282,Quality!$A$13:$H$32,8,FALSE)=\"NA\", 0, IFERROR(VLOOKUP(C282,$Q$3:$R$6, 2, FALSE),\"N/A\"))","v":"N/A"},"N/A"]
["S13",{"$f":"\"Data: \"& VLOOKUP(A283,Configuration!$B$33:$C$52,2,FALSE)","v":"Data: "},"Answer","clearRow",{"$f":"IF(E282=\"Yes\", \"Yes\", IF(VLOOKUP(A283,Configuration!$B$33:$C$52,2,FALSE)=0, \"Yes\", \"No\"))","v":"Yes"},null,"",null,{"$f":"IF(VLOOKUP(A283,Usability!$A$12:$C$31,3,FALSE)=\"NA\", 0, IFERROR(VLOOKUP(C283,$Q$3:$R$6, 2, FALSE),\"N/A\"))","v":"N/A"},"N/A",null,{"$f":"IF(VLOOKUP(A283,Quality!$A$13:$H$32,8,FALSE)=\"NA\", 0, IFERROR(VLOOKUP(C283,$Q$3:$R$6, 2, FALSE),\"N/A\"))","v":"N/A"},"N/A"]
["S14",{"$f":"\"Data: \"& VLOOKUP(A284,Configuration!$B$33:$C$52,2,FALSE)","v":"Data: "},"Answer","clearRow",{"$f":"IF(E283=\"Yes\", \"Yes\", IF(VLOOKUP(A284,Configuration!$B$33:$C$52,2,FALSE)=0, \"Yes\", \"No\"))","v":"Yes"},null,"",null,{"$f":"IF(VLOOKUP(A284,Usability!$A$12:$C$31,3,FALSE)=\"NA\", 0, IFERROR(VLOOKUP(C284,$Q$3:$R$6, 2, FALSE),\"N/A\"))","v":"N/A"},"N/A",null,{"$f":"IF(VLOOKUP(A284,Quality!$A$13:$H$32,8,FALSE)=\"NA\", 0, IFERROR(VLOOKUP(C284,$Q$3:$R$6, 2, FALSE),\"N/A\"))","v":"N/A"},"N/A"]
["S15",{"$f":"\"Data: \"& VLOOKUP(A285,Configuration!$B$33:$C$52,2,FALSE)","v":"Data: "},"Answer","clearRow",{"$f":"IF(E284=\"Yes\", \"Yes\", IF(VLOOKUP(A285,Configuration!$B$33:$C$52,2,FALSE)=0, \"Yes\", \"No\"))","v":"Yes"},null,"",null,{"$f":"IF(VLOOKUP(A285,Usability!$A$12:$C$31,3,FALSE)=\"NA\", 0, IFERROR(VLOOKUP(C285,$Q$3:$R$6, 2, FALSE),\"N/A\"))","v":"N/A"},"N/A",null,{"$f":"IF(VLOOKUP(A285,Quality!$A$13:$H$32,8,FALSE)=\"NA\", 0, IFERROR(VLOOKUP(C285,$Q$3:$R$6, 2, FALSE),\"N/A\"))","v":"N/A"},"N/A"]
["S16",{"$f":"\"Data: \"& VLOOKUP(A286,Configuration!$B$33:$C$52,2,FALSE)","v":"Data: "},"Answer","clearRow",{"$f":"IF(E285=\"Yes\", \"Yes\", IF(VLOOKUP(A286,Configuration!$B$33:$C$52,2,FALSE)=0, \"Yes\", \"No\"))","v":"Yes"},null,"",null,{"$f":"IF(VLOOKUP(A286,Usability!$A$12:$C$31,3,FALSE)=\"NA\", 0, IFERROR(VLOOKUP(C286,$Q$3:$R$6, 2, FALSE),\"N/A\"))","v":"N/A"},"N/A",null,{"$f":"IF(VLOOKUP(A286,Quality!$A$13:$H$32,8,FALSE)=\"NA\", 0, IFERROR(VLOOKUP(C286,$Q$3:$R$6, 2, FALSE),\"N/A\"))","v":"N/A"},"N/A"]
["S17",{"$f":"\"Data: \"& VLOOKUP(A287,Configuration!$B$33:$C$52,2,FALSE)","v":"Data: "},"Answer","clearRow",{"$f":"IF(E286=\"Yes\", \"Yes\", IF(VLOOKUP(A287,Configuration!$B$33:$C$52,2,FALSE)=0, \"Yes\", \"No\"))","v":"Yes"},null,"",null,{"$f":"IF(VLOOKUP(A287,Usability!$A$12:$C$31,3,FALSE)=\"NA\", 0, IFERROR(VLOOKUP(C287,$Q$3:$R$6, 2, FALSE),\"N/A\"))","v":"N/A"},"N/A",null,{"$f":"IF(VLOOKUP(A287,Quality!$A$13:$H$32,8,FALSE)=\"NA\", 0, IFERROR(VLOOKUP(C287,$Q$3:$R$6, 2, FALSE),\"N/A\"))","v":"N/A"},"N/A"]
["S18",{"$f":"\"Data: \"& VLOOKUP(A288,Configuration!$B$33:$C$52,2,FALSE)","v":"Data: "},"Answer","clearRow",{"$f":"IF(E287=\"Yes\", \"Yes\", IF(VLOOKUP(A288,Configuration!$B$33:$C$52,2,FALSE)=0, \"Yes\", \"No\"))","v":"Yes"},null,"",null,{"$f":"IF(VLOOKUP(A288,Usability!$A$12:$C$31,3,FALSE)=\"NA\", 0, IFERROR(VLOOKUP(C288,$Q$3:$R$6, 2, FALSE),\"N/A\"))","v":"N/A"},"N/A",null,{"$f":"IF(VLOOKUP(A288,Quality!$A$13:$H$32,8,FALSE)=\"NA\", 0, IFERROR(VLOOKUP(C288,$Q$3:$R$6, 2, FALSE),\"N/A\"))","v":"N/A"},"N/A"]
["S19",{"$f":"\"Data: \"& VLOOKUP(A289,Configuration!$B$33:$C$52,2,FALSE)","v":"Data: "},"Answer","clearRow",{"$f":"IF(E288=\"Yes\", \"Yes\", IF(VLOOKUP(A289,Configuration!$B$33:$C$52,2,FALSE)=0, \"Yes\", \"No\"))","v":"Yes"},null,"",null,{"$f":"IF(VLOOKUP(A289,Usability!$A$12:$C$31,3,FALSE)=\"NA\", 0, IFERROR(VLOOKUP(C289,$Q$3:$R$6, 2, FALSE),\"N/A\"))","v":"N/A"},"N/A",null,{"$f":"IF(VLOOKUP(A289,Quality!$A$13:$H$32,8,FALSE)=\"NA\", 0, IFERROR(VLOOKUP(C289,$Q$3:$R$6, 2, FALSE),\"N/A\"))","v":"N/A"},"N/A"]
["S20",{"$f":"\"Data: \"& VLOOKUP(A290,Configuration!$B$33:$C$52,2,FALSE)","v":"Data: "},"Answer","clearRow",{"$f":"IF(E289=\"Yes\", \"Yes\", IF(VLOOKUP(A290,Configuration!$B$33:$C$52,2,FALSE)=0, \"Yes\", \"No\"))","v":"Yes"},null,"",null,{"$f":"IF(VLOOKUP(A290,Usability!$A$12:$C$31,3,FALSE)=\"NA\", 0, IFERROR(VLOOKUP(C290,$Q$3:$R$6, 2, FALSE),\"N/A\"))","v":"N/A"},"N/A",null,{"$f":"IF(VLOOKUP(A290,Quality!$A$13:$H$32,8,FALSE)=\"NA\", 0, IFERROR(VLOOKUP(C290,$Q$3:$R$6, 2, FALSE),\"N/A\"))","v":"N/A"},"N/A"]
[null,null,null,null,{"$f":"IF(E270=\"Yes\", \"Yes\", \"No\")","v":"Yes"}]
[null,"Comments:",null,null,{"$f":"IF(E270=\"Yes\", \"Yes\", \"No\")","v":"Yes"}]
[null,null,null,null,{"$f":"IF(E270=\"Yes\", \"Yes\", \"No\")","v":"Yes"}]
[null,null,null,null,{"$f":"IF(E269=\"Yes\", \"Yes\", \"No\")","v":"Yes"}]
[null,null,null,null,{"$f":"IF(E270=\"Yes\", \"Yes\", \"No\")","v":"Yes"}]
["A12",{"$f":"\"Activity: \"& VLOOKUP(A296,Configuration!$B$11:$C$30,2, FALSE)","v":"Activity: "},"Importance Rating",null,{"$f":"IF(VLOOKUP(A296,Configuration!$B$11:$C$30,2,FALSE)=0,\"Yes\", \"No\")","v":"Yes"},null,null,null,{"$f":"SUM(I297:I316)","v":0},null,{"$f":"IF(OR(Progress4<>1, COUNT(G297:G316)<>COUNTIF(E297:E316,\"=No\")),\"\",SUMPRODUCT(J297:J316,Usability!$F$12:$F$31))","v":""},{"$f":"SUM(L297:L316)","v":0},null,{"$f":"IF(OR(Progress3<>1, COUNT(G297:G316)<>COUNTIF(E297:E316,\"=No\")),\"\",SUMPRODUCT(M297:M316,Quality!$H$13:$H$32))","v":""}]
["S1",{"$f":"\"Data: \"& VLOOKUP(A297,Configuration!$B$33:$C$52,2,FALSE)","v":"Data: Pavement Distress, Rutting and Roughness"},"Answer","clearRow",{"$f":"IF(E296=\"Yes\", \"Yes\", IF(VLOOKUP(A297,Configuration!$B$33:$C$52,2,FALSE)=0, \"Yes\", \"No\"))","v":"Yes"},null,{"$f":"IF(C297<>\"Answer\",1,\"\")","v":""},null,{"$f":"IF(VLOOKUP(A297,Usability!$A$12:$C$31,3,FALSE)=\"NA\", 0, IFERROR(VLOOKUP(C297,$Q$3:$R$6, 2, FALSE),\"N/A\"))","v":"N/A"},{"$f":"IFERROR(I297/$I$296,\"N/A\")","v":"N/A"},null,{"$f":"IF(VLOOKUP(A297,Quality!$A$13:$H$32,8,FALSE)=\"NA\", 0, IFERROR(VLOOKUP(C297,$Q$3:$R$6, 2, FALSE),\"N/A\"))","v":"N/A"},{"$f":"IFERROR(L297/$L$296,\"N/A\")","v":"N/A"}]
["S2",{"$f":"\"Data: \"& VLOOKUP(A298,Configuration!$B$33:$C$52,2,FALSE)","v":"Data: Linear Referencing (routes, intersections, mileposts)"},"Answer","clearRow",{"$f":"IF(E297=\"Yes\", \"Yes\", IF(VLOOKUP(A298,Configuration!$B$33:$C$52,2,FALSE)=0, \"Yes\", \"No\"))","v":"Yes"},null,"",null,{"$f":"IF(VLOOKUP(A298,Usability!$A$12:$C$31,3,FALSE)=\"NA\", 0, IFERROR(VLOOKUP(C298,$Q$3:$R$6, 2, FALSE),\"N/A\"))","v":"N/A"},{"$f":"IFERROR(I298/$I$296,\"N/A\")","v":"N/A"},null,{"$f":"IF(VLOOKUP(A298,Quality!$A$13:$H$32,8,FALSE)=\"NA\", 0, IFERROR(VLOOKUP(C298,$Q$3:$R$6, 2, FALSE),\"N/A\"))","v":"N/A"},"N/A"]
["S3",{"$f":"\"Data: \"& VLOOKUP(A299,Configuration!$B$33:$C$52,2,FALSE)","v":"Data: Traffic - AADT, Trucks, ESALS"},"Answer","clearRow",{"$f":"IF(E298=\"Yes\", \"Yes\", IF(VLOOKUP(A299,Configuration!$B$33:$C$52,2,FALSE)=0, \"Yes\", \"No\"))","v":"Yes"},null,"",null,{"$f":"IF(VLOOKUP(A299,Usability!$A$12:$C$31,3,FALSE)=\"NA\", 0, IFERROR(VLOOKUP(C299,$Q$3:$R$6, 2, FALSE),\"N/A\"))","v":"N/A"},"N/A",null,{"$f":"IF(VLOOKUP(A299,Quality!$A$13:$H$32,8,FALSE)=\"NA\", 0, IFERROR(VLOOKUP(C299,$Q$3:$R$6, 2, FALSE),\"N/A\"))","v":"N/A"},"N/A"]
["S4",{"$f":"\"Data: \"& VLOOKUP(A300,Configuration!$B$33:$C$52,2,FALSE)","v":"Data: Pavement Structure Characteristics"},"Answer","clearRow",{"$f":"IF(E299=\"Yes\", \"Yes\", IF(VLOOKUP(A300,Configuration!$B$33:$C$52,2,FALSE)=0, \"Yes\", \"No\"))","v":"Yes"},null,"",null,{"$f":"IF(VLOOKUP(A300,Usability!$A$12:$C$31,3,FALSE)=\"NA\", 0, IFERROR(VLOOKUP(C300,$Q$3:$R$6, 2, FALSE),\"N/A\"))","v":"N/A"},"N/A",null,{"$f":"IF(VLOOKUP(A300,Quality!$A$13:$H$32,8,FALSE)=\"NA\", 0, IFERROR(VLOOKUP(C300,$Q$3:$R$6, 2, FALSE),\"N/A\"))","v":"N/A"},"N/A"]
["S5",{"$f":"\"Data: \"& VLOOKUP(A301,Configuration!$B$33:$C$52,2,FALSE)","v":"Data: Road Inventory: # Lanes, Functional Class"},"Answer","clearRow",{"$f":"IF(E300=\"Yes\", \"Yes\", IF(VLOOKUP(A301,Configuration!$B$33:$C$52,2,FALSE)=0, \"Yes\", \"No\"))","v":"Yes"},null,"",null,{"$f":"IF(VLOOKUP(A301,Usability!$A$12:$C$31,3,FALSE)=\"NA\", 0, IFERROR(VLOOKUP(C301,$Q$3:$R$6, 2, FALSE),\"N/A\"))","v":"N/A"},"N/A",null,{"$f":"IF(VLOOKUP(A301,Quality!$A$13:$H$32,8,FALSE)=\"NA\", 0, IFERROR(VLOOKUP(C301,$Q$3:$R$6, 2, FALSE),\"N/A\"))","v":"N/A"},"N/A"]
["S6",{"$f":"\"Data: \"& VLOOKUP(A302,Configuration!$B$33:$C$52,2,FALSE)","v":"Data: "},"Answer","clearRow",{"$f":"IF(E301=\"Yes\", \"Yes\", IF(VLOOKUP(A302,Configuration!$B$33:$C$52,2,FALSE)=0, \"Yes\", \"No\"))","v":"Yes"},null,"",null,{"$f":"IF(VLOOKUP(A302,Usability!$A$12:$C$31,3,FALSE)=\"NA\", 0, IFERROR(VLOOKUP(C302,$Q$3:$R$6, 2, FALSE),\"N/A\"))","v":"N/A"},"N/A",null,{"$f":"IF(VLOOKUP(A302,Quality!$A$13:$H$32,8,FALSE)=\"NA\", 0, IFERROR(VLOOKUP(C302,$Q$3:$R$6, 2, FALSE),\"N/A\"))","v":"N/A"},"N/A"]
["S7",{"$f":"\"Data: \"& VLOOKUP(A303,Configuration!$B$33:$C$52,2,FALSE)","v":"Data: "},"Answer","clearRow",{"$f":"IF(E302=\"Yes\", \"Yes\", IF(VLOOKUP(A303,Configuration!$B$33:$C$52,2,FALSE)=0, \"Yes\", \"No\"))","v":"Yes"},null,"",null,{"$f":"IF(VLOOKUP(A303,Usability!$A$12:$C$31,3,FALSE)=\"NA\", 0, IFERROR(VLOOKUP(C303,$Q$3:$R$6, 2, FALSE),\"N/A\"))","v":"N/A"},"N/A",null,{"$f":"IF(VLOOKUP(A303,Quality!$A$13:$H$32,8,FALSE)=\"NA\", 0, IFERROR(VLOOKUP(C303,$Q$3:$R$6, 2, FALSE),\"N/A\"))","v":"N/A"},"N/A"]
["S8",{"$f":"\"Data: \"& VLOOKUP(A304,Configuration!$B$33:$C$52,2,FALSE)","v":"Data: "},"Answer","clearRow",{"$f":"IF(E303=\"Yes\", \"Yes\", IF(VLOOKUP(A304,Configuration!$B$33:$C$52,2,FALSE)=0, \"Yes\", \"No\"))","v":"Yes"},null,"",null,{"$f":"IF(VLOOKUP(A304,Usability!$A$12:$C$31,3,FALSE)=\"NA\", 0, IFERROR(VLOOKUP(C304,$Q$3:$R$6, 2, FALSE),\"N/A\"))","v":"N/A"},"N/A",null,{"$f":"IF(VLOOKUP(A304,Quality!$A$13:$H$32,8,FALSE)=\"NA\", 0, IFERROR(VLOOKUP(C304,$Q$3:$R$6, 2, FALSE),\"N/A\"))","v":"N/A"},"N/A"]
["S9",{"$f":"\"Data: \"& VLOOKUP(A305,Configuration!$B$33:$C$52,2,FALSE)","v":"Data: "},"Answer","clearRow",{"$f":"IF(E304=\"Yes\", \"Yes\", IF(VLOOKUP(A305,Configuration!$B$33:$C$52,2,FALSE)=0, \"Yes\", \"No\"))","v":"Yes"},null,"",null,{"$f":"IF(VLOOKUP(A305,Usability!$A$12:$C$31,3,FALSE)=\"NA\", 0, IFERROR(VLOOKUP(C305,$Q$3:$R$6, 2, FALSE),\"N/A\"))","v":"N/A"},"N/A",null,{"$f":"IF(VLOOKUP(A305,Quality!$A$13:$H$32,8,FALSE)=\"NA\", 0, IFERROR(VLOOKUP(C305,$Q$3:$R$6, 2, FALSE),\"N/A\"))","v":"N/A"},"N/A"]
["S10",{"$f":"\"Data: \"& VLOOKUP(A306,Configuration!$B$33:$C$52,2,FALSE)","v":"Data: "},"Answer","clearRow",{"$f":"IF(E305=\"Yes\", \"Yes\", IF(VLOOKUP(A306,Configuration!$B$33:$C$52,2,FALSE)=0, \"Yes\", \"No\"))","v":"Yes"},null,"",null,{"$f":"IF(VLOOKUP(A306,Usability!$A$12:$C$31,3,FALSE)=\"NA\", 0, IFERROR(VLOOKUP(C306,$Q$3:$R$6, 2, FALSE),\"N/A\"))","v":"N/A"},"N/A",null,{"$f":"IF(VLOOKUP(A306,Quality!$A$13:$H$32,8,FALSE)=\"NA\", 0, IFERROR(VLOOKUP(C306,$Q$3:$R$6, 2, FALSE),\"N/A\"))","v":"N/A"},"N/A"]
["S11",{"$f":"\"Data: \"& VLOOKUP(A307,Configuration!$B$33:$C$52,2,FALSE)","v":"Data: "},"Answer","clearRow",{"$f":"IF(E306=\"Yes\", \"Yes\", IF(VLOOKUP(A307,Configuration!$B$33:$C$52,2,FALSE)=0, \"Yes\", \"No\"))","v":"Yes"},null,"",null,{"$f":"IF(VLOOKUP(A307,Usability!$A$12:$C$31,3,FALSE)=\"NA\", 0, IFERROR(VLOOKUP(C307,$Q$3:$R$6, 2, FALSE),\"N/A\"))","v":"N/A"},"N/A",null,{"$f":"IF(VLOOKUP(A307,Quality!$A$13:$H$32,8,FALSE)=\"NA\", 0, IFERROR(VLOOKUP(C307,$Q$3:$R$6, 2, FALSE),\"N/A\"))","v":"N/A"},"N/A"]
["S12",{"$f":"\"Data: \"& VLOOKUP(A308,Configuration!$B$33:$C$52,2,FALSE)","v":"Data: "},"Answer","clearRow",{"$f":"IF(E307=\"Yes\", \"Yes\", IF(VLOOKUP(A308,Configuration!$B$33:$C$52,2,FALSE)=0, \"Yes\", \"No\"))","v":"Yes"},null,"",null,{"$f":"IF(VLOOKUP(A308,Usability!$A$12:$C$31,3,FALSE)=\"NA\", 0, IFERROR(VLOOKUP(C308,$Q$3:$R$6, 2, FALSE),\"N/A\"))","v":"N/A"},"N/A",null,{"$f":"IF(VLOOKUP(A308,Quality!$A$13:$H$32,8,FALSE)=\"NA\", 0, IFERROR(VLOOKUP(C308,$Q$3:$R$6, 2, FALSE),\"N/A\"))","v":"N/A"},"N/A"]
["S13",{"$f":"\"Data: \"& VLOOKUP(A309,Configuration!$B$33:$C$52,2,FALSE)","v":"Data: "},"Answer","clearRow",{"$f":"IF(E308=\"Yes\", \"Yes\", IF(VLOOKUP(A309,Configuration!$B$33:$C$52,2,FALSE)=0, \"Yes\", \"No\"))","v":"Yes"},null,"",null,{"$f":"IF(VLOOKUP(A309,Usability!$A$12:$C$31,3,FALSE)=\"NA\", 0, IFERROR(VLOOKUP(C309,$Q$3:$R$6, 2, FALSE),\"N/A\"))","v":"N/A"},"N/A",null,{"$f":"IF(VLOOKUP(A309,Quality!$A$13:$H$32,8,FALSE)=\"NA\", 0, IFERROR(VLOOKUP(C309,$Q$3:$R$6, 2, FALSE),\"N/A\"))","v":"N/A"},"N/A"]
["S14",{"$f":"\"Data: \"& VLOOKUP(A310,Configuration!$B$33:$C$52,2,FALSE)","v":"Data: "},"Answer","clearRow",{"$f":"IF(E309=\"Yes\", \"Yes\", IF(VLOOKUP(A310,Configuration!$B$33:$C$52,2,FALSE)=0, \"Yes\", \"No\"))","v":"Yes"},null,"",null,{"$f":"IF(VLOOKUP(A310,Usability!$A$12:$C$31,3,FALSE)=\"NA\", 0, IFERROR(VLOOKUP(C310,$Q$3:$R$6, 2, FALSE),\"N/A\"))","v":"N/A"},"N/A",null,{"$f":"IF(VLOOKUP(A310,Quality!$A$13:$H$32,8,FALSE)=\"NA\", 0, IFERROR(VLOOKUP(C310,$Q$3:$R$6, 2, FALSE),\"N/A\"))","v":"N/A"},"N/A"]
["S15",{"$f":"\"Data: \"& VLOOKUP(A311,Configuration!$B$33:$C$52,2,FALSE)","v":"Data: "},"Answer","clearRow",{"$f":"IF(E310=\"Yes\", \"Yes\", IF(VLOOKUP(A311,Configuration!$B$33:$C$52,2,FALSE)=0, \"Yes\", \"No\"))","v":"Yes"},null,"",null,{"$f":"IF(VLOOKUP(A311,Usability!$A$12:$C$31,3,FALSE)=\"NA\", 0, IFERROR(VLOOKUP(C311,$Q$3:$R$6, 2, FALSE),\"N/A\"))","v":"N/A"},"N/A",null,{"$f":"IF(VLOOKUP(A311,Quality!$A$13:$H$32,8,FALSE)=\"NA\", 0, IFERROR(VLOOKUP(C311,$Q$3:$R$6, 2, FALSE),\"N/A\"))","v":"N/A"},"N/A"]
["S16",{"$f":"\"Data: \"& VLOOKUP(A312,Configuration!$B$33:$C$52,2,FALSE)","v":"Data: "},"Answer","clearRow",{"$f":"IF(E311=\"Yes\", \"Yes\", IF(VLOOKUP(A312,Configuration!$B$33:$C$52,2,FALSE)=0, \"Yes\", \"No\"))","v":"Yes"},null,"",null,{"$f":"IF(VLOOKUP(A312,Usability!$A$12:$C$31,3,FALSE)=\"NA\", 0, IFERROR(VLOOKUP(C312,$Q$3:$R$6, 2, FALSE),\"N/A\"))","v":"N/A"},"N/A",null,{"$f":"IF(VLOOKUP(A312,Quality!$A$13:$H$32,8,FALSE)=\"NA\", 0, IFERROR(VLOOKUP(C312,$Q$3:$R$6, 2, FALSE),\"N/A\"))","v":"N/A"},"N/A"]
["S17",{"$f":"\"Data: \"& VLOOKUP(A313,Configuration!$B$33:$C$52,2,FALSE)","v":"Data: "},"Answer","clearRow",{"$f":"IF(E312=\"Yes\", \"Yes\", IF(VLOOKUP(A313,Configuration!$B$33:$C$52,2,FALSE)=0, \"Yes\", \"No\"))","v":"Yes"},null,"",null,{"$f":"IF(VLOOKUP(A313,Usability!$A$12:$C$31,3,FALSE)=\"NA\", 0, IFERROR(VLOOKUP(C313,$Q$3:$R$6, 2, FALSE),\"N/A\"))","v":"N/A"},"N/A",null,{"$f":"IF(VLOOKUP(A313,Quality!$A$13:$H$32,8,FALSE)=\"NA\", 0, IFERROR(VLOOKUP(C313,$Q$3:$R$6, 2, FALSE),\"N/A\"))","v":"N/A"},"N/A"]
["S18",{"$f":"\"Data: \"& VLOOKUP(A314,Configuration!$B$33:$C$52,2,FALSE)","v":"Data: "},"Answer","clearRow",{"$f":"IF(E313=\"Yes\", \"Yes\", IF(VLOOKUP(A314,Configuration!$B$33:$C$52,2,FALSE)=0, \"Yes\", \"No\"))","v":"Yes"},null,"",null,{"$f":"IF(VLOOKUP(A314,Usability!$A$12:$C$31,3,FALSE)=\"NA\", 0, IFERROR(VLOOKUP(C314,$Q$3:$R$6, 2, FALSE),\"N/A\"))","v":"N/A"},"N/A",null,{"$f":"IF(VLOOKUP(A314,Quality!$A$13:$H$32,8,FALSE)=\"NA\", 0, IFERROR(VLOOKUP(C314,$Q$3:$R$6, 2, FALSE),\"N/A\"))","v":"N/A"},"N/A"]
["S19",{"$f":"\"Data: \"& VLOOKUP(A315,Configuration!$B$33:$C$52,2,FALSE)","v":"Data: "},"Answer","clearRow",{"$f":"IF(E314=\"Yes\", \"Yes\", IF(VLOOKUP(A315,Configuration!$B$33:$C$52,2,FALSE)=0, \"Yes\", \"No\"))","v":"Yes"},null,"",null,{"$f":"IF(VLOOKUP(A315,Usability!$A$12:$C$31,3,FALSE)=\"NA\", 0, IFERROR(VLOOKUP(C315,$Q$3:$R$6, 2, FALSE),\"N/A\"))","v":"N/A"},"N/A",null,{"$f":"IF(VLOOKUP(A315,Quality!$A$13:$H$32,8,FALSE)=\"NA\", 0, IFERROR(VLOOKUP(C315,$Q$3:$R$6, 2, FALSE),\"N/A\"))","v":"N/A"},"N/A"]
["S20",{"$f":"\"Data: \"& VLOOKUP(A316,Configuration!$B$33:$C$52,2,FALSE)","v":"Data: "},"Answer","clearRow",{"$f":"IF(E315=\"Yes\", \"Yes\", IF(VLOOKUP(A316,Configuration!$B$33:$C$52,2,FALSE)=0, \"Yes\", \"No\"))","v":"Yes"},null,"",null,{"$f":"IF(VLOOKUP(A316,Usability!$A$12:$C$31,3,FALSE)=\"NA\", 0, IFERROR(VLOOKUP(C316,$Q$3:$R$6, 2, FALSE),\"N/A\"))","v":"N/A"},"N/A",null,{"$f":"IF(VLOOKUP(A316,Quality!$A$13:$H$32,8,FALSE)=\"NA\", 0, IFERROR(VLOOKUP(C316,$Q$3:$R$6, 2, FALSE),\"N/A\"))","v":"N/A"},"N/A"]
[null,null,null,null,{"$f":"IF(E296=\"Yes\", \"Yes\", \"No\")","v":"Yes"}]
[null,"Comments:",null,null,{"$f":"IF(E296=\"Yes\", \"Yes\", \"No\")","v":"Yes"}]
[null,null,null,null,{"$f":"IF(E296=\"Yes\", \"Yes\", \"No\")","v":"Yes"}]
[null,null,null,null,{"$f":"IF(E295=\"Yes\", \"Yes\", \"No\")","v":"Yes"}]
[null,null,null,null,{"$f":"IF(E296=\"Yes\", \"Yes\", \"No\")","v":"Yes"}]
["A13",{"$f":"\"Activity: \"& VLOOKUP(A322,Configuration!$B$11:$C$30,2, FALSE)","v":"Activity: "},"Importance Rating",null,{"$f":"IF(VLOOKUP(A322,Configuration!$B$11:$C$30,2,FALSE)=0,\"Yes\", \"No\")","v":"Yes"},null,null,null,{"$f":"SUM(I323:I342)","v":0},null,{"$f":"IF(OR(Progress4<>1, COUNT(G323:G342)<>COUNTIF(E323:E342,\"=No\")),\"\",SUMPRODUCT(J323:J342,Usability!$F$12:$F$31))","v":""},{"$f":"SUM(L323:L342)","v":0},null,{"$f":"IF(OR(Progress3<>1, COUNT(G323:G342)<>COUNTIF(E323:E342,\"=No\")),\"\",SUMPRODUCT(M323:M342,Quality!$H$13:$H$32))","v":""}]
["S1",{"$f":"\"Data: \"& VLOOKUP(A323,Configuration!$B$33:$C$52,2,FALSE)","v":"Data: Pavement Distress, Rutting and Roughness"},"Answer","clearRow",{"$f":"IF(E322=\"Yes\", \"Yes\", IF(VLOOKUP(A323,Configuration!$B$33:$C$52,2,FALSE)=0, \"Yes\", \"No\"))","v":"Yes"},null,{"$f":"IF(C323<>\"Answer\",1,\"\")","v":""},null,{"$f":"IF(VLOOKUP(A323,Usability!$A$12:$C$31,3,FALSE)=\"NA\", 0, IFERROR(VLOOKUP(C323,$Q$3:$R$6, 2, FALSE),\"N/A\"))","v":"N/A"},{"$f":"IFERROR(I323/$I$322,\"N/A\")","v":"N/A"},null,{"$f":"IF(VLOOKUP(A323,Quality!$A$13:$H$32,8,FALSE)=\"NA\", 0, IFERROR(VLOOKUP(C323,$Q$3:$R$6, 2, FALSE),\"N/A\"))","v":"N/A"},{"$f":"IFERROR(L323/$L$322,\"N/A\")","v":"N/A"}]
["S2",{"$f":"\"Data: \"& VLOOKUP(A324,Configuration!$B$33:$C$52,2,FALSE)","v":"Data: Linear Referencing (routes, intersections, mileposts)"},"Answer","clearRow",{"$f":"IF(E323=\"Yes\", \"Yes\", IF(VLOOKUP(A324,Configuration!$B$33:$C$52,2,FALSE)=0, \"Yes\", \"No\"))","v":"Yes"},null,"",null,{"$f":"IF(VLOOKUP(A324,Usability!$A$12:$C$31,3,FALSE)=\"NA\", 0, IFERROR(VLOOKUP(C324,$Q$3:$R$6, 2, FALSE),\"N/A\"))","v":"N/A"},{"$f":"IFERROR(I324/$I$322,\"N/A\")","v":"N/A"},null,{"$f":"IF(VLOOKUP(A324,Quality!$A$13:$H$32,8,FALSE)=\"NA\", 0, IFERROR(VLOOKUP(C324,$Q$3:$R$6, 2, FALSE),\"N/A\"))","v":"N/A"},"N/A"]
["S3",{"$f":"\"Data: \"& VLOOKUP(A325,Configuration!$B$33:$C$52,2,FALSE)","v":"Data: Traffic - AADT, Trucks, ESALS"},"Answer","clearRow",{"$f":"IF(E324=\"Yes\", \"Yes\", IF(VLOOKUP(A325,Configuration!$B$33:$C$52,2,FALSE)=0, \"Yes\", \"No\"))","v":"Yes"},null,"",null,{"$f":"IF(VLOOKUP(A325,Usability!$A$12:$C$31,3,FALSE)=\"NA\", 0, IFERROR(VLOOKUP(C325,$Q$3:$R$6, 2, FALSE),\"N/A\"))","v":"N/A"},"N/A",null,{"$f":"IF(VLOOKUP(A325,Quality!$A$13:$H$32,8,FALSE)=\"NA\", 0, IFERROR(VLOOKUP(C325,$Q$3:$R$6, 2, FALSE),\"N/A\"))","v":"N/A"},"N/A"]
["S4",{"$f":"\"Data: \"& VLOOKUP(A326,Configuration!$B$33:$C$52,2,FALSE)","v":"Data: Pavement Structure Characteristics"},"Answer","clearRow",{"$f":"IF(E325=\"Yes\", \"Yes\", IF(VLOOKUP(A326,Configuration!$B$33:$C$52,2,FALSE)=0, \"Yes\", \"No\"))","v":"Yes"},null,"",null,{"$f":"IF(VLOOKUP(A326,Usability!$A$12:$C$31,3,FALSE)=\"NA\", 0, IFERROR(VLOOKUP(C326,$Q$3:$R$6, 2, FALSE),\"N/A\"))","v":"N/A"},"N/A",null,{"$f":"IF(VLOOKUP(A326,Quality!$A$13:$H$32,8,FALSE)=\"NA\", 0, IFERROR(VLOOKUP(C326,$Q$3:$R$6, 2, FALSE),\"N/A\"))","v":"N/A"},"N/A"]
["S5",{"$f":"\"Data: \"& VLOOKUP(A327,Configuration!$B$33:$C$52,2,FALSE)","v":"Data: Road Inventory: # Lanes, Functional Class"},"Answer","clearRow",{"$f":"IF(E326=\"Yes\", \"Yes\", IF(VLOOKUP(A327,Configuration!$B$33:$C$52,2,FALSE)=0, \"Yes\", \"No\"))","v":"Yes"},null,"",null,{"$f":"IF(VLOOKUP(A327,Usability!$A$12:$C$31,3,FALSE)=\"NA\", 0, IFERROR(VLOOKUP(C327,$Q$3:$R$6, 2, FALSE),\"N/A\"))","v":"N/A"},"N/A",null,{"$f":"IF(VLOOKUP(A327,Quality!$A$13:$H$32,8,FALSE)=\"NA\", 0, IFERROR(VLOOKUP(C327,$Q$3:$R$6, 2, FALSE),\"N/A\"))","v":"N/A"},"N/A"]
["S6",{"$f":"\"Data: \"& VLOOKUP(A328,Configuration!$B$33:$C$52,2,FALSE)","v":"Data: "},"Answer","clearRow",{"$f":"IF(E327=\"Yes\", \"Yes\", IF(VLOOKUP(A328,Configuration!$B$33:$C$52,2,FALSE)=0, \"Yes\", \"No\"))","v":"Yes"},null,"",null,{"$f":"IF(VLOOKUP(A328,Usability!$A$12:$C$31,3,FALSE)=\"NA\", 0, IFERROR(VLOOKUP(C328,$Q$3:$R$6, 2, FALSE),\"N/A\"))","v":"N/A"},"N/A",null,{"$f":"IF(VLOOKUP(A328,Quality!$A$13:$H$32,8,FALSE)=\"NA\", 0, IFERROR(VLOOKUP(C328,$Q$3:$R$6, 2, FALSE),\"N/A\"))","v":"N/A"},"N/A"]
["S7",{"$f":"\"Data: \"& VLOOKUP(A329,Configuration!$B$33:$C$52,2,FALSE)","v":"Data: "},"Answer","clearRow",{"$f":"IF(E328=\"Yes\", \"Yes\", IF(VLOOKUP(A329,Configuration!$B$33:$C$52,2,FALSE)=0, \"Yes\", \"No\"))","v":"Yes"},null,"",null,{"$f":"IF(VLOOKUP(A329,Usability!$A$12:$C$31,3,FALSE)=\"NA\", 0, IFERROR(VLOOKUP(C329,$Q$3:$R$6, 2, FALSE),\"N/A\"))","v":"N/A"},"N/A",null,{"$f":"IF(VLOOKUP(A329,Quality!$A$13:$H$32,8,FALSE)=\"NA\", 0, IFERROR(VLOOKUP(C329,$Q$3:$R$6, 2, FALSE),\"N/A\"))","v":"N/A"},"N/A"]
["S8",{"$f":"\"Data: \"& VLOOKUP(A330,Configuration!$B$33:$C$52,2,FALSE)","v":"Data: "},"Answer","clearRow",{"$f":"IF(E329=\"Yes\", \"Yes\", IF(VLOOKUP(A330,Configuration!$B$33:$C$52,2,FALSE)=0, \"Yes\", \"No\"))","v":"Yes"},null,"",null,{"$f":"IF(VLOOKUP(A330,Usability!$A$12:$C$31,3,FALSE)=\"NA\", 0, IFERROR(VLOOKUP(C330,$Q$3:$R$6, 2, FALSE),\"N/A\"))","v":"N/A"},"N/A",null,{"$f":"IF(VLOOKUP(A330,Quality!$A$13:$H$32,8,FALSE)=\"NA\", 0, IFERROR(VLOOKUP(C330,$Q$3:$R$6, 2, FALSE),\"N/A\"))","v":"N/A"},"N/A"]
["S9",{"$f":"\"Data: \"& VLOOKUP(A331,Configuration!$B$33:$C$52,2,FALSE)","v":"Data: "},"Answer","clearRow",{"$f":"IF(E330=\"Yes\", \"Yes\", IF(VLOOKUP(A331,Configuration!$B$33:$C$52,2,FALSE)=0, \"Yes\", \"No\"))","v":"Yes"},null,"",null,{"$f":"IF(VLOOKUP(A331,Usability!$A$12:$C$31,3,FALSE)=\"NA\", 0, IFERROR(VLOOKUP(C331,$Q$3:$R$6, 2, FALSE),\"N/A\"))","v":"N/A"},"N/A",null,{"$f":"IF(VLOOKUP(A331,Quality!$A$13:$H$32,8,FALSE)=\"NA\", 0, IFERROR(VLOOKUP(C331,$Q$3:$R$6, 2, FALSE),\"N/A\"))","v":"N/A"},"N/A"]
["S10",{"$f":"\"Data: \"& VLOOKUP(A332,Configuration!$B$33:$C$52,2,FALSE)","v":"Data: "},"Answer","clearRow",{"$f":"IF(E331=\"Yes\", \"Yes\", IF(VLOOKUP(A332,Configuration!$B$33:$C$52,2,FALSE)=0, \"Yes\", \"No\"))","v":"Yes"},null,"",null,{"$f":"IF(VLOOKUP(A332,Usability!$A$12:$C$31,3,FALSE)=\"NA\", 0, IFERROR(VLOOKUP(C332,$Q$3:$R$6, 2, FALSE),\"N/A\"))","v":"N/A"},"N/A",null,{"$f":"IF(VLOOKUP(A332,Quality!$A$13:$H$32,8,FALSE)=\"NA\", 0, IFERROR(VLOOKUP(C332,$Q$3:$R$6, 2, FALSE),\"N/A\"))","v":"N/A"},"N/A"]
["S11",{"$f":"\"Data: \"& VLOOKUP(A333,Configuration!$B$33:$C$52,2,FALSE)","v":"Data: "},"Answer","clearRow",{"$f":"IF(E332=\"Yes\", \"Yes\", IF(VLOOKUP(A333,Configuration!$B$33:$C$52,2,FALSE)=0, \"Yes\", \"No\"))","v":"Yes"},null,"",null,{"$f":"IF(VLOOKUP(A333,Usability!$A$12:$C$31,3,FALSE)=\"NA\", 0, IFERROR(VLOOKUP(C333,$Q$3:$R$6, 2, FALSE),\"N/A\"))","v":"N/A"},"N/A",null,{"$f":"IF(VLOOKUP(A333,Quality!$A$13:$H$32,8,FALSE)=\"NA\", 0, IFERROR(VLOOKUP(C333,$Q$3:$R$6, 2, FALSE),\"N/A\"))","v":"N/A"},"N/A"]
["S12",{"$f":"\"Data: \"& VLOOKUP(A334,Configuration!$B$33:$C$52,2,FALSE)","v":"Data: "},"Answer","clearRow",{"$f":"IF(E333=\"Yes\", \"Yes\", IF(VLOOKUP(A334,Configuration!$B$33:$C$52,2,FALSE)=0, \"Yes\", \"No\"))","v":"Yes"},null,"",null,{"$f":"IF(VLOOKUP(A334,Usability!$A$12:$C$31,3,FALSE)=\"NA\", 0, IFERROR(VLOOKUP(C334,$Q$3:$R$6, 2, FALSE),\"N/A\"))","v":"N/A"},"N/A",null,{"$f":"IF(VLOOKUP(A334,Quality!$A$13:$H$32,8,FALSE)=\"NA\", 0, IFERROR(VLOOKUP(C334,$Q$3:$R$6, 2, FALSE),\"N/A\"))","v":"N/A"},"N/A"]
["S13",{"$f":"\"Data: \"& VLOOKUP(A335,Configuration!$B$33:$C$52,2,FALSE)","v":"Data: "},"Answer","clearRow",{"$f":"IF(E334=\"Yes\", \"Yes\", IF(VLOOKUP(A335,Configuration!$B$33:$C$52,2,FALSE)=0, \"Yes\", \"No\"))","v":"Yes"},null,"",null,{"$f":"IF(VLOOKUP(A335,Usability!$A$12:$C$31,3,FALSE)=\"NA\", 0, IFERROR(VLOOKUP(C335,$Q$3:$R$6, 2, FALSE),\"N/A\"))","v":"N/A"},"N/A",null,{"$f":"IF(VLOOKUP(A335,Quality!$A$13:$H$32,8,FALSE)=\"NA\", 0, IFERROR(VLOOKUP(C335,$Q$3:$R$6, 2, FALSE),\"N/A\"))","v":"N/A"},"N/A"]
["S14",{"$f":"\"Data: \"& VLOOKUP(A336,Configuration!$B$33:$C$52,2,FALSE)","v":"Data: "},"Answer","clearRow",{"$f":"IF(E335=\"Yes\", \"Yes\", IF(VLOOKUP(A336,Configuration!$B$33:$C$52,2,FALSE)=0, \"Yes\", \"No\"))","v":"Yes"},null,"",null,{"$f":"IF(VLOOKUP(A336,Usability!$A$12:$C$31,3,FALSE)=\"NA\", 0, IFERROR(VLOOKUP(C336,$Q$3:$R$6, 2, FALSE),\"N/A\"))","v":"N/A"},"N/A",null,{"$f":"IF(VLOOKUP(A336,Quality!$A$13:$H$32,8,FALSE)=\"NA\", 0, IFERROR(VLOOKUP(C336,$Q$3:$R$6, 2, FALSE),\"N/A\"))","v":"N/A"},"N/A"]
["S15",{"$f":"\"Data: \"& VLOOKUP(A337,Configuration!$B$33:$C$52,2,FALSE)","v":"Data: "},"Answer","clearRow",{"$f":"IF(E336=\"Yes\", \"Yes\", IF(VLOOKUP(A337,Configuration!$B$33:$C$52,2,FALSE)=0, \"Yes\", \"No\"))","v":"Yes"},null,"",null,{"$f":"IF(VLOOKUP(A337,Usability!$A$12:$C$31,3,FALSE)=\"NA\", 0, IFERROR(VLOOKUP(C337,$Q$3:$R$6, 2, FALSE),\"N/A\"))","v":"N/A"},"N/A",null,{"$f":"IF(VLOOKUP(A337,Quality!$A$13:$H$32,8,FALSE)=\"NA\", 0, IFERROR(VLOOKUP(C337,$Q$3:$R$6, 2, FALSE),\"N/A\"))","v":"N/A"},"N/A"]
["S16",{"$f":"\"Data: \"& VLOOKUP(A338,Configuration!$B$33:$C$52,2,FALSE)","v":"Data: "},"Answer","clearRow",{"$f":"IF(E337=\"Yes\", \"Yes\", IF(VLOOKUP(A338,Configuration!$B$33:$C$52,2,FALSE)=0, \"Yes\", \"No\"))","v":"Yes"},null,"",null,{"$f":"IF(VLOOKUP(A338,Usability!$A$12:$C$31,3,FALSE)=\"NA\", 0, IFERROR(VLOOKUP(C338,$Q$3:$R$6, 2, FALSE),\"N/A\"))","v":"N/A"},"N/A",null,{"$f":"IF(VLOOKUP(A338,Quality!$A$13:$H$32,8,FALSE)=\"NA\", 0, IFERROR(VLOOKUP(C338,$Q$3:$R$6, 2, FALSE),\"N/A\"))","v":"N/A"},"N/A"]
["S17",{"$f":"\"Data: \"& VLOOKUP(A339,Configuration!$B$33:$C$52,2,FALSE)","v":"Data: "},"Answer","clearRow",{"$f":"IF(E338=\"Yes\", \"Yes\", IF(VLOOKUP(A339,Configuration!$B$33:$C$52,2,FALSE)=0, \"Yes\", \"No\"))","v":"Yes"},null,"",null,{"$f":"IF(VLOOKUP(A339,Usability!$A$12:$C$31,3,FALSE)=\"NA\", 0, IFERROR(VLOOKUP(C339,$Q$3:$R$6, 2, FALSE),\"N/A\"))","v":"N/A"},"N/A",null,{"$f":"IF(VLOOKUP(A339,Quality!$A$13:$H$32,8,FALSE)=\"NA\", 0, IFERROR(VLOOKUP(C339,$Q$3:$R$6, 2, FALSE),\"N/A\"))","v":"N/A"},"N/A"]
["S18",{"$f":"\"Data: \"& VLOOKUP(A340,Configuration!$B$33:$C$52,2,FALSE)","v":"Data: "},"Answer","clearRow",{"$f":"IF(E339=\"Yes\", \"Yes\", IF(VLOOKUP(A340,Configuration!$B$33:$C$52,2,FALSE)=0, \"Yes\", \"No\"))","v":"Yes"},null,"",null,{"$f":"IF(VLOOKUP(A340,Usability!$A$12:$C$31,3,FALSE)=\"NA\", 0, IFERROR(VLOOKUP(C340,$Q$3:$R$6, 2, FALSE),\"N/A\"))","v":"N/A"},"N/A",null,{"$f":"IF(VLOOKUP(A340,Quality!$A$13:$H$32,8,FALSE)=\"NA\", 0, IFERROR(VLOOKUP(C340,$Q$3:$R$6, 2, FALSE),\"N/A\"))","v":"N/A"},"N/A"]
["S19",{"$f":"\"Data: \"& VLOOKUP(A341,Configuration!$B$33:$C$52,2,FALSE)","v":"Data: "},"Answer","clearRow",{"$f":"IF(E340=\"Yes\", \"Yes\", IF(VLOOKUP(A341,Configuration!$B$33:$C$52,2,FALSE)=0, \"Yes\", \"No\"))","v":"Yes"},null,"",null,{"$f":"IF(VLOOKUP(A341,Usability!$A$12:$C$31,3,FALSE)=\"NA\", 0, IFERROR(VLOOKUP(C341,$Q$3:$R$6, 2, FALSE),\"N/A\"))","v":"N/A"},"N/A",null,{"$f":"IF(VLOOKUP(A341,Quality!$A$13:$H$32,8,FALSE)=\"NA\", 0, IFERROR(VLOOKUP(C341,$Q$3:$R$6, 2, FALSE),\"N/A\"))","v":"N/A"},"N/A"]
["S20",{"$f":"\"Data: \"& VLOOKUP(A342,Configuration!$B$33:$C$52,2,FALSE)","v":"Data: "},"Answer","clearRow",{"$f":"IF(E341=\"Yes\", \"Yes\", IF(VLOOKUP(A342,Configuration!$B$33:$C$52,2,FALSE)=0, \"Yes\", \"No\"))","v":"Yes"},null,"",null,{"$f":"IF(VLOOKUP(A342,Usability!$A$12:$C$31,3,FALSE)=\"NA\", 0, IFERROR(VLOOKUP(C342,$Q$3:$R$6, 2, FALSE),\"N/A\"))","v":"N/A"},"N/A",null,{"$f":"IF(VLOOKUP(A342,Quality!$A$13:$H$32,8,FALSE)=\"NA\", 0, IFERROR(VLOOKUP(C342,$Q$3:$R$6, 2, FALSE),\"N/A\"))","v":"N/A"},"N/A"]
[null,null,null,null,{"$f":"IF(E322=\"Yes\", \"Yes\", \"No\")","v":"Yes"}]
[null,"Comments:",null,null,{"$f":"IF(E322=\"Yes\", \"Yes\", \"No\")","v":"Yes"}]
[null,null,null,null,{"$f":"IF(E322=\"Yes\", \"Yes\", \"No\")","v":"Yes"}]
[null,null,null,null,{"$f":"IF(E321=\"Yes\", \"Yes\", \"No\")","v":"Yes"}]
[null,null,null,null,{"$f":"IF(E322=\"Yes\", \"Yes\", \"No\")","v":"Yes"}]
["A14",{"$f":"\"Activity: \"& VLOOKUP(A348,Configuration!$B$11:$C$30,2, FALSE)","v":"Activity: "},"Importance Rating",null,{"$f":"IF(VLOOKUP(A348,Configuration!$B$11:$C$30,2,FALSE)=0,\"Yes\", \"No\")","v":"Yes"},null,null,null,{"$f":"SUM(I349:I368)","v":0},null,{"$f":"IF(OR(Progress4<>1, COUNT(G349:G368)<>COUNTIF(E349:E368,\"=No\")),\"\",SUMPRODUCT(J349:J368,Usability!$F$12:$F$31))","v":""},{"$f":"SUM(L349:L368)","v":0},null,{"$f":"IF(OR(Progress3<>1, COUNT(G349:G368)<>COUNTIF(E349:E368,\"=No\")),\"\",SUMPRODUCT(M349:M368,Quality!$H$13:$H$32))","v":""}]
["S1",{"$f":"\"Data: \"& VLOOKUP(A349,Configuration!$B$33:$C$52,2,FALSE)","v":"Data: Pavement Distress, Rutting and Roughness"},"Answer","clearRow",{"$f":"IF(E348=\"Yes\", \"Yes\", IF(VLOOKUP(A349,Configuration!$B$33:$C$52,2,FALSE)=0, \"Yes\", \"No\"))","v":"Yes"},null,{"$f":"IF(C349<>\"Answer\",1,\"\")","v":""},null,{"$f":"IF(VLOOKUP(A349,Usability!$A$12:$C$31,3,FALSE)=\"NA\", 0, IFERROR(VLOOKUP(C349,$Q$3:$R$6, 2, FALSE),\"N/A\"))","v":"N/A"},{"$f":"IFERROR(I349/$I$348,\"N/A\")","v":"N/A"},null,{"$f":"IF(VLOOKUP(A349,Quality!$A$13:$H$32,8,FALSE)=\"NA\", 0, IFERROR(VLOOKUP(C349,$Q$3:$R$6, 2, FALSE),\"N/A\"))","v":"N/A"},{"$f":"IFERROR(L349/$L$348,\"N/A\")","v":"N/A"}]
["S2",{"$f":"\"Data: \"& VLOOKUP(A350,Configuration!$B$33:$C$52,2,FALSE)","v":"Data: Linear Referencing (routes, intersections, mileposts)"},"Answer","clearRow",{"$f":"IF(E349=\"Yes\", \"Yes\", IF(VLOOKUP(A350,Configuration!$B$33:$C$52,2,FALSE)=0, \"Yes\", \"No\"))","v":"Yes"},null,"",null,{"$f":"IF(VLOOKUP(A350,Usability!$A$12:$C$31,3,FALSE)=\"NA\", 0, IFERROR(VLOOKUP(C350,$Q$3:$R$6, 2, FALSE),\"N/A\"))","v":"N/A"},{"$f":"IFERROR(I350/$I$348,\"N/A\")","v":"N/A"},null,{"$f":"IF(VLOOKUP(A350,Quality!$A$13:$H$32,8,FALSE)=\"NA\", 0, IFERROR(VLOOKUP(C350,$Q$3:$R$6, 2, FALSE),\"N/A\"))","v":"N/A"},"N/A"]
["S3",{"$f":"\"Data: \"& VLOOKUP(A351,Configuration!$B$33:$C$52,2,FALSE)","v":"Data: Traffic - AADT, Trucks, ESALS"},"Answer","clearRow",{"$f":"IF(E350=\"Yes\", \"Yes\", IF(VLOOKUP(A351,Configuration!$B$33:$C$52,2,FALSE)=0, \"Yes\", \"No\"))","v":"Yes"},null,"",null,{"$f":"IF(VLOOKUP(A351,Usability!$A$12:$C$31,3,FALSE)=\"NA\", 0, IFERROR(VLOOKUP(C351,$Q$3:$R$6, 2, FALSE),\"N/A\"))","v":"N/A"},"N/A",null,{"$f":"IF(VLOOKUP(A351,Quality!$A$13:$H$32,8,FALSE)=\"NA\", 0, IFERROR(VLOOKUP(C351,$Q$3:$R$6, 2, FALSE),\"N/A\"))","v":"N/A"},"N/A"]
["S4",{"$f":"\"Data: \"& VLOOKUP(A352,Configuration!$B$33:$C$52,2,FALSE)","v":"Data: Pavement Structure Characteristics"},"Answer","clearRow",{"$f":"IF(E351=\"Yes\", \"Yes\", IF(VLOOKUP(A352,Configuration!$B$33:$C$52,2,FALSE)=0, \"Yes\", \"No\"))","v":"Yes"},null,"",null,{"$f":"IF(VLOOKUP(A352,Usability!$A$12:$C$31,3,FALSE)=\"NA\", 0, IFERROR(VLOOKUP(C352,$Q$3:$R$6, 2, FALSE),\"N/A\"))","v":"N/A"},"N/A",null,{"$f":"IF(VLOOKUP(A352,Quality!$A$13:$H$32,8,FALSE)=\"NA\", 0, IFERROR(VLOOKUP(C352,$Q$3:$R$6, 2, FALSE),\"N/A\"))","v":"N/A"},"N/A"]
["S5",{"$f":"\"Data: \"& VLOOKUP(A353,Configuration!$B$33:$C$52,2,FALSE)","v":"Data: Road Inventory: # Lanes, Functional Class"},"Answer","clearRow",{"$f":"IF(E352=\"Yes\", \"Yes\", IF(VLOOKUP(A353,Configuration!$B$33:$C$52,2,FALSE)=0, \"Yes\", \"No\"))","v":"Yes"},null,"",null,{"$f":"IF(VLOOKUP(A353,Usability!$A$12:$C$31,3,FALSE)=\"NA\", 0, IFERROR(VLOOKUP(C353,$Q$3:$R$6, 2, FALSE),\"N/A\"))","v":"N/A"},"N/A",null,{"$f":"IF(VLOOKUP(A353,Quality!$A$13:$H$32,8,FALSE)=\"NA\", 0, IFERROR(VLOOKUP(C353,$Q$3:$R$6, 2, FALSE),\"N/A\"))","v":"N/A"},"N/A"]
["S6",{"$f":"\"Data: \"& VLOOKUP(A354,Configuration!$B$33:$C$52,2,FALSE)","v":"Data: "},"Answer","clearRow",{"$f":"IF(E353=\"Yes\", \"Yes\", IF(VLOOKUP(A354,Configuration!$B$33:$C$52,2,FALSE)=0, \"Yes\", \"No\"))","v":"Yes"},null,"",null,{"$f":"IF(VLOOKUP(A354,Usability!$A$12:$C$31,3,FALSE)=\"NA\", 0, IFERROR(VLOOKUP(C354,$Q$3:$R$6, 2, FALSE),\"N/A\"))","v":"N/A"},"N/A",null,{"$f":"IF(VLOOKUP(A354,Quality!$A$13:$H$32,8,FALSE)=\"NA\", 0, IFERROR(VLOOKUP(C354,$Q$3:$R$6, 2, FALSE),\"N/A\"))","v":"N/A"},"N/A"]
["S7",{"$f":"\"Data: \"& VLOOKUP(A355,Configuration!$B$33:$C$52,2,FALSE)","v":"Data: "},"Answer","clearRow",{"$f":"IF(E354=\"Yes\", \"Yes\", IF(VLOOKUP(A355,Configuration!$B$33:$C$52,2,FALSE)=0, \"Yes\", \"No\"))","v":"Yes"},null,"",null,{"$f":"IF(VLOOKUP(A355,Usability!$A$12:$C$31,3,FALSE)=\"NA\", 0, IFERROR(VLOOKUP(C355,$Q$3:$R$6, 2, FALSE),\"N/A\"))","v":"N/A"},"N/A",null,{"$f":"IF(VLOOKUP(A355,Quality!$A$13:$H$32,8,FALSE)=\"NA\", 0, IFERROR(VLOOKUP(C355,$Q$3:$R$6, 2, FALSE),\"N/A\"))","v":"N/A"},"N/A"]
["S8",{"$f":"\"Data: \"& VLOOKUP(A356,Configuration!$B$33:$C$52,2,FALSE)","v":"Data: "},"Answer","clearRow",{"$f":"IF(E355=\"Yes\", \"Yes\", IF(VLOOKUP(A356,Configuration!$B$33:$C$52,2,FALSE)=0, \"Yes\", \"No\"))","v":"Yes"},null,"",null,{"$f":"IF(VLOOKUP(A356,Usability!$A$12:$C$31,3,FALSE)=\"NA\", 0, IFERROR(VLOOKUP(C356,$Q$3:$R$6, 2, FALSE),\"N/A\"))","v":"N/A"},"N/A",null,{"$f":"IF(VLOOKUP(A356,Quality!$A$13:$H$32,8,FALSE)=\"NA\", 0, IFERROR(VLOOKUP(C356,$Q$3:$R$6, 2, FALSE),\"N/A\"))","v":"N/A"},"N/A"]
["S9",{"$f":"\"Data: \"& VLOOKUP(A357,Configuration!$B$33:$C$52,2,FALSE)","v":"Data: "},"Answer","clearRow",{"$f":"IF(E356=\"Yes\", \"Yes\", IF(VLOOKUP(A357,Configuration!$B$33:$C$52,2,FALSE)=0, \"Yes\", \"No\"))","v":"Yes"},null,"",null,{"$f":"IF(VLOOKUP(A357,Usability!$A$12:$C$31,3,FALSE)=\"NA\", 0, IFERROR(VLOOKUP(C357,$Q$3:$R$6, 2, FALSE),\"N/A\"))","v":"N/A"},"N/A",null,{"$f":"IF(VLOOKUP(A357,Quality!$A$13:$H$32,8,FALSE)=\"NA\", 0, IFERROR(VLOOKUP(C357,$Q$3:$R$6, 2, FALSE),\"N/A\"))","v":"N/A"},"N/A"]
["S10",{"$f":"\"Data: \"& VLOOKUP(A358,Configuration!$B$33:$C$52,2,FALSE)","v":"Data: "},"Answer","clearRow",{"$f":"IF(E357=\"Yes\", \"Yes\", IF(VLOOKUP(A358,Configuration!$B$33:$C$52,2,FALSE)=0, \"Yes\", \"No\"))","v":"Yes"},null,"",null,{"$f":"IF(VLOOKUP(A358,Usability!$A$12:$C$31,3,FALSE)=\"NA\", 0, IFERROR(VLOOKUP(C358,$Q$3:$R$6, 2, FALSE),\"N/A\"))","v":"N/A"},"N/A",null,{"$f":"IF(VLOOKUP(A358,Quality!$A$13:$H$32,8,FALSE)=\"NA\", 0, IFERROR(VLOOKUP(C358,$Q$3:$R$6, 2, FALSE),\"N/A\"))","v":"N/A"},"N/A"]
["S11",{"$f":"\"Data: \"& VLOOKUP(A359,Configuration!$B$33:$C$52,2,FALSE)","v":"Data: "},"Answer","clearRow",{"$f":"IF(E358=\"Yes\", \"Yes\", IF(VLOOKUP(A359,Configuration!$B$33:$C$52,2,FALSE)=0, \"Yes\", \"No\"))","v":"Yes"},null,"",null,{"$f":"IF(VLOOKUP(A359,Usability!$A$12:$C$31,3,FALSE)=\"NA\", 0, IFERROR(VLOOKUP(C359,$Q$3:$R$6, 2, FALSE),\"N/A\"))","v":"N/A"},"N/A",null,{"$f":"IF(VLOOKUP(A359,Quality!$A$13:$H$32,8,FALSE)=\"NA\", 0, IFERROR(VLOOKUP(C359,$Q$3:$R$6, 2, FALSE),\"N/A\"))","v":"N/A"},"N/A"]
["S12",{"$f":"\"Data: \"& VLOOKUP(A360,Configuration!$B$33:$C$52,2,FALSE)","v":"Data: "},"Answer","clearRow",{"$f":"IF(E359=\"Yes\", \"Yes\", IF(VLOOKUP(A360,Configuration!$B$33:$C$52,2,FALSE)=0, \"Yes\", \"No\"))","v":"Yes"},null,"",null,{"$f":"IF(VLOOKUP(A360,Usability!$A$12:$C$31,3,FALSE)=\"NA\", 0, IFERROR(VLOOKUP(C360,$Q$3:$R$6, 2, FALSE),\"N/A\"))","v":"N/A"},"N/A",null,{"$f":"IF(VLOOKUP(A360,Quality!$A$13:$H$32,8,FALSE)=\"NA\", 0, IFERROR(VLOOKUP(C360,$Q$3:$R$6, 2, FALSE),\"N/A\"))","v":"N/A"},"N/A"]
["S13",{"$f":"\"Data: \"& VLOOKUP(A361,Configuration!$B$33:$C$52,2,FALSE)","v":"Data: "},"Answer","clearRow",{"$f":"IF(E360=\"Yes\", \"Yes\", IF(VLOOKUP(A361,Configuration!$B$33:$C$52,2,FALSE)=0, \"Yes\", \"No\"))","v":"Yes"},null,"",null,{"$f":"IF(VLOOKUP(A361,Usability!$A$12:$C$31,3,FALSE)=\"NA\", 0, IFERROR(VLOOKUP(C361,$Q$3:$R$6, 2, FALSE),\"N/A\"))","v":"N/A"},"N/A",null,{"$f":"IF(VLOOKUP(A361,Quality!$A$13:$H$32,8,FALSE)=\"NA\", 0, IFERROR(VLOOKUP(C361,$Q$3:$R$6, 2, FALSE),\"N/A\"))","v":"N/A"},"N/A"]
["S14",{"$f":"\"Data: \"& VLOOKUP(A362,Configuration!$B$33:$C$52,2,FALSE)","v":"Data: "},"Answer","clearRow",{"$f":"IF(E361=\"Yes\", \"Yes\", IF(VLOOKUP(A362,Configuration!$B$33:$C$52,2,FALSE)=0, \"Yes\", \"No\"))","v":"Yes"},null,"",null,{"$f":"IF(VLOOKUP(A362,Usability!$A$12:$C$31,3,FALSE)=\"NA\", 0, IFERROR(VLOOKUP(C362,$Q$3:$R$6, 2, FALSE),\"N/A\"))","v":"N/A"},"N/A",null,{"$f":"IF(VLOOKUP(A362,Quality!$A$13:$H$32,8,FALSE)=\"NA\", 0, IFERROR(VLOOKUP(C362,$Q$3:$R$6, 2, FALSE),\"N/A\"))","v":"N/A"},"N/A"]
["S15",{"$f":"\"Data: \"& VLOOKUP(A363,Configuration!$B$33:$C$52,2,FALSE)","v":"Data: "},"Answer","clearRow",{"$f":"IF(E362=\"Yes\", \"Yes\", IF(VLOOKUP(A363,Configuration!$B$33:$C$52,2,FALSE)=0, \"Yes\", \"No\"))","v":"Yes"},null,"",null,{"$f":"IF(VLOOKUP(A363,Usability!$A$12:$C$31,3,FALSE)=\"NA\", 0, IFERROR(VLOOKUP(C363,$Q$3:$R$6, 2, FALSE),\"N/A\"))","v":"N/A"},"N/A",null,{"$f":"IF(VLOOKUP(A363,Quality!$A$13:$H$32,8,FALSE)=\"NA\", 0, IFERROR(VLOOKUP(C363,$Q$3:$R$6, 2, FALSE),\"N/A\"))","v":"N/A"},"N/A"]
["S16",{"$f":"\"Data: \"& VLOOKUP(A364,Configuration!$B$33:$C$52,2,FALSE)","v":"Data: "},"Answer","clearRow",{"$f":"IF(E363=\"Yes\", \"Yes\", IF(VLOOKUP(A364,Configuration!$B$33:$C$52,2,FALSE)=0, \"Yes\", \"No\"))","v":"Yes"},null,"",null,{"$f":"IF(VLOOKUP(A364,Usability!$A$12:$C$31,3,FALSE)=\"NA\", 0, IFERROR(VLOOKUP(C364,$Q$3:$R$6, 2, FALSE),\"N/A\"))","v":"N/A"},"N/A",null,{"$f":"IF(VLOOKUP(A364,Quality!$A$13:$H$32,8,FALSE)=\"NA\", 0, IFERROR(VLOOKUP(C364,$Q$3:$R$6, 2, FALSE),\"N/A\"))","v":"N/A"},"N/A"]
["S17",{"$f":"\"Data: \"& VLOOKUP(A365,Configuration!$B$33:$C$52,2,FALSE)","v":"Data: "},"Answer","clearRow",{"$f":"IF(E364=\"Yes\", \"Yes\", IF(VLOOKUP(A365,Configuration!$B$33:$C$52,2,FALSE)=0, \"Yes\", \"No\"))","v":"Yes"},null,"",null,{"$f":"IF(VLOOKUP(A365,Usability!$A$12:$C$31,3,FALSE)=\"NA\", 0, IFERROR(VLOOKUP(C365,$Q$3:$R$6, 2, FALSE),\"N/A\"))","v":"N/A"},"N/A",null,{"$f":"IF(VLOOKUP(A365,Quality!$A$13:$H$32,8,FALSE)=\"NA\", 0, IFERROR(VLOOKUP(C365,$Q$3:$R$6, 2, FALSE),\"N/A\"))","v":"N/A"},"N/A"]
["S18",{"$f":"\"Data: \"& VLOOKUP(A366,Configuration!$B$33:$C$52,2,FALSE)","v":"Data: "},"Answer","clearRow",{"$f":"IF(E365=\"Yes\", \"Yes\", IF(VLOOKUP(A366,Configuration!$B$33:$C$52,2,FALSE)=0, \"Yes\", \"No\"))","v":"Yes"},null,"",null,{"$f":"IF(VLOOKUP(A366,Usability!$A$12:$C$31,3,FALSE)=\"NA\", 0, IFERROR(VLOOKUP(C366,$Q$3:$R$6, 2, FALSE),\"N/A\"))","v":"N/A"},"N/A",null,{"$f":"IF(VLOOKUP(A366,Quality!$A$13:$H$32,8,FALSE)=\"NA\", 0, IFERROR(VLOOKUP(C366,$Q$3:$R$6, 2, FALSE),\"N/A\"))","v":"N/A"},"N/A"]
["S19",{"$f":"\"Data: \"& VLOOKUP(A367,Configuration!$B$33:$C$52,2,FALSE)","v":"Data: "},"Answer","clearRow",{"$f":"IF(E366=\"Yes\", \"Yes\", IF(VLOOKUP(A367,Configuration!$B$33:$C$52,2,FALSE)=0, \"Yes\", \"No\"))","v":"Yes"},null,"",null,{"$f":"IF(VLOOKUP(A367,Usability!$A$12:$C$31,3,FALSE)=\"NA\", 0, IFERROR(VLOOKUP(C367,$Q$3:$R$6, 2, FALSE),\"N/A\"))","v":"N/A"},"N/A",null,{"$f":"IF(VLOOKUP(A367,Quality!$A$13:$H$32,8,FALSE)=\"NA\", 0, IFERROR(VLOOKUP(C367,$Q$3:$R$6, 2, FALSE),\"N/A\"))","v":"N/A"},"N/A"]
["S20",{"$f":"\"Data: \"& VLOOKUP(A368,Configuration!$B$33:$C$52,2,FALSE)","v":"Data: "},"Answer","clearRow",{"$f":"IF(E367=\"Yes\", \"Yes\", IF(VLOOKUP(A368,Configuration!$B$33:$C$52,2,FALSE)=0, \"Yes\", \"No\"))","v":"Yes"},null,"",null,{"$f":"IF(VLOOKUP(A368,Usability!$A$12:$C$31,3,FALSE)=\"NA\", 0, IFERROR(VLOOKUP(C368,$Q$3:$R$6, 2, FALSE),\"N/A\"))","v":"N/A"},"N/A",null,{"$f":"IF(VLOOKUP(A368,Quality!$A$13:$H$32,8,FALSE)=\"NA\", 0, IFERROR(VLOOKUP(C368,$Q$3:$R$6, 2, FALSE),\"N/A\"))","v":"N/A"},"N/A"]
[null,null,null,null,{"$f":"IF(E348=\"Yes\", \"Yes\", \"No\")","v":"Yes"}]
[null,"Comments:",null,null,{"$f":"IF(E348=\"Yes\", \"Yes\", \"No\")","v":"Yes"}]
[null,null,null,null,{"$f":"IF(E348=\"Yes\", \"Yes\", \"No\")","v":"Yes"}]
[null,null,null,null,{"$f":"IF(E347=\"Yes\", \"Yes\", \"No\")","v":"Yes"}]
[null,null,null,null,{"$f":"IF(E348=\"Yes\", \"Yes\", \"No\")","v":"Yes"}]
["A15",{"$f":"\"Activity: \"& VLOOKUP(A374,Configuration!$B$11:$C$30,2, FALSE)","v":"Activity: "},"Importance Rating",null,{"$f":"IF(VLOOKUP(A374,Configuration!$B$11:$C$30,2,FALSE)=0,\"Yes\", \"No\")","v":"Yes"},null,null,null,{"$f":"SUM(I375:I394)","v":0},null,{"$f":"IF(OR(Progress4<>1, COUNT(G375:G394)<>COUNTIF(E375:E394,\"=No\")),\"\",SUMPRODUCT(J375:J394,Usability!$F$12:$F$31))","v":""},{"$f":"SUM(L375:L394)","v":0},null,{"$f":"IF(OR(Progress3<>1, COUNT(G375:G394)<>COUNTIF(E375:E394,\"=No\")),\"\",SUMPRODUCT(M375:M394,Quality!$H$13:$H$32))","v":""}]
["S1",{"$f":"\"Data: \"& VLOOKUP(A375,Configuration!$B$33:$C$52,2,FALSE)","v":"Data: Pavement Distress, Rutting and Roughness"},"Answer","clearRow",{"$f":"IF(E374=\"Yes\", \"Yes\", IF(VLOOKUP(A375,Configuration!$B$33:$C$52,2,FALSE)=0, \"Yes\", \"No\"))","v":"Yes"},null,{"$f":"IF(C375<>\"Answer\",1,\"\")","v":""},null,{"$f":"IF(VLOOKUP(A375,Usability!$A$12:$C$31,3,FALSE)=\"NA\", 0, IFERROR(VLOOKUP(C375,$Q$3:$R$6, 2, FALSE),\"N/A\"))","v":"N/A"},{"$f":"IFERROR(I375/$I$374,\"N/A\")","v":"N/A"},null,{"$f":"IF(VLOOKUP(A375,Quality!$A$13:$H$32,8,FALSE)=\"NA\", 0, IFERROR(VLOOKUP(C375,$Q$3:$R$6, 2, FALSE),\"N/A\"))","v":"N/A"},{"$f":"IFERROR(L375/$L$374,\"N/A\")","v":"N/A"}]
["S2",{"$f":"\"Data: \"& VLOOKUP(A376,Configuration!$B$33:$C$52,2,FALSE)","v":"Data: Linear Referencing (routes, intersections, mileposts)"},"Answer","clearRow",{"$f":"IF(E375=\"Yes\", \"Yes\", IF(VLOOKUP(A376,Configuration!$B$33:$C$52,2,FALSE)=0, \"Yes\", \"No\"))","v":"Yes"},null,"",null,{"$f":"IF(VLOOKUP(A376,Usability!$A$12:$C$31,3,FALSE)=\"NA\", 0, IFERROR(VLOOKUP(C376,$Q$3:$R$6, 2, FALSE),\"N/A\"))","v":"N/A"},{"$f":"IFERROR(I376/$I$374,\"N/A\")","v":"N/A"},null,{"$f":"IF(VLOOKUP(A376,Quality!$A$13:$H$32,8,FALSE)=\"NA\", 0, IFERROR(VLOOKUP(C376,$Q$3:$R$6, 2, FALSE),\"N/A\"))","v":"N/A"},"N/A"]
["S3",{"$f":"\"Data: \"& VLOOKUP(A377,Configuration!$B$33:$C$52,2,FALSE)","v":"Data: Traffic - AADT, Trucks, ESALS"},"Answer","clearRow",{"$f":"IF(E376=\"Yes\", \"Yes\", IF(VLOOKUP(A377,Configuration!$B$33:$C$52,2,FALSE)=0, \"Yes\", \"No\"))","v":"Yes"},null,"",null,{"$f":"IF(VLOOKUP(A377,Usability!$A$12:$C$31,3,FALSE)=\"NA\", 0, IFERROR(VLOOKUP(C377,$Q$3:$R$6, 2, FALSE),\"N/A\"))","v":"N/A"},"N/A",null,{"$f":"IF(VLOOKUP(A377,Quality!$A$13:$H$32,8,FALSE)=\"NA\", 0, IFERROR(VLOOKUP(C377,$Q$3:$R$6, 2, FALSE),\"N/A\"))","v":"N/A"},"N/A"]
["S4",{"$f":"\"Data: \"& VLOOKUP(A378,Configuration!$B$33:$C$52,2,FALSE)","v":"Data: Pavement Structure Characteristics"},"Answer","clearRow",{"$f":"IF(E377=\"Yes\", \"Yes\", IF(VLOOKUP(A378,Configuration!$B$33:$C$52,2,FALSE)=0, \"Yes\", \"No\"))","v":"Yes"},null,"",null,{"$f":"IF(VLOOKUP(A378,Usability!$A$12:$C$31,3,FALSE)=\"NA\", 0, IFERROR(VLOOKUP(C378,$Q$3:$R$6, 2, FALSE),\"N/A\"))","v":"N/A"},"N/A",null,{"$f":"IF(VLOOKUP(A378,Quality!$A$13:$H$32,8,FALSE)=\"NA\", 0, IFERROR(VLOOKUP(C378,$Q$3:$R$6, 2, FALSE),\"N/A\"))","v":"N/A"},"N/A"]
["S5",{"$f":"\"Data: \"& VLOOKUP(A379,Configuration!$B$33:$C$52,2,FALSE)","v":"Data: Road Inventory: # Lanes, Functional Class"},"Answer","clearRow",{"$f":"IF(E378=\"Yes\", \"Yes\", IF(VLOOKUP(A379,Configuration!$B$33:$C$52,2,FALSE)=0, \"Yes\", \"No\"))","v":"Yes"},null,"",null,{"$f":"IF(VLOOKUP(A379,Usability!$A$12:$C$31,3,FALSE)=\"NA\", 0, IFERROR(VLOOKUP(C379,$Q$3:$R$6, 2, FALSE),\"N/A\"))","v":"N/A"},"N/A",null,{"$f":"IF(VLOOKUP(A379,Quality!$A$13:$H$32,8,FALSE)=\"NA\", 0, IFERROR(VLOOKUP(C379,$Q$3:$R$6, 2, FALSE),\"N/A\"))","v":"N/A"},"N/A"]
["S6",{"$f":"\"Data: \"& VLOOKUP(A380,Configuration!$B$33:$C$52,2,FALSE)","v":"Data: "},"Answer","clearRow",{"$f":"IF(E379=\"Yes\", \"Yes\", IF(VLOOKUP(A380,Configuration!$B$33:$C$52,2,FALSE)=0, \"Yes\", \"No\"))","v":"Yes"},null,"",null,{"$f":"IF(VLOOKUP(A380,Usability!$A$12:$C$31,3,FALSE)=\"NA\", 0, IFERROR(VLOOKUP(C380,$Q$3:$R$6, 2, FALSE),\"N/A\"))","v":"N/A"},"N/A",null,{"$f":"IF(VLOOKUP(A380,Quality!$A$13:$H$32,8,FALSE)=\"NA\", 0, IFERROR(VLOOKUP(C380,$Q$3:$R$6, 2, FALSE),\"N/A\"))","v":"N/A"},"N/A"]
["S7",{"$f":"\"Data: \"& VLOOKUP(A381,Configuration!$B$33:$C$52,2,FALSE)","v":"Data: "},"Answer","clearRow",{"$f":"IF(E380=\"Yes\", \"Yes\", IF(VLOOKUP(A381,Configuration!$B$33:$C$52,2,FALSE)=0, \"Yes\", \"No\"))","v":"Yes"},null,"",null,{"$f":"IF(VLOOKUP(A381,Usability!$A$12:$C$31,3,FALSE)=\"NA\", 0, IFERROR(VLOOKUP(C381,$Q$3:$R$6, 2, FALSE),\"N/A\"))","v":"N/A"},"N/A",null,{"$f":"IF(VLOOKUP(A381,Quality!$A$13:$H$32,8,FALSE)=\"NA\", 0, IFERROR(VLOOKUP(C381,$Q$3:$R$6, 2, FALSE),\"N/A\"))","v":"N/A"},"N/A"]
["S8",{"$f":"\"Data: \"& VLOOKUP(A382,Configuration!$B$33:$C$52,2,FALSE)","v":"Data: "},"Answer","clearRow",{"$f":"IF(E381=\"Yes\", \"Yes\", IF(VLOOKUP(A382,Configuration!$B$33:$C$52,2,FALSE)=0, \"Yes\", \"No\"))","v":"Yes"},null,"",null,{"$f":"IF(VLOOKUP(A382,Usability!$A$12:$C$31,3,FALSE)=\"NA\", 0, IFERROR(VLOOKUP(C382,$Q$3:$R$6, 2, FALSE),\"N/A\"))","v":"N/A"},"N/A",null,{"$f":"IF(VLOOKUP(A382,Quality!$A$13:$H$32,8,FALSE)=\"NA\", 0, IFERROR(VLOOKUP(C382,$Q$3:$R$6, 2, FALSE),\"N/A\"))","v":"N/A"},"N/A"]
["S9",{"$f":"\"Data: \"& VLOOKUP(A383,Configuration!$B$33:$C$52,2,FALSE)","v":"Data: "},"Answer","clearRow",{"$f":"IF(E382=\"Yes\", \"Yes\", IF(VLOOKUP(A383,Configuration!$B$33:$C$52,2,FALSE)=0, \"Yes\", \"No\"))","v":"Yes"},null,"",null,{"$f":"IF(VLOOKUP(A383,Usability!$A$12:$C$31,3,FALSE)=\"NA\", 0, IFERROR(VLOOKUP(C383,$Q$3:$R$6, 2, FALSE),\"N/A\"))","v":"N/A"},"N/A",null,{"$f":"IF(VLOOKUP(A383,Quality!$A$13:$H$32,8,FALSE)=\"NA\", 0, IFERROR(VLOOKUP(C383,$Q$3:$R$6, 2, FALSE),\"N/A\"))","v":"N/A"},"N/A"]
["S10",{"$f":"\"Data: \"& VLOOKUP(A384,Configuration!$B$33:$C$52,2,FALSE)","v":"Data: "},"Answer","clearRow",{"$f":"IF(E383=\"Yes\", \"Yes\", IF(VLOOKUP(A384,Configuration!$B$33:$C$52,2,FALSE)=0, \"Yes\", \"No\"))","v":"Yes"},null,"",null,{"$f":"IF(VLOOKUP(A384,Usability!$A$12:$C$31,3,FALSE)=\"NA\", 0, IFERROR(VLOOKUP(C384,$Q$3:$R$6, 2, FALSE),\"N/A\"))","v":"N/A"},"N/A",null,{"$f":"IF(VLOOKUP(A384,Quality!$A$13:$H$32,8,FALSE)=\"NA\", 0, IFERROR(VLOOKUP(C384,$Q$3:$R$6, 2, FALSE),\"N/A\"))","v":"N/A"},"N/A"]
["S11",{"$f":"\"Data: \"& VLOOKUP(A385,Configuration!$B$33:$C$52,2,FALSE)","v":"Data: "},"Answer","clearRow",{"$f":"IF(E384=\"Yes\", \"Yes\", IF(VLOOKUP(A385,Configuration!$B$33:$C$52,2,FALSE)=0, \"Yes\", \"No\"))","v":"Yes"},null,"",null,{"$f":"IF(VLOOKUP(A385,Usability!$A$12:$C$31,3,FALSE)=\"NA\", 0, IFERROR(VLOOKUP(C385,$Q$3:$R$6, 2, FALSE),\"N/A\"))","v":"N/A"},"N/A",null,{"$f":"IF(VLOOKUP(A385,Quality!$A$13:$H$32,8,FALSE)=\"NA\", 0, IFERROR(VLOOKUP(C385,$Q$3:$R$6, 2, FALSE),\"N/A\"))","v":"N/A"},"N/A"]
["S12",{"$f":"\"Data: \"& VLOOKUP(A386,Configuration!$B$33:$C$52,2,FALSE)","v":"Data: "},"Answer","clearRow",{"$f":"IF(E385=\"Yes\", \"Yes\", IF(VLOOKUP(A386,Configuration!$B$33:$C$52,2,FALSE)=0, \"Yes\", \"No\"))","v":"Yes"},null,"",null,{"$f":"IF(VLOOKUP(A386,Usability!$A$12:$C$31,3,FALSE)=\"NA\", 0, IFERROR(VLOOKUP(C386,$Q$3:$R$6, 2, FALSE),\"N/A\"))","v":"N/A"},"N/A",null,{"$f":"IF(VLOOKUP(A386,Quality!$A$13:$H$32,8,FALSE)=\"NA\", 0, IFERROR(VLOOKUP(C386,$Q$3:$R$6, 2, FALSE),\"N/A\"))","v":"N/A"},"N/A"]
["S13",{"$f":"\"Data: \"& VLOOKUP(A387,Configuration!$B$33:$C$52,2,FALSE)","v":"Data: "},"Answer","clearRow",{"$f":"IF(E386=\"Yes\", \"Yes\", IF(VLOOKUP(A387,Configuration!$B$33:$C$52,2,FALSE)=0, \"Yes\", \"No\"))","v":"Yes"},null,"",null,{"$f":"IF(VLOOKUP(A387,Usability!$A$12:$C$31,3,FALSE)=\"NA\", 0, IFERROR(VLOOKUP(C387,$Q$3:$R$6, 2, FALSE),\"N/A\"))","v":"N/A"},"N/A",null,{"$f":"IF(VLOOKUP(A387,Quality!$A$13:$H$32,8,FALSE)=\"NA\", 0, IFERROR(VLOOKUP(C387,$Q$3:$R$6, 2, FALSE),\"N/A\"))","v":"N/A"},"N/A"]
["S14",{"$f":"\"Data: \"& VLOOKUP(A388,Configuration!$B$33:$C$52,2,FALSE)","v":"Data: "},"Answer","clearRow",{"$f":"IF(E387=\"Yes\", \"Yes\", IF(VLOOKUP(A388,Configuration!$B$33:$C$52,2,FALSE)=0, \"Yes\", \"No\"))","v":"Yes"},null,"",null,{"$f":"IF(VLOOKUP(A388,Usability!$A$12:$C$31,3,FALSE)=\"NA\", 0, IFERROR(VLOOKUP(C388,$Q$3:$R$6, 2, FALSE),\"N/A\"))","v":"N/A"},"N/A",null,{"$f":"IF(VLOOKUP(A388,Quality!$A$13:$H$32,8,FALSE)=\"NA\", 0, IFERROR(VLOOKUP(C388,$Q$3:$R$6, 2, FALSE),\"N/A\"))","v":"N/A"},"N/A"]
["S15",{"$f":"\"Data: \"& VLOOKUP(A389,Configuration!$B$33:$C$52,2,FALSE)","v":"Data: "},"Answer","clearRow",{"$f":"IF(E388=\"Yes\", \"Yes\", IF(VLOOKUP(A389,Configuration!$B$33:$C$52,2,FALSE)=0, \"Yes\", \"No\"))","v":"Yes"},null,"",null,{"$f":"IF(VLOOKUP(A389,Usability!$A$12:$C$31,3,FALSE)=\"NA\", 0, IFERROR(VLOOKUP(C389,$Q$3:$R$6, 2, FALSE),\"N/A\"))","v":"N/A"},"N/A",null,{"$f":"IF(VLOOKUP(A389,Quality!$A$13:$H$32,8,FALSE)=\"NA\", 0, IFERROR(VLOOKUP(C389,$Q$3:$R$6, 2, FALSE),\"N/A\"))","v":"N/A"},"N/A"]
["S16",{"$f":"\"Data: \"& VLOOKUP(A390,Configuration!$B$33:$C$52,2,FALSE)","v":"Data: "},"Answer","clearRow",{"$f":"IF(E389=\"Yes\", \"Yes\", IF(VLOOKUP(A390,Configuration!$B$33:$C$52,2,FALSE)=0, \"Yes\", \"No\"))","v":"Yes"},null,"",null,{"$f":"IF(VLOOKUP(A390,Usability!$A$12:$C$31,3,FALSE)=\"NA\", 0, IFERROR(VLOOKUP(C390,$Q$3:$R$6, 2, FALSE),\"N/A\"))","v":"N/A"},"N/A",null,{"$f":"IF(VLOOKUP(A390,Quality!$A$13:$H$32,8,FALSE)=\"NA\", 0, IFERROR(VLOOKUP(C390,$Q$3:$R$6, 2, FALSE),\"N/A\"))","v":"N/A"},"N/A"]
["S17",{"$f":"\"Data: \"& VLOOKUP(A391,Configuration!$B$33:$C$52,2,FALSE)","v":"Data: "},"Answer","clearRow",{"$f":"IF(E390=\"Yes\", \"Yes\", IF(VLOOKUP(A391,Configuration!$B$33:$C$52,2,FALSE)=0, \"Yes\", \"No\"))","v":"Yes"},null,"",null,{"$f":"IF(VLOOKUP(A391,Usability!$A$12:$C$31,3,FALSE)=\"NA\", 0, IFERROR(VLOOKUP(C391,$Q$3:$R$6, 2, FALSE),\"N/A\"))","v":"N/A"},"N/A",null,{"$f":"IF(VLOOKUP(A391,Quality!$A$13:$H$32,8,FALSE)=\"NA\", 0, IFERROR(VLOOKUP(C391,$Q$3:$R$6, 2, FALSE),\"N/A\"))","v":"N/A"},"N/A"]
["S18",{"$f":"\"Data: \"& VLOOKUP(A392,Configuration!$B$33:$C$52,2,FALSE)","v":"Data: "},"Answer","clearRow",{"$f":"IF(E391=\"Yes\", \"Yes\", IF(VLOOKUP(A392,Configuration!$B$33:$C$52,2,FALSE)=0, \"Yes\", \"No\"))","v":"Yes"},null,"",null,{"$f":"IF(VLOOKUP(A392,Usability!$A$12:$C$31,3,FALSE)=\"NA\", 0, IFERROR(VLOOKUP(C392,$Q$3:$R$6, 2, FALSE),\"N/A\"))","v":"N/A"},"N/A",null,{"$f":"IF(VLOOKUP(A392,Quality!$A$13:$H$32,8,FALSE)=\"NA\", 0, IFERROR(VLOOKUP(C392,$Q$3:$R$6, 2, FALSE),\"N/A\"))","v":"N/A"},"N/A"]
["S19",{"$f":"\"Data: \"& VLOOKUP(A393,Configuration!$B$33:$C$52,2,FALSE)","v":"Data: "},"Answer","clearRow",{"$f":"IF(E392=\"Yes\", \"Yes\", IF(VLOOKUP(A393,Configuration!$B$33:$C$52,2,FALSE)=0, \"Yes\", \"No\"))","v":"Yes"},null,"",null,{"$f":"IF(VLOOKUP(A393,Usability!$A$12:$C$31,3,FALSE)=\"NA\", 0, IFERROR(VLOOKUP(C393,$Q$3:$R$6, 2, FALSE),\"N/A\"))","v":"N/A"},"N/A",null,{"$f":"IF(VLOOKUP(A393,Quality!$A$13:$H$32,8,FALSE)=\"NA\", 0, IFERROR(VLOOKUP(C393,$Q$3:$R$6, 2, FALSE),\"N/A\"))","v":"N/A"},"N/A"]
["S20",{"$f":"\"Data: \"& VLOOKUP(A394,Configuration!$B$33:$C$52,2,FALSE)","v":"Data: "},"Answer","clearRow",{"$f":"IF(E393=\"Yes\", \"Yes\", IF(VLOOKUP(A394,Configuration!$B$33:$C$52,2,FALSE)=0, \"Yes\", \"No\"))","v":"Yes"},null,"",null,{"$f":"IF(VLOOKUP(A394,Usability!$A$12:$C$31,3,FALSE)=\"NA\", 0, IFERROR(VLOOKUP(C394,$Q$3:$R$6, 2, FALSE),\"N/A\"))","v":"N/A"},"N/A",null,{"$f":"IF(VLOOKUP(A394,Quality!$A$13:$H$32,8,FALSE)=\"NA\", 0, IFERROR(VLOOKUP(C394,$Q$3:$R$6, 2, FALSE),\"N/A\"))","v":"N/A"},"N/A"]
[null,null,null,null,{"$f":"IF(E374=\"Yes\", \"Yes\", \"No\")","v":"Yes"}]
[null,"Comments:",null,null,{"$f":"IF(E374=\"Yes\", \"Yes\", \"No\")","v":"Yes"}]
[null,null,null,null,{"$f":"IF(E374=\"Yes\", \"Yes\", \"No\")","v":"Yes"}]
[null,null,null,null,{"$f":"IF(E373=\"Yes\", \"Yes\", \"No\")","v":"Yes"}]
[null,null,null,null,{"$f":"IF(E374=\"Yes\", \"Yes\", \"No\")","v":"Yes"}]
["A16",{"$f":"\"Activity: \"& VLOOKUP(A400,Configuration!$B$11:$C$30,2, FALSE)","v":"Activity: "},"Importance Rating",null,{"$f":"IF(VLOOKUP(A400,Configuration!$B$11:$C$30,2,FALSE)=0,\"Yes\", \"No\")","v":"Yes"},null,null,null,{"$f":"SUM(I401:I420)","v":0},null,{"$f":"IF(OR(Progress4<>1, COUNT(G401:G420)<>COUNTIF(E401:E420,\"=No\")),\"\",SUMPRODUCT(J401:J420,Usability!$F$12:$F$31))","v":""},{"$f":"SUM(L401:L420)","v":0},null,{"$f":"IF(OR(Progress3<>1, COUNT(G401:G420)<>COUNTIF(E401:E420,\"=No\")),\"\",SUMPRODUCT(M401:M420,Quality!$H$13:$H$32))","v":""}]
["S1",{"$f":"\"Data: \"& VLOOKUP(A401,Configuration!$B$33:$C$52,2,FALSE)","v":"Data: Pavement Distress, Rutting and Roughness"},"Answer","clearRow",{"$f":"IF(E400=\"Yes\", \"Yes\", IF(VLOOKUP(A401,Configuration!$B$33:$C$52,2,FALSE)=0, \"Yes\", \"No\"))","v":"Yes"},null,{"$f":"IF(C401<>\"Answer\",1,\"\")","v":""},null,{"$f":"IF(VLOOKUP(A401,Usability!$A$12:$C$31,3,FALSE)=\"NA\", 0, IFERROR(VLOOKUP(C401,$Q$3:$R$6, 2, FALSE),\"N/A\"))","v":"N/A"},{"$f":"IFERROR(I401/$I$400,\"N/A\")","v":"N/A"},null,{"$f":"IF(VLOOKUP(A401,Quality!$A$13:$H$32,8,FALSE)=\"NA\", 0, IFERROR(VLOOKUP(C401,$Q$3:$R$6, 2, FALSE),\"N/A\"))","v":"N/A"},{"$f":"IFERROR(L401/$L$400,\"N/A\")","v":"N/A"}]
["S2",{"$f":"\"Data: \"& VLOOKUP(A402,Configuration!$B$33:$C$52,2,FALSE)","v":"Data: Linear Referencing (routes, intersections, mileposts)"},"Answer","clearRow",{"$f":"IF(E401=\"Yes\", \"Yes\", IF(VLOOKUP(A402,Configuration!$B$33:$C$52,2,FALSE)=0, \"Yes\", \"No\"))","v":"Yes"},null,"",null,{"$f":"IF(VLOOKUP(A402,Usability!$A$12:$C$31,3,FALSE)=\"NA\", 0, IFERROR(VLOOKUP(C402,$Q$3:$R$6, 2, FALSE),\"N/A\"))","v":"N/A"},{"$f":"IFERROR(I402/$I$400,\"N/A\")","v":"N/A"},null,{"$f":"IF(VLOOKUP(A402,Quality!$A$13:$H$32,8,FALSE)=\"NA\", 0, IFERROR(VLOOKUP(C402,$Q$3:$R$6, 2, FALSE),\"N/A\"))","v":"N/A"},"N/A"]
["S3",{"$f":"\"Data: \"& VLOOKUP(A403,Configuration!$B$33:$C$52,2,FALSE)","v":"Data: Traffic - AADT, Trucks, ESALS"},"Answer","clearRow",{"$f":"IF(E402=\"Yes\", \"Yes\", IF(VLOOKUP(A403,Configuration!$B$33:$C$52,2,FALSE)=0, \"Yes\", \"No\"))","v":"Yes"},null,"",null,{"$f":"IF(VLOOKUP(A403,Usability!$A$12:$C$31,3,FALSE)=\"NA\", 0, IFERROR(VLOOKUP(C403,$Q$3:$R$6, 2, FALSE),\"N/A\"))","v":"N/A"},"N/A",null,{"$f":"IF(VLOOKUP(A403,Quality!$A$13:$H$32,8,FALSE)=\"NA\", 0, IFERROR(VLOOKUP(C403,$Q$3:$R$6, 2, FALSE),\"N/A\"))","v":"N/A"},"N/A"]
["S4",{"$f":"\"Data: \"& VLOOKUP(A404,Configuration!$B$33:$C$52,2,FALSE)","v":"Data: Pavement Structure Characteristics"},"Answer","clearRow",{"$f":"IF(E403=\"Yes\", \"Yes\", IF(VLOOKUP(A404,Configuration!$B$33:$C$52,2,FALSE)=0, \"Yes\", \"No\"))","v":"Yes"},null,"",null,{"$f":"IF(VLOOKUP(A404,Usability!$A$12:$C$31,3,FALSE)=\"NA\", 0, IFERROR(VLOOKUP(C404,$Q$3:$R$6, 2, FALSE),\"N/A\"))","v":"N/A"},"N/A",null,{"$f":"IF(VLOOKUP(A404,Quality!$A$13:$H$32,8,FALSE)=\"NA\", 0, IFERROR(VLOOKUP(C404,$Q$3:$R$6, 2, FALSE),\"N/A\"))","v":"N/A"},"N/A"]
["S5",{"$f":"\"Data: \"& VLOOKUP(A405,Configuration!$B$33:$C$52,2,FALSE)","v":"Data: Road Inventory: # Lanes, Functional Class"},"Answer","clearRow",{"$f":"IF(E404=\"Yes\", \"Yes\", IF(VLOOKUP(A405,Configuration!$B$33:$C$52,2,FALSE)=0, \"Yes\", \"No\"))","v":"Yes"},null,"",null,{"$f":"IF(VLOOKUP(A405,Usability!$A$12:$C$31,3,FALSE)=\"NA\", 0, IFERROR(VLOOKUP(C405,$Q$3:$R$6, 2, FALSE),\"N/A\"))","v":"N/A"},"N/A",null,{"$f":"IF(VLOOKUP(A405,Quality!$A$13:$H$32,8,FALSE)=\"NA\", 0, IFERROR(VLOOKUP(C405,$Q$3:$R$6, 2, FALSE),\"N/A\"))","v":"N/A"},"N/A"]
["S6",{"$f":"\"Data: \"& VLOOKUP(A406,Configuration!$B$33:$C$52,2,FALSE)","v":"Data: "},"Answer","clearRow",{"$f":"IF(E405=\"Yes\", \"Yes\", IF(VLOOKUP(A406,Configuration!$B$33:$C$52,2,FALSE)=0, \"Yes\", \"No\"))","v":"Yes"},null,"",null,{"$f":"IF(VLOOKUP(A406,Usability!$A$12:$C$31,3,FALSE)=\"NA\", 0, IFERROR(VLOOKUP(C406,$Q$3:$R$6, 2, FALSE),\"N/A\"))","v":"N/A"},"N/A",null,{"$f":"IF(VLOOKUP(A406,Quality!$A$13:$H$32,8,FALSE)=\"NA\", 0, IFERROR(VLOOKUP(C406,$Q$3:$R$6, 2, FALSE),\"N/A\"))","v":"N/A"},"N/A"]
["S7",{"$f":"\"Data: \"& VLOOKUP(A407,Configuration!$B$33:$C$52,2,FALSE)","v":"Data: "},"Answer","clearRow",{"$f":"IF(E406=\"Yes\", \"Yes\", IF(VLOOKUP(A407,Configuration!$B$33:$C$52,2,FALSE)=0, \"Yes\", \"No\"))","v":"Yes"},null,"",null,{"$f":"IF(VLOOKUP(A407,Usability!$A$12:$C$31,3,FALSE)=\"NA\", 0, IFERROR(VLOOKUP(C407,$Q$3:$R$6, 2, FALSE),\"N/A\"))","v":"N/A"},"N/A",null,{"$f":"IF(VLOOKUP(A407,Quality!$A$13:$H$32,8,FALSE)=\"NA\", 0, IFERROR(VLOOKUP(C407,$Q$3:$R$6, 2, FALSE),\"N/A\"))","v":"N/A"},"N/A"]
["S8",{"$f":"\"Data: \"& VLOOKUP(A408,Configuration!$B$33:$C$52,2,FALSE)","v":"Data: "},"Answer","clearRow",{"$f":"IF(E407=\"Yes\", \"Yes\", IF(VLOOKUP(A408,Configuration!$B$33:$C$52,2,FALSE)=0, \"Yes\", \"No\"))","v":"Yes"},null,"",null,{"$f":"IF(VLOOKUP(A408,Usability!$A$12:$C$31,3,FALSE)=\"NA\", 0, IFERROR(VLOOKUP(C408,$Q$3:$R$6, 2, FALSE),\"N/A\"))","v":"N/A"},"N/A",null,{"$f":"IF(VLOOKUP(A408,Quality!$A$13:$H$32,8,FALSE)=\"NA\", 0, IFERROR(VLOOKUP(C408,$Q$3:$R$6, 2, FALSE),\"N/A\"))","v":"N/A"},"N/A"]
["S9",{"$f":"\"Data: \"& VLOOKUP(A409,Configuration!$B$33:$C$52,2,FALSE)","v":"Data: "},"Answer","clearRow",{"$f":"IF(E408=\"Yes\", \"Yes\", IF(VLOOKUP(A409,Configuration!$B$33:$C$52,2,FALSE)=0, \"Yes\", \"No\"))","v":"Yes"},null,"",null,{"$f":"IF(VLOOKUP(A409,Usability!$A$12:$C$31,3,FALSE)=\"NA\", 0, IFERROR(VLOOKUP(C409,$Q$3:$R$6, 2, FALSE),\"N/A\"))","v":"N/A"},"N/A",null,{"$f":"IF(VLOOKUP(A409,Quality!$A$13:$H$32,8,FALSE)=\"NA\", 0, IFERROR(VLOOKUP(C409,$Q$3:$R$6, 2, FALSE),\"N/A\"))","v":"N/A"},"N/A"]
["S10",{"$f":"\"Data: \"& VLOOKUP(A410,Configuration!$B$33:$C$52,2,FALSE)","v":"Data: "},"Answer","clearRow",{"$f":"IF(E409=\"Yes\", \"Yes\", IF(VLOOKUP(A410,Configuration!$B$33:$C$52,2,FALSE)=0, \"Yes\", \"No\"))","v":"Yes"},null,"",null,{"$f":"IF(VLOOKUP(A410,Usability!$A$12:$C$31,3,FALSE)=\"NA\", 0, IFERROR(VLOOKUP(C410,$Q$3:$R$6, 2, FALSE),\"N/A\"))","v":"N/A"},"N/A",null,{"$f":"IF(VLOOKUP(A410,Quality!$A$13:$H$32,8,FALSE)=\"NA\", 0, IFERROR(VLOOKUP(C410,$Q$3:$R$6, 2, FALSE),\"N/A\"))","v":"N/A"},"N/A"]
["S11",{"$f":"\"Data: \"& VLOOKUP(A411,Configuration!$B$33:$C$52,2,FALSE)","v":"Data: "},"Answer","clearRow",{"$f":"IF(E410=\"Yes\", \"Yes\", IF(VLOOKUP(A411,Configuration!$B$33:$C$52,2,FALSE)=0, \"Yes\", \"No\"))","v":"Yes"},null,"",null,{"$f":"IF(VLOOKUP(A411,Usability!$A$12:$C$31,3,FALSE)=\"NA\", 0, IFERROR(VLOOKUP(C411,$Q$3:$R$6, 2, FALSE),\"N/A\"))","v":"N/A"},"N/A",null,{"$f":"IF(VLOOKUP(A411,Quality!$A$13:$H$32,8,FALSE)=\"NA\", 0, IFERROR(VLOOKUP(C411,$Q$3:$R$6, 2, FALSE),\"N/A\"))","v":"N/A"},"N/A"]
["S12",{"$f":"\"Data: \"& VLOOKUP(A412,Configuration!$B$33:$C$52,2,FALSE)","v":"Data: "},"Answer","clearRow",{"$f":"IF(E411=\"Yes\", \"Yes\", IF(VLOOKUP(A412,Configuration!$B$33:$C$52,2,FALSE)=0, \"Yes\", \"No\"))","v":"Yes"},null,"",null,{"$f":"IF(VLOOKUP(A412,Usability!$A$12:$C$31,3,FALSE)=\"NA\", 0, IFERROR(VLOOKUP(C412,$Q$3:$R$6, 2, FALSE),\"N/A\"))","v":"N/A"},"N/A",null,{"$f":"IF(VLOOKUP(A412,Quality!$A$13:$H$32,8,FALSE)=\"NA\", 0, IFERROR(VLOOKUP(C412,$Q$3:$R$6, 2, FALSE),\"N/A\"))","v":"N/A"},"N/A"]
["S13",{"$f":"\"Data: \"& VLOOKUP(A413,Configuration!$B$33:$C$52,2,FALSE)","v":"Data: "},"Answer","clearRow",{"$f":"IF(E412=\"Yes\", \"Yes\", IF(VLOOKUP(A413,Configuration!$B$33:$C$52,2,FALSE)=0, \"Yes\", \"No\"))","v":"Yes"},null,"",null,{"$f":"IF(VLOOKUP(A413,Usability!$A$12:$C$31,3,FALSE)=\"NA\", 0, IFERROR(VLOOKUP(C413,$Q$3:$R$6, 2, FALSE),\"N/A\"))","v":"N/A"},"N/A",null,{"$f":"IF(VLOOKUP(A413,Quality!$A$13:$H$32,8,FALSE)=\"NA\", 0, IFERROR(VLOOKUP(C413,$Q$3:$R$6, 2, FALSE),\"N/A\"))","v":"N/A"},"N/A"]
["S14",{"$f":"\"Data: \"& VLOOKUP(A414,Configuration!$B$33:$C$52,2,FALSE)","v":"Data: "},"Answer","clearRow",{"$f":"IF(E413=\"Yes\", \"Yes\", IF(VLOOKUP(A414,Configuration!$B$33:$C$52,2,FALSE)=0, \"Yes\", \"No\"))","v":"Yes"},null,"",null,{"$f":"IF(VLOOKUP(A414,Usability!$A$12:$C$31,3,FALSE)=\"NA\", 0, IFERROR(VLOOKUP(C414,$Q$3:$R$6, 2, FALSE),\"N/A\"))","v":"N/A"},"N/A",null,{"$f":"IF(VLOOKUP(A414,Quality!$A$13:$H$32,8,FALSE)=\"NA\", 0, IFERROR(VLOOKUP(C414,$Q$3:$R$6, 2, FALSE),\"N/A\"))","v":"N/A"},"N/A"]
["S15",{"$f":"\"Data: \"& VLOOKUP(A415,Configuration!$B$33:$C$52,2,FALSE)","v":"Data: "},"Answer","clearRow",{"$f":"IF(E414=\"Yes\", \"Yes\", IF(VLOOKUP(A415,Configuration!$B$33:$C$52,2,FALSE)=0, \"Yes\", \"No\"))","v":"Yes"},null,"",null,{"$f":"IF(VLOOKUP(A415,Usability!$A$12:$C$31,3,FALSE)=\"NA\", 0, IFERROR(VLOOKUP(C415,$Q$3:$R$6, 2, FALSE),\"N/A\"))","v":"N/A"},"N/A",null,{"$f":"IF(VLOOKUP(A415,Quality!$A$13:$H$32,8,FALSE)=\"NA\", 0, IFERROR(VLOOKUP(C415,$Q$3:$R$6, 2, FALSE),\"N/A\"))","v":"N/A"},"N/A"]
["S16",{"$f":"\"Data: \"& VLOOKUP(A416,Configuration!$B$33:$C$52,2,FALSE)","v":"Data: "},"Answer","clearRow",{"$f":"IF(E415=\"Yes\", \"Yes\", IF(VLOOKUP(A416,Configuration!$B$33:$C$52,2,FALSE)=0, \"Yes\", \"No\"))","v":"Yes"},null,"",null,{"$f":"IF(VLOOKUP(A416,Usability!$A$12:$C$31,3,FALSE)=\"NA\", 0, IFERROR(VLOOKUP(C416,$Q$3:$R$6, 2, FALSE),\"N/A\"))","v":"N/A"},"N/A",null,{"$f":"IF(VLOOKUP(A416,Quality!$A$13:$H$32,8,FALSE)=\"NA\", 0, IFERROR(VLOOKUP(C416,$Q$3:$R$6, 2, FALSE),\"N/A\"))","v":"N/A"},"N/A"]
["S17",{"$f":"\"Data: \"& VLOOKUP(A417,Configuration!$B$33:$C$52,2,FALSE)","v":"Data: "},"Answer","clearRow",{"$f":"IF(E416=\"Yes\", \"Yes\", IF(VLOOKUP(A417,Configuration!$B$33:$C$52,2,FALSE)=0, \"Yes\", \"No\"))","v":"Yes"},null,"",null,{"$f":"IF(VLOOKUP(A417,Usability!$A$12:$C$31,3,FALSE)=\"NA\", 0, IFERROR(VLOOKUP(C417,$Q$3:$R$6, 2, FALSE),\"N/A\"))","v":"N/A"},"N/A",null,{"$f":"IF(VLOOKUP(A417,Quality!$A$13:$H$32,8,FALSE)=\"NA\", 0, IFERROR(VLOOKUP(C417,$Q$3:$R$6, 2, FALSE),\"N/A\"))","v":"N/A"},"N/A"]
["S18",{"$f":"\"Data: \"& VLOOKUP(A418,Configuration!$B$33:$C$52,2,FALSE)","v":"Data: "},"Answer","clearRow",{"$f":"IF(E417=\"Yes\", \"Yes\", IF(VLOOKUP(A418,Configuration!$B$33:$C$52,2,FALSE)=0, \"Yes\", \"No\"))","v":"Yes"},null,"",null,{"$f":"IF(VLOOKUP(A418,Usability!$A$12:$C$31,3,FALSE)=\"NA\", 0, IFERROR(VLOOKUP(C418,$Q$3:$R$6, 2, FALSE),\"N/A\"))","v":"N/A"},"N/A",null,{"$f":"IF(VLOOKUP(A418,Quality!$A$13:$H$32,8,FALSE)=\"NA\", 0, IFERROR(VLOOKUP(C418,$Q$3:$R$6, 2, FALSE),\"N/A\"))","v":"N/A"},"N/A"]
["S19",{"$f":"\"Data: \"& VLOOKUP(A419,Configuration!$B$33:$C$52,2,FALSE)","v":"Data: "},"Answer","clearRow",{"$f":"IF(E418=\"Yes\", \"Yes\", IF(VLOOKUP(A419,Configuration!$B$33:$C$52,2,FALSE)=0, \"Yes\", \"No\"))","v":"Yes"},null,"",null,{"$f":"IF(VLOOKUP(A419,Usability!$A$12:$C$31,3,FALSE)=\"NA\", 0, IFERROR(VLOOKUP(C419,$Q$3:$R$6, 2, FALSE),\"N/A\"))","v":"N/A"},"N/A",null,{"$f":"IF(VLOOKUP(A419,Quality!$A$13:$H$32,8,FALSE)=\"NA\", 0, IFERROR(VLOOKUP(C419,$Q$3:$R$6, 2, FALSE),\"N/A\"))","v":"N/A"},"N/A"]
["S20",{"$f":"\"Data: \"& VLOOKUP(A420,Configuration!$B$33:$C$52,2,FALSE)","v":"Data: "},"Answer","clearRow",{"$f":"IF(E419=\"Yes\", \"Yes\", IF(VLOOKUP(A420,Configuration!$B$33:$C$52,2,FALSE)=0, \"Yes\", \"No\"))","v":"Yes"},null,"",null,{"$f":"IF(VLOOKUP(A420,Usability!$A$12:$C$31,3,FALSE)=\"NA\", 0, IFERROR(VLOOKUP(C420,$Q$3:$R$6, 2, FALSE),\"N/A\"))","v":"N/A"},"N/A",null,{"$f":"IF(VLOOKUP(A420,Quality!$A$13:$H$32,8,FALSE)=\"NA\", 0, IFERROR(VLOOKUP(C420,$Q$3:$R$6, 2, FALSE),\"N/A\"))","v":"N/A"},"N/A"]
[null,null,null,null,{"$f":"IF(E400=\"Yes\", \"Yes\", \"No\")","v":"Yes"}]
[null,"Comments:",null,null,{"$f":"IF(E400=\"Yes\", \"Yes\", \"No\")","v":"Yes"}]
[null,null,null,null,{"$f":"IF(E400=\"Yes\", \"Yes\", \"No\")","v":"Yes"}]
[null,null,null,null,{"$f":"IF(E399=\"Yes\", \"Yes\", \"No\")","v":"Yes"}]
[null,null,null,null,{"$f":"IF(E400=\"Yes\", \"Yes\", \"No\")","v":"Yes"}]
["A17",{"$f":"\"Activity: \"& VLOOKUP(A426,Configuration!$B$11:$C$30,2, FALSE)","v":"Activity: "},"Importance Rating",null,{"$f":"IF(VLOOKUP(A426,Configuration!$B$11:$C$30,2,FALSE)=0,\"Yes\", \"No\")","v":"Yes"},null,null,null,{"$f":"SUM(I427:I446)","v":0},null,{"$f":"IF(OR(Progress4<>1, COUNT(G427:G446)<>COUNTIF(E427:E446,\"=No\")),\"\",SUMPRODUCT(J427:J446,Usability!$F$12:$F$31))","v":""},{"$f":"SUM(L427:L446)","v":0},null,{"$f":"IF(OR(Progress3<>1, COUNT(G427:G446)<>COUNTIF(E427:E446,\"=No\")),\"\",SUMPRODUCT(M427:M446,Quality!$H$13:$H$32))","v":""}]
["S1",{"$f":"\"Data: \"& VLOOKUP(A427,Configuration!$B$33:$C$52,2,FALSE)","v":"Data: Pavement Distress, Rutting and Roughness"},"Answer","clearRow",{"$f":"IF(E426=\"Yes\", \"Yes\", IF(VLOOKUP(A427,Configuration!$B$33:$C$52,2,FALSE)=0, \"Yes\", \"No\"))","v":"Yes"},null,{"$f":"IF(C427<>\"Answer\",1,\"\")","v":""},null,{"$f":"IF(VLOOKUP(A427,Usability!$A$12:$C$31,3,FALSE)=\"NA\", 0, IFERROR(VLOOKUP(C427,$Q$3:$R$6, 2, FALSE),\"N/A\"))","v":"N/A"},{"$f":"IFERROR(I427/$I$426,\"N/A\")","v":"N/A"},null,{"$f":"IF(VLOOKUP(A427,Quality!$A$13:$H$32,8,FALSE)=\"NA\", 0, IFERROR(VLOOKUP(C427,$Q$3:$R$6, 2, FALSE),\"N/A\"))","v":"N/A"},{"$f":"IFERROR(L427/$L$426,\"N/A\")","v":"N/A"}]
["S2",{"$f":"\"Data: \"& VLOOKUP(A428,Configuration!$B$33:$C$52,2,FALSE)","v":"Data: Linear Referencing (routes, intersections, mileposts)"},"Answer","clearRow",{"$f":"IF(E427=\"Yes\", \"Yes\", IF(VLOOKUP(A428,Configuration!$B$33:$C$52,2,FALSE)=0, \"Yes\", \"No\"))","v":"Yes"},null,"",null,{"$f":"IF(VLOOKUP(A428,Usability!$A$12:$C$31,3,FALSE)=\"NA\", 0, IFERROR(VLOOKUP(C428,$Q$3:$R$6, 2, FALSE),\"N/A\"))","v":"N/A"},{"$f":"IFERROR(I428/$I$400,\"N/A\")","v":"N/A"},null,{"$f":"IF(VLOOKUP(A428,Quality!$A$13:$H$32,8,FALSE)=\"NA\", 0, IFERROR(VLOOKUP(C428,$Q$3:$R$6, 2, FALSE),\"N/A\"))","v":"N/A"},{"$f":"IFERROR(L428/$L$400,\"N/A\")","v":"N/A"}]
["S3",{"$f":"\"Data: \"& VLOOKUP(A429,Configuration!$B$33:$C$52,2,FALSE)","v":"Data: Traffic - AADT, Trucks, ESALS"},"Answer","clearRow",{"$f":"IF(E428=\"Yes\", \"Yes\", IF(VLOOKUP(A429,Configuration!$B$33:$C$52,2,FALSE)=0, \"Yes\", \"No\"))","v":"Yes"},null,"",null,{"$f":"IF(VLOOKUP(A429,Usability!$A$12:$C$31,3,FALSE)=\"NA\", 0, IFERROR(VLOOKUP(C429,$Q$3:$R$6, 2, FALSE),\"N/A\"))","v":"N/A"},"N/A",null,{"$f":"IF(VLOOKUP(A429,Quality!$A$13:$H$32,8,FALSE)=\"NA\", 0, IFERROR(VLOOKUP(C429,$Q$3:$R$6, 2, FALSE),\"N/A\"))","v":"N/A"},"N/A"]
["S4",{"$f":"\"Data: \"& VLOOKUP(A430,Configuration!$B$33:$C$52,2,FALSE)","v":"Data: Pavement Structure Characteristics"},"Answer","clearRow",{"$f":"IF(E429=\"Yes\", \"Yes\", IF(VLOOKUP(A430,Configuration!$B$33:$C$52,2,FALSE)=0, \"Yes\", \"No\"))","v":"Yes"},null,"",null,{"$f":"IF(VLOOKUP(A430,Usability!$A$12:$C$31,3,FALSE)=\"NA\", 0, IFERROR(VLOOKUP(C430,$Q$3:$R$6, 2, FALSE),\"N/A\"))","v":"N/A"},"N/A",null,{"$f":"IF(VLOOKUP(A430,Quality!$A$13:$H$32,8,FALSE)=\"NA\", 0, IFERROR(VLOOKUP(C430,$Q$3:$R$6, 2, FALSE),\"N/A\"))","v":"N/A"},"N/A"]
["S5",{"$f":"\"Data: \"& VLOOKUP(A431,Configuration!$B$33:$C$52,2,FALSE)","v":"Data: Road Inventory: # Lanes, Functional Class"},"Answer","clearRow",{"$f":"IF(E430=\"Yes\", \"Yes\", IF(VLOOKUP(A431,Configuration!$B$33:$C$52,2,FALSE)=0, \"Yes\", \"No\"))","v":"Yes"},null,"",null,{"$f":"IF(VLOOKUP(A431,Usability!$A$12:$C$31,3,FALSE)=\"NA\", 0, IFERROR(VLOOKUP(C431,$Q$3:$R$6, 2, FALSE),\"N/A\"))","v":"N/A"},"N/A",null,{"$f":"IF(VLOOKUP(A431,Quality!$A$13:$H$32,8,FALSE)=\"NA\", 0, IFERROR(VLOOKUP(C431,$Q$3:$R$6, 2, FALSE),\"N/A\"))","v":"N/A"},"N/A"]
["S6",{"$f":"\"Data: \"& VLOOKUP(A432,Configuration!$B$33:$C$52,2,FALSE)","v":"Data: "},"Answer","clearRow",{"$f":"IF(E431=\"Yes\", \"Yes\", IF(VLOOKUP(A432,Configuration!$B$33:$C$52,2,FALSE)=0, \"Yes\", \"No\"))","v":"Yes"},null,"",null,{"$f":"IF(VLOOKUP(A432,Usability!$A$12:$C$31,3,FALSE)=\"NA\", 0, IFERROR(VLOOKUP(C432,$Q$3:$R$6, 2, FALSE),\"N/A\"))","v":"N/A"},"N/A",null,{"$f":"IF(VLOOKUP(A432,Quality!$A$13:$H$32,8,FALSE)=\"NA\", 0, IFERROR(VLOOKUP(C432,$Q$3:$R$6, 2, FALSE),\"N/A\"))","v":"N/A"},"N/A"]
["S7",{"$f":"\"Data: \"& VLOOKUP(A433,Configuration!$B$33:$C$52,2,FALSE)","v":"Data: "},"Answer","clearRow",{"$f":"IF(E432=\"Yes\", \"Yes\", IF(VLOOKUP(A433,Configuration!$B$33:$C$52,2,FALSE)=0, \"Yes\", \"No\"))","v":"Yes"},null,"",null,{"$f":"IF(VLOOKUP(A433,Usability!$A$12:$C$31,3,FALSE)=\"NA\", 0, IFERROR(VLOOKUP(C433,$Q$3:$R$6, 2, FALSE),\"N/A\"))","v":"N/A"},"N/A",null,{"$f":"IF(VLOOKUP(A433,Quality!$A$13:$H$32,8,FALSE)=\"NA\", 0, IFERROR(VLOOKUP(C433,$Q$3:$R$6, 2, FALSE),\"N/A\"))","v":"N/A"},"N/A"]
["S8",{"$f":"\"Data: \"& VLOOKUP(A434,Configuration!$B$33:$C$52,2,FALSE)","v":"Data: "},"Answer","clearRow",{"$f":"IF(E433=\"Yes\", \"Yes\", IF(VLOOKUP(A434,Configuration!$B$33:$C$52,2,FALSE)=0, \"Yes\", \"No\"))","v":"Yes"},null,"",null,{"$f":"IF(VLOOKUP(A434,Usability!$A$12:$C$31,3,FALSE)=\"NA\", 0, IFERROR(VLOOKUP(C434,$Q$3:$R$6, 2, FALSE),\"N/A\"))","v":"N/A"},"N/A",null,{"$f":"IF(VLOOKUP(A434,Quality!$A$13:$H$32,8,FALSE)=\"NA\", 0, IFERROR(VLOOKUP(C434,$Q$3:$R$6, 2, FALSE),\"N/A\"))","v":"N/A"},"N/A"]
["S9",{"$f":"\"Data: \"& VLOOKUP(A435,Configuration!$B$33:$C$52,2,FALSE)","v":"Data: "},"Answer","clearRow",{"$f":"IF(E434=\"Yes\", \"Yes\", IF(VLOOKUP(A435,Configuration!$B$33:$C$52,2,FALSE)=0, \"Yes\", \"No\"))","v":"Yes"},null,"",null,{"$f":"IF(VLOOKUP(A435,Usability!$A$12:$C$31,3,FALSE)=\"NA\", 0, IFERROR(VLOOKUP(C435,$Q$3:$R$6, 2, FALSE),\"N/A\"))","v":"N/A"},"N/A",null,{"$f":"IF(VLOOKUP(A435,Quality!$A$13:$H$32,8,FALSE)=\"NA\", 0, IFERROR(VLOOKUP(C435,$Q$3:$R$6, 2, FALSE),\"N/A\"))","v":"N/A"},"N/A"]
["S10",{"$f":"\"Data: \"& VLOOKUP(A436,Configuration!$B$33:$C$52,2,FALSE)","v":"Data: "},"Answer","clearRow",{"$f":"IF(E435=\"Yes\", \"Yes\", IF(VLOOKUP(A436,Configuration!$B$33:$C$52,2,FALSE)=0, \"Yes\", \"No\"))","v":"Yes"},null,"",null,{"$f":"IF(VLOOKUP(A436,Usability!$A$12:$C$31,3,FALSE)=\"NA\", 0, IFERROR(VLOOKUP(C436,$Q$3:$R$6, 2, FALSE),\"N/A\"))","v":"N/A"},"N/A",null,{"$f":"IF(VLOOKUP(A436,Quality!$A$13:$H$32,8,FALSE)=\"NA\", 0, IFERROR(VLOOKUP(C436,$Q$3:$R$6, 2, FALSE),\"N/A\"))","v":"N/A"},"N/A"]
["S11",{"$f":"\"Data: \"& VLOOKUP(A437,Configuration!$B$33:$C$52,2,FALSE)","v":"Data: "},"Answer","clearRow",{"$f":"IF(E436=\"Yes\", \"Yes\", IF(VLOOKUP(A437,Configuration!$B$33:$C$52,2,FALSE)=0, \"Yes\", \"No\"))","v":"Yes"},null,"",null,{"$f":"IF(VLOOKUP(A437,Usability!$A$12:$C$31,3,FALSE)=\"NA\", 0, IFERROR(VLOOKUP(C437,$Q$3:$R$6, 2, FALSE),\"N/A\"))","v":"N/A"},"N/A",null,{"$f":"IF(VLOOKUP(A437,Quality!$A$13:$H$32,8,FALSE)=\"NA\", 0, IFERROR(VLOOKUP(C437,$Q$3:$R$6, 2, FALSE),\"N/A\"))","v":"N/A"},"N/A"]
["S12",{"$f":"\"Data: \"& VLOOKUP(A438,Configuration!$B$33:$C$52,2,FALSE)","v":"Data: "},"Answer","clearRow",{"$f":"IF(E437=\"Yes\", \"Yes\", IF(VLOOKUP(A438,Configuration!$B$33:$C$52,2,FALSE)=0, \"Yes\", \"No\"))","v":"Yes"},null,"",null,{"$f":"IF(VLOOKUP(A438,Usability!$A$12:$C$31,3,FALSE)=\"NA\", 0, IFERROR(VLOOKUP(C438,$Q$3:$R$6, 2, FALSE),\"N/A\"))","v":"N/A"},"N/A",null,{"$f":"IF(VLOOKUP(A438,Quality!$A$13:$H$32,8,FALSE)=\"NA\", 0, IFERROR(VLOOKUP(C438,$Q$3:$R$6, 2, FALSE),\"N/A\"))","v":"N/A"},"N/A"]
["S13",{"$f":"\"Data: \"& VLOOKUP(A439,Configuration!$B$33:$C$52,2,FALSE)","v":"Data: "},"Answer","clearRow",{"$f":"IF(E438=\"Yes\", \"Yes\", IF(VLOOKUP(A439,Configuration!$B$33:$C$52,2,FALSE)=0, \"Yes\", \"No\"))","v":"Yes"},null,"",null,{"$f":"IF(VLOOKUP(A439,Usability!$A$12:$C$31,3,FALSE)=\"NA\", 0, IFERROR(VLOOKUP(C439,$Q$3:$R$6, 2, FALSE),\"N/A\"))","v":"N/A"},"N/A",null,{"$f":"IF(VLOOKUP(A439,Quality!$A$13:$H$32,8,FALSE)=\"NA\", 0, IFERROR(VLOOKUP(C439,$Q$3:$R$6, 2, FALSE),\"N/A\"))","v":"N/A"},"N/A"]
["S14",{"$f":"\"Data: \"& VLOOKUP(A440,Configuration!$B$33:$C$52,2,FALSE)","v":"Data: "},"Answer","clearRow",{"$f":"IF(E439=\"Yes\", \"Yes\", IF(VLOOKUP(A440,Configuration!$B$33:$C$52,2,FALSE)=0, \"Yes\", \"No\"))","v":"Yes"},null,"",null,{"$f":"IF(VLOOKUP(A440,Usability!$A$12:$C$31,3,FALSE)=\"NA\", 0, IFERROR(VLOOKUP(C440,$Q$3:$R$6, 2, FALSE),\"N/A\"))","v":"N/A"},"N/A",null,{"$f":"IF(VLOOKUP(A440,Quality!$A$13:$H$32,8,FALSE)=\"NA\", 0, IFERROR(VLOOKUP(C440,$Q$3:$R$6, 2, FALSE),\"N/A\"))","v":"N/A"},"N/A"]
["S15",{"$f":"\"Data: \"& VLOOKUP(A441,Configuration!$B$33:$C$52,2,FALSE)","v":"Data: "},"Answer","clearRow",{"$f":"IF(E440=\"Yes\", \"Yes\", IF(VLOOKUP(A441,Configuration!$B$33:$C$52,2,FALSE)=0, \"Yes\", \"No\"))","v":"Yes"},null,"",null,{"$f":"IF(VLOOKUP(A441,Usability!$A$12:$C$31,3,FALSE)=\"NA\", 0, IFERROR(VLOOKUP(C441,$Q$3:$R$6, 2, FALSE),\"N/A\"))","v":"N/A"},"N/A",null,{"$f":"IF(VLOOKUP(A441,Quality!$A$13:$H$32,8,FALSE)=\"NA\", 0, IFERROR(VLOOKUP(C441,$Q$3:$R$6, 2, FALSE),\"N/A\"))","v":"N/A"},"N/A"]
["S16",{"$f":"\"Data: \"& VLOOKUP(A442,Configuration!$B$33:$C$52,2,FALSE)","v":"Data: "},"Answer","clearRow",{"$f":"IF(E441=\"Yes\", \"Yes\", IF(VLOOKUP(A442,Configuration!$B$33:$C$52,2,FALSE)=0, \"Yes\", \"No\"))","v":"Yes"},null,"",null,{"$f":"IF(VLOOKUP(A442,Usability!$A$12:$C$31,3,FALSE)=\"NA\", 0, IFERROR(VLOOKUP(C442,$Q$3:$R$6, 2, FALSE),\"N/A\"))","v":"N/A"},"N/A",null,{"$f":"IF(VLOOKUP(A442,Quality!$A$13:$H$32,8,FALSE)=\"NA\", 0, IFERROR(VLOOKUP(C442,$Q$3:$R$6, 2, FALSE),\"N/A\"))","v":"N/A"},"N/A"]
["S17",{"$f":"\"Data: \"& VLOOKUP(A443,Configuration!$B$33:$C$52,2,FALSE)","v":"Data: "},"Answer","clearRow",{"$f":"IF(E442=\"Yes\", \"Yes\", IF(VLOOKUP(A443,Configuration!$B$33:$C$52,2,FALSE)=0, \"Yes\", \"No\"))","v":"Yes"},null,"",null,{"$f":"IF(VLOOKUP(A443,Usability!$A$12:$C$31,3,FALSE)=\"NA\", 0, IFERROR(VLOOKUP(C443,$Q$3:$R$6, 2, FALSE),\"N/A\"))","v":"N/A"},"N/A",null,{"$f":"IF(VLOOKUP(A443,Quality!$A$13:$H$32,8,FALSE)=\"NA\", 0, IFERROR(VLOOKUP(C443,$Q$3:$R$6, 2, FALSE),\"N/A\"))","v":"N/A"},"N/A"]
["S18",{"$f":"\"Data: \"& VLOOKUP(A444,Configuration!$B$33:$C$52,2,FALSE)","v":"Data: "},"Answer","clearRow",{"$f":"IF(E443=\"Yes\", \"Yes\", IF(VLOOKUP(A444,Configuration!$B$33:$C$52,2,FALSE)=0, \"Yes\", \"No\"))","v":"Yes"},null,"",null,{"$f":"IF(VLOOKUP(A444,Usability!$A$12:$C$31,3,FALSE)=\"NA\", 0, IFERROR(VLOOKUP(C444,$Q$3:$R$6, 2, FALSE),\"N/A\"))","v":"N/A"},"N/A",null,{"$f":"IF(VLOOKUP(A444,Quality!$A$13:$H$32,8,FALSE)=\"NA\", 0, IFERROR(VLOOKUP(C444,$Q$3:$R$6, 2, FALSE),\"N/A\"))","v":"N/A"},"N/A"]
["S19",{"$f":"\"Data: \"& VLOOKUP(A445,Configuration!$B$33:$C$52,2,FALSE)","v":"Data: "},"Answer","clearRow",{"$f":"IF(E444=\"Yes\", \"Yes\", IF(VLOOKUP(A445,Configuration!$B$33:$C$52,2,FALSE)=0, \"Yes\", \"No\"))","v":"Yes"},null,"",null,{"$f":"IF(VLOOKUP(A445,Usability!$A$12:$C$31,3,FALSE)=\"NA\", 0, IFERROR(VLOOKUP(C445,$Q$3:$R$6, 2, FALSE),\"N/A\"))","v":"N/A"},"N/A",null,{"$f":"IF(VLOOKUP(A445,Quality!$A$13:$H$32,8,FALSE)=\"NA\", 0, IFERROR(VLOOKUP(C445,$Q$3:$R$6, 2, FALSE),\"N/A\"))","v":"N/A"},"N/A"]
["S20",{"$f":"\"Data: \"& VLOOKUP(A446,Configuration!$B$33:$C$52,2,FALSE)","v":"Data: "},"Answer","clearRow",{"$f":"IF(E445=\"Yes\", \"Yes\", IF(VLOOKUP(A446,Configuration!$B$33:$C$52,2,FALSE)=0, \"Yes\", \"No\"))","v":"Yes"},null,"",null,{"$f":"IF(VLOOKUP(A446,Usability!$A$12:$C$31,3,FALSE)=\"NA\", 0, IFERROR(VLOOKUP(C446,$Q$3:$R$6, 2, FALSE),\"N/A\"))","v":"N/A"},"N/A",null,{"$f":"IF(VLOOKUP(A446,Quality!$A$13:$H$32,8,FALSE)=\"NA\", 0, IFERROR(VLOOKUP(C446,$Q$3:$R$6, 2, FALSE),\"N/A\"))","v":"N/A"},"N/A"]
[null,null,null,null,{"$f":"IF(E426=\"Yes\", \"Yes\", \"No\")","v":"Yes"}]
[null,"Comments:",null,null,{"$f":"IF(E426=\"Yes\", \"Yes\", \"No\")","v":"Yes"}]
[null,null,null,null,{"$f":"IF(E426=\"Yes\", \"Yes\", \"No\")","v":"Yes"}]
[null,null,null,null,{"$f":"IF(E425=\"Yes\", \"Yes\", \"No\")","v":"Yes"}]
[null,null,null,null,{"$f":"IF(E426=\"Yes\", \"Yes\", \"No\")","v":"Yes"}]
["A18",{"$f":"\"Activity: \"& VLOOKUP(A452,Configuration!$B$11:$C$30,2, FALSE)","v":"Activity: "},"Importance Rating",null,{"$f":"IF(VLOOKUP(A452,Configuration!$B$11:$C$30,2,FALSE)=0,\"Yes\", \"No\")","v":"Yes"},null,null,null,{"$f":"SUM(I453:I472)","v":0},null,{"$f":"IF(OR(Progress4<>1, COUNT(G453:G472)<>COUNTIF(E453:E472,\"=No\")),\"\",SUMPRODUCT(J453:J472,Usability!$F$12:$F$31))","v":""},{"$f":"SUM(L453:L472)","v":0},null,{"$f":"IF(OR(Progress3<>1, COUNT(G453:G472)<>COUNTIF(E453:E472,\"=No\")),\"\",SUMPRODUCT(M453:M472,Quality!$H$13:$H$32))","v":""}]
["S1",{"$f":"\"Data: \"& VLOOKUP(A453,Configuration!$B$33:$C$52,2,FALSE)","v":"Data: Pavement Distress, Rutting and Roughness"},"Answer","clearRow",{"$f":"IF(E452=\"Yes\", \"Yes\", IF(VLOOKUP(A453,Configuration!$B$33:$C$52,2,FALSE)=0, \"Yes\", \"No\"))","v":"Yes"},null,{"$f":"IF(C453<>\"Answer\",1,\"\")","v":""},null,{"$f":"IF(VLOOKUP(A453,Usability!$A$12:$C$31,3,FALSE)=\"NA\", 0, IFERROR(VLOOKUP(C453,$Q$3:$R$6, 2, FALSE),\"N/A\"))","v":"N/A"},{"$f":"IFERROR(I453/$I$452,\"N/A\")","v":"N/A"},null,{"$f":"IF(VLOOKUP(A453,Quality!$A$13:$H$32,8,FALSE)=\"NA\", 0, IFERROR(VLOOKUP(C453,$Q$3:$R$6, 2, FALSE),\"N/A\"))","v":"N/A"},{"$f":"IFERROR(L453/$L$452,\"N/A\")","v":"N/A"}]
["S2",{"$f":"\"Data: \"& VLOOKUP(A454,Configuration!$B$33:$C$52,2,FALSE)","v":"Data: Linear Referencing (routes, intersections, mileposts)"},"Answer","clearRow",{"$f":"IF(E453=\"Yes\", \"Yes\", IF(VLOOKUP(A454,Configuration!$B$33:$C$52,2,FALSE)=0, \"Yes\", \"No\"))","v":"Yes"},null,"",null,{"$f":"IF(VLOOKUP(A454,Usability!$A$12:$C$31,3,FALSE)=\"NA\", 0, IFERROR(VLOOKUP(C454,$Q$3:$R$6, 2, FALSE),\"N/A\"))","v":"N/A"},{"$f":"IFERROR(I454/$I$452,\"N/A\")","v":"N/A"},null,{"$f":"IF(VLOOKUP(A454,Quality!$A$13:$H$32,8,FALSE)=\"NA\", 0, IFERROR(VLOOKUP(C454,$Q$3:$R$6, 2, FALSE),\"N/A\"))","v":"N/A"},"N/A"]
["S3",{"$f":"\"Data: \"& VLOOKUP(A455,Configuration!$B$33:$C$52,2,FALSE)","v":"Data: Traffic - AADT, Trucks, ESALS"},"Answer","clearRow",{"$f":"IF(E454=\"Yes\", \"Yes\", IF(VLOOKUP(A455,Configuration!$B$33:$C$52,2,FALSE)=0, \"Yes\", \"No\"))","v":"Yes"},null,"",null,{"$f":"IF(VLOOKUP(A455,Usability!$A$12:$C$31,3,FALSE)=\"NA\", 0, IFERROR(VLOOKUP(C455,$Q$3:$R$6, 2, FALSE),\"N/A\"))","v":"N/A"},"N/A",null,{"$f":"IF(VLOOKUP(A455,Quality!$A$13:$H$32,8,FALSE)=\"NA\", 0, IFERROR(VLOOKUP(C455,$Q$3:$R$6, 2, FALSE),\"N/A\"))","v":"N/A"},"N/A"]
["S4",{"$f":"\"Data: \"& VLOOKUP(A456,Configuration!$B$33:$C$52,2,FALSE)","v":"Data: Pavement Structure Characteristics"},"Answer","clearRow",{"$f":"IF(E455=\"Yes\", \"Yes\", IF(VLOOKUP(A456,Configuration!$B$33:$C$52,2,FALSE)=0, \"Yes\", \"No\"))","v":"Yes"},null,"",null,{"$f":"IF(VLOOKUP(A456,Usability!$A$12:$C$31,3,FALSE)=\"NA\", 0, IFERROR(VLOOKUP(C456,$Q$3:$R$6, 2, FALSE),\"N/A\"))","v":"N/A"},"N/A",null,{"$f":"IF(VLOOKUP(A456,Quality!$A$13:$H$32,8,FALSE)=\"NA\", 0, IFERROR(VLOOKUP(C456,$Q$3:$R$6, 2, FALSE),\"N/A\"))","v":"N/A"},"N/A"]
["S5",{"$f":"\"Data: \"& VLOOKUP(A457,Configuration!$B$33:$C$52,2,FALSE)","v":"Data: Road Inventory: # Lanes, Functional Class"},"Answer","clearRow",{"$f":"IF(E456=\"Yes\", \"Yes\", IF(VLOOKUP(A457,Configuration!$B$33:$C$52,2,FALSE)=0, \"Yes\", \"No\"))","v":"Yes"},null,"",null,{"$f":"IF(VLOOKUP(A457,Usability!$A$12:$C$31,3,FALSE)=\"NA\", 0, IFERROR(VLOOKUP(C457,$Q$3:$R$6, 2, FALSE),\"N/A\"))","v":"N/A"},"N/A",null,{"$f":"IF(VLOOKUP(A457,Quality!$A$13:$H$32,8,FALSE)=\"NA\", 0, IFERROR(VLOOKUP(C457,$Q$3:$R$6, 2, FALSE),\"N/A\"))","v":"N/A"},"N/A"]
["S6",{"$f":"\"Data: \"& VLOOKUP(A458,Configuration!$B$33:$C$52,2,FALSE)","v":"Data: "},"Answer","clearRow",{"$f":"IF(E457=\"Yes\", \"Yes\", IF(VLOOKUP(A458,Configuration!$B$33:$C$52,2,FALSE)=0, \"Yes\", \"No\"))","v":"Yes"},null,"",null,{"$f":"IF(VLOOKUP(A458,Usability!$A$12:$C$31,3,FALSE)=\"NA\", 0, IFERROR(VLOOKUP(C458,$Q$3:$R$6, 2, FALSE),\"N/A\"))","v":"N/A"},"N/A",null,{"$f":"IF(VLOOKUP(A458,Quality!$A$13:$H$32,8,FALSE)=\"NA\", 0, IFERROR(VLOOKUP(C458,$Q$3:$R$6, 2, FALSE),\"N/A\"))","v":"N/A"},"N/A"]
["S7",{"$f":"\"Data: \"& VLOOKUP(A459,Configuration!$B$33:$C$52,2,FALSE)","v":"Data: "},"Answer","clearRow",{"$f":"IF(E458=\"Yes\", \"Yes\", IF(VLOOKUP(A459,Configuration!$B$33:$C$52,2,FALSE)=0, \"Yes\", \"No\"))","v":"Yes"},null,"",null,{"$f":"IF(VLOOKUP(A459,Usability!$A$12:$C$31,3,FALSE)=\"NA\", 0, IFERROR(VLOOKUP(C459,$Q$3:$R$6, 2, FALSE),\"N/A\"))","v":"N/A"},"N/A",null,{"$f":"IF(VLOOKUP(A459,Quality!$A$13:$H$32,8,FALSE)=\"NA\", 0, IFERROR(VLOOKUP(C459,$Q$3:$R$6, 2, FALSE),\"N/A\"))","v":"N/A"},"N/A"]
["S8",{"$f":"\"Data: \"& VLOOKUP(A460,Configuration!$B$33:$C$52,2,FALSE)","v":"Data: "},"Answer","clearRow",{"$f":"IF(E459=\"Yes\", \"Yes\", IF(VLOOKUP(A460,Configuration!$B$33:$C$52,2,FALSE)=0, \"Yes\", \"No\"))","v":"Yes"},null,"",null,{"$f":"IF(VLOOKUP(A460,Usability!$A$12:$C$31,3,FALSE)=\"NA\", 0, IFERROR(VLOOKUP(C460,$Q$3:$R$6, 2, FALSE),\"N/A\"))","v":"N/A"},"N/A",null,{"$f":"IF(VLOOKUP(A460,Quality!$A$13:$H$32,8,FALSE)=\"NA\", 0, IFERROR(VLOOKUP(C460,$Q$3:$R$6, 2, FALSE),\"N/A\"))","v":"N/A"},"N/A"]
["S9",{"$f":"\"Data: \"& VLOOKUP(A461,Configuration!$B$33:$C$52,2,FALSE)","v":"Data: "},"Answer","clearRow",{"$f":"IF(E460=\"Yes\", \"Yes\", IF(VLOOKUP(A461,Configuration!$B$33:$C$52,2,FALSE)=0, \"Yes\", \"No\"))","v":"Yes"},null,"",null,{"$f":"IF(VLOOKUP(A461,Usability!$A$12:$C$31,3,FALSE)=\"NA\", 0, IFERROR(VLOOKUP(C461,$Q$3:$R$6, 2, FALSE),\"N/A\"))","v":"N/A"},"N/A",null,{"$f":"IF(VLOOKUP(A461,Quality!$A$13:$H$32,8,FALSE)=\"NA\", 0, IFERROR(VLOOKUP(C461,$Q$3:$R$6, 2, FALSE),\"N/A\"))","v":"N/A"},"N/A"]
["S10",{"$f":"\"Data: \"& VLOOKUP(A462,Configuration!$B$33:$C$52,2,FALSE)","v":"Data: "},"Answer","clearRow",{"$f":"IF(E461=\"Yes\", \"Yes\", IF(VLOOKUP(A462,Configuration!$B$33:$C$52,2,FALSE)=0, \"Yes\", \"No\"))","v":"Yes"},null,"",null,{"$f":"IF(VLOOKUP(A462,Usability!$A$12:$C$31,3,FALSE)=\"NA\", 0, IFERROR(VLOOKUP(C462,$Q$3:$R$6, 2, FALSE),\"N/A\"))","v":"N/A"},"N/A",null,{"$f":"IF(VLOOKUP(A462,Quality!$A$13:$H$32,8,FALSE)=\"NA\", 0, IFERROR(VLOOKUP(C462,$Q$3:$R$6, 2, FALSE),\"N/A\"))","v":"N/A"},"N/A"]
["S11",{"$f":"\"Data: \"& VLOOKUP(A463,Configuration!$B$33:$C$52,2,FALSE)","v":"Data: "},"Answer","clearRow",{"$f":"IF(E462=\"Yes\", \"Yes\", IF(VLOOKUP(A463,Configuration!$B$33:$C$52,2,FALSE)=0, \"Yes\", \"No\"))","v":"Yes"},null,"",null,{"$f":"IF(VLOOKUP(A463,Usability!$A$12:$C$31,3,FALSE)=\"NA\", 0, IFERROR(VLOOKUP(C463,$Q$3:$R$6, 2, FALSE),\"N/A\"))","v":"N/A"},"N/A",null,{"$f":"IF(VLOOKUP(A463,Quality!$A$13:$H$32,8,FALSE)=\"NA\", 0, IFERROR(VLOOKUP(C463,$Q$3:$R$6, 2, FALSE),\"N/A\"))","v":"N/A"},"N/A"]
["S12",{"$f":"\"Data: \"& VLOOKUP(A464,Configuration!$B$33:$C$52,2,FALSE)","v":"Data: "},"Answer","clearRow",{"$f":"IF(E463=\"Yes\", \"Yes\", IF(VLOOKUP(A464,Configuration!$B$33:$C$52,2,FALSE)=0, \"Yes\", \"No\"))","v":"Yes"},null,"",null,{"$f":"IF(VLOOKUP(A464,Usability!$A$12:$C$31,3,FALSE)=\"NA\", 0, IFERROR(VLOOKUP(C464,$Q$3:$R$6, 2, FALSE),\"N/A\"))","v":"N/A"},"N/A",null,{"$f":"IF(VLOOKUP(A464,Quality!$A$13:$H$32,8,FALSE)=\"NA\", 0, IFERROR(VLOOKUP(C464,$Q$3:$R$6, 2, FALSE),\"N/A\"))","v":"N/A"},"N/A"]
["S13",{"$f":"\"Data: \"& VLOOKUP(A465,Configuration!$B$33:$C$52,2,FALSE)","v":"Data: "},"Answer","clearRow",{"$f":"IF(E464=\"Yes\", \"Yes\", IF(VLOOKUP(A465,Configuration!$B$33:$C$52,2,FALSE)=0, \"Yes\", \"No\"))","v":"Yes"},null,"",null,{"$f":"IF(VLOOKUP(A465,Usability!$A$12:$C$31,3,FALSE)=\"NA\", 0, IFERROR(VLOOKUP(C465,$Q$3:$R$6, 2, FALSE),\"N/A\"))","v":"N/A"},"N/A",null,{"$f":"IF(VLOOKUP(A465,Quality!$A$13:$H$32,8,FALSE)=\"NA\", 0, IFERROR(VLOOKUP(C465,$Q$3:$R$6, 2, FALSE),\"N/A\"))","v":"N/A"},"N/A"]
["S14",{"$f":"\"Data: \"& VLOOKUP(A466,Configuration!$B$33:$C$52,2,FALSE)","v":"Data: "},"Answer","clearRow",{"$f":"IF(E465=\"Yes\", \"Yes\", IF(VLOOKUP(A466,Configuration!$B$33:$C$52,2,FALSE)=0, \"Yes\", \"No\"))","v":"Yes"},null,"",null,{"$f":"IF(VLOOKUP(A466,Usability!$A$12:$C$31,3,FALSE)=\"NA\", 0, IFERROR(VLOOKUP(C466,$Q$3:$R$6, 2, FALSE),\"N/A\"))","v":"N/A"},"N/A",null,{"$f":"IF(VLOOKUP(A466,Quality!$A$13:$H$32,8,FALSE)=\"NA\", 0, IFERROR(VLOOKUP(C466,$Q$3:$R$6, 2, FALSE),\"N/A\"))","v":"N/A"},"N/A"]
["S15",{"$f":"\"Data: \"& VLOOKUP(A467,Configuration!$B$33:$C$52,2,FALSE)","v":"Data: "},"Answer","clearRow",{"$f":"IF(E466=\"Yes\", \"Yes\", IF(VLOOKUP(A467,Configuration!$B$33:$C$52,2,FALSE)=0, \"Yes\", \"No\"))","v":"Yes"},null,"",null,{"$f":"IF(VLOOKUP(A467,Usability!$A$12:$C$31,3,FALSE)=\"NA\", 0, IFERROR(VLOOKUP(C467,$Q$3:$R$6, 2, FALSE),\"N/A\"))","v":"N/A"},"N/A",null,{"$f":"IF(VLOOKUP(A467,Quality!$A$13:$H$32,8,FALSE)=\"NA\", 0, IFERROR(VLOOKUP(C467,$Q$3:$R$6, 2, FALSE),\"N/A\"))","v":"N/A"},"N/A"]
["S16",{"$f":"\"Data: \"& VLOOKUP(A468,Configuration!$B$33:$C$52,2,FALSE)","v":"Data: "},"Answer","clearRow",{"$f":"IF(E467=\"Yes\", \"Yes\", IF(VLOOKUP(A468,Configuration!$B$33:$C$52,2,FALSE)=0, \"Yes\", \"No\"))","v":"Yes"},null,"",null,{"$f":"IF(VLOOKUP(A468,Usability!$A$12:$C$31,3,FALSE)=\"NA\", 0, IFERROR(VLOOKUP(C468,$Q$3:$R$6, 2, FALSE),\"N/A\"))","v":"N/A"},"N/A",null,{"$f":"IF(VLOOKUP(A468,Quality!$A$13:$H$32,8,FALSE)=\"NA\", 0, IFERROR(VLOOKUP(C468,$Q$3:$R$6, 2, FALSE),\"N/A\"))","v":"N/A"},"N/A"]
["S17",{"$f":"\"Data: \"& VLOOKUP(A469,Configuration!$B$33:$C$52,2,FALSE)","v":"Data: "},"Answer","clearRow",{"$f":"IF(E468=\"Yes\", \"Yes\", IF(VLOOKUP(A469,Configuration!$B$33:$C$52,2,FALSE)=0, \"Yes\", \"No\"))","v":"Yes"},null,"",null,{"$f":"IF(VLOOKUP(A469,Usability!$A$12:$C$31,3,FALSE)=\"NA\", 0, IFERROR(VLOOKUP(C469,$Q$3:$R$6, 2, FALSE),\"N/A\"))","v":"N/A"},"N/A",null,{"$f":"IF(VLOOKUP(A469,Quality!$A$13:$H$32,8,FALSE)=\"NA\", 0, IFERROR(VLOOKUP(C469,$Q$3:$R$6, 2, FALSE),\"N/A\"))","v":"N/A"},"N/A"]
["S18",{"$f":"\"Data: \"& VLOOKUP(A470,Configuration!$B$33:$C$52,2,FALSE)","v":"Data: "},"Answer","clearRow",{"$f":"IF(E469=\"Yes\", \"Yes\", IF(VLOOKUP(A470,Configuration!$B$33:$C$52,2,FALSE)=0, \"Yes\", \"No\"))","v":"Yes"},null,"",null,{"$f":"IF(VLOOKUP(A470,Usability!$A$12:$C$31,3,FALSE)=\"NA\", 0, IFERROR(VLOOKUP(C470,$Q$3:$R$6, 2, FALSE),\"N/A\"))","v":"N/A"},"N/A",null,{"$f":"IF(VLOOKUP(A470,Quality!$A$13:$H$32,8,FALSE)=\"NA\", 0, IFERROR(VLOOKUP(C470,$Q$3:$R$6, 2, FALSE),\"N/A\"))","v":"N/A"},"N/A"]
["S19",{"$f":"\"Data: \"& VLOOKUP(A471,Configuration!$B$33:$C$52,2,FALSE)","v":"Data: "},"Answer","clearRow",{"$f":"IF(E470=\"Yes\", \"Yes\", IF(VLOOKUP(A471,Configuration!$B$33:$C$52,2,FALSE)=0, \"Yes\", \"No\"))","v":"Yes"},null,"",null,{"$f":"IF(VLOOKUP(A471,Usability!$A$12:$C$31,3,FALSE)=\"NA\", 0, IFERROR(VLOOKUP(C471,$Q$3:$R$6, 2, FALSE),\"N/A\"))","v":"N/A"},"N/A",null,{"$f":"IF(VLOOKUP(A471,Quality!$A$13:$H$32,8,FALSE)=\"NA\", 0, IFERROR(VLOOKUP(C471,$Q$3:$R$6, 2, FALSE),\"N/A\"))","v":"N/A"},"N/A"]
["S20",{"$f":"\"Data: \"& VLOOKUP(A472,Configuration!$B$33:$C$52,2,FALSE)","v":"Data: "},"Answer","clearRow",{"$f":"IF(E471=\"Yes\", \"Yes\", IF(VLOOKUP(A472,Configuration!$B$33:$C$52,2,FALSE)=0, \"Yes\", \"No\"))","v":"Yes"},null,"",null,{"$f":"IF(VLOOKUP(A472,Usability!$A$12:$C$31,3,FALSE)=\"NA\", 0, IFERROR(VLOOKUP(C472,$Q$3:$R$6, 2, FALSE),\"N/A\"))","v":"N/A"},"N/A",null,{"$f":"IF(VLOOKUP(A472,Quality!$A$13:$H$32,8,FALSE)=\"NA\", 0, IFERROR(VLOOKUP(C472,$Q$3:$R$6, 2, FALSE),\"N/A\"))","v":"N/A"},"N/A"]
[null,null,null,null,{"$f":"IF(E452=\"Yes\", \"Yes\", \"No\")","v":"Yes"}]
[null,"Comments:",null,null,{"$f":"IF(E452=\"Yes\", \"Yes\", \"No\")","v":"Yes"}]
[null,null,null,null,{"$f":"IF(E452=\"Yes\", \"Yes\", \"No\")","v":"Yes"}]
[null,null,null,null,{"$f":"IF(E451=\"Yes\", \"Yes\", \"No\")","v":"Yes"}]
[null,null,null,null,{"$f":"IF(E452=\"Yes\", \"Yes\", \"No\")","v":"Yes"}]
["A19",{"$f":"\"Activity: \"& VLOOKUP(A478,Configuration!$B$11:$C$30,2, FALSE)","v":"Activity: "},"Importance Rating",null,{"$f":"IF(VLOOKUP(A478,Configuration!$B$11:$C$30,2,FALSE)=0,\"Yes\", \"No\")","v":"Yes"},null,null,null,{"$f":"SUM(I479:I498)","v":0},null,{"$f":"IF(OR(Progress4<>1, COUNT(G479:G498)<>COUNTIF(E479:E498,\"=No\")),\"\",SUMPRODUCT(J479:J498,Usability!$F$12:$F$31))","v":""},{"$f":"SUM(L479:L498)","v":0},null,{"$f":"IF(OR(Progress3<>1, COUNT(G479:G498)<>COUNTIF(E479:E498,\"=No\")),\"\",SUMPRODUCT(M479:M498,Quality!$H$13:$H$32))","v":""}]
["S1",{"$f":"\"Data: \"& VLOOKUP(A479,Configuration!$B$33:$C$52,2,FALSE)","v":"Data: Pavement Distress, Rutting and Roughness"},"Answer","clearRow",{"$f":"IF(E478=\"Yes\", \"Yes\", IF(VLOOKUP(A479,Configuration!$B$33:$C$52,2,FALSE)=0, \"Yes\", \"No\"))","v":"Yes"},null,{"$f":"IF(C479<>\"Answer\",1,\"\")","v":""},null,{"$f":"IF(VLOOKUP(A479,Usability!$A$12:$C$31,3,FALSE)=\"NA\", 0, IFERROR(VLOOKUP(C479,$Q$3:$R$6, 2, FALSE),\"N/A\"))","v":"N/A"},{"$f":"IFERROR(I479/$I$478,\"N/A\")","v":"N/A"},null,{"$f":"IF(VLOOKUP(A479,Quality!$A$13:$H$32,8,FALSE)=\"NA\", 0, IFERROR(VLOOKUP(C479,$Q$3:$R$6, 2, FALSE),\"N/A\"))","v":"N/A"},{"$f":"IFERROR(L479/$L$478,\"N/A\")","v":"N/A"}]
["S2",{"$f":"\"Data: \"& VLOOKUP(A480,Configuration!$B$33:$C$52,2,FALSE)","v":"Data: Linear Referencing (routes, intersections, mileposts)"},"Answer","clearRow",{"$f":"IF(E479=\"Yes\", \"Yes\", IF(VLOOKUP(A480,Configuration!$B$33:$C$52,2,FALSE)=0, \"Yes\", \"No\"))","v":"Yes"},null,"",null,{"$f":"IF(VLOOKUP(A480,Usability!$A$12:$C$31,3,FALSE)=\"NA\", 0, IFERROR(VLOOKUP(C480,$Q$3:$R$6, 2, FALSE),\"N/A\"))","v":"N/A"},{"$f":"IFERROR(I480/$I$478,\"N/A\")","v":"N/A"},null,{"$f":"IF(VLOOKUP(A480,Quality!$A$13:$H$32,8,FALSE)=\"NA\", 0, IFERROR(VLOOKUP(C480,$Q$3:$R$6, 2, FALSE),\"N/A\"))","v":"N/A"},"N/A"]
["S3",{"$f":"\"Data: \"& VLOOKUP(A481,Configuration!$B$33:$C$52,2,FALSE)","v":"Data: Traffic - AADT, Trucks, ESALS"},"Answer","clearRow",{"$f":"IF(E480=\"Yes\", \"Yes\", IF(VLOOKUP(A481,Configuration!$B$33:$C$52,2,FALSE)=0, \"Yes\", \"No\"))","v":"Yes"},null,"",null,{"$f":"IF(VLOOKUP(A481,Usability!$A$12:$C$31,3,FALSE)=\"NA\", 0, IFERROR(VLOOKUP(C481,$Q$3:$R$6, 2, FALSE),\"N/A\"))","v":"N/A"},"N/A",null,{"$f":"IF(VLOOKUP(A481,Quality!$A$13:$H$32,8,FALSE)=\"NA\", 0, IFERROR(VLOOKUP(C481,$Q$3:$R$6, 2, FALSE),\"N/A\"))","v":"N/A"},"N/A"]
["S4",{"$f":"\"Data: \"& VLOOKUP(A482,Configuration!$B$33:$C$52,2,FALSE)","v":"Data: Pavement Structure Characteristics"},"Answer","clearRow",{"$f":"IF(E481=\"Yes\", \"Yes\", IF(VLOOKUP(A482,Configuration!$B$33:$C$52,2,FALSE)=0, \"Yes\", \"No\"))","v":"Yes"},null,"",null,{"$f":"IF(VLOOKUP(A482,Usability!$A$12:$C$31,3,FALSE)=\"NA\", 0, IFERROR(VLOOKUP(C482,$Q$3:$R$6, 2, FALSE),\"N/A\"))","v":"N/A"},"N/A",null,{"$f":"IF(VLOOKUP(A482,Quality!$A$13:$H$32,8,FALSE)=\"NA\", 0, IFERROR(VLOOKUP(C482,$Q$3:$R$6, 2, FALSE),\"N/A\"))","v":"N/A"},"N/A"]
["S5",{"$f":"\"Data: \"& VLOOKUP(A483,Configuration!$B$33:$C$52,2,FALSE)","v":"Data: Road Inventory: # Lanes, Functional Class"},"Answer","clearRow",{"$f":"IF(E482=\"Yes\", \"Yes\", IF(VLOOKUP(A483,Configuration!$B$33:$C$52,2,FALSE)=0, \"Yes\", \"No\"))","v":"Yes"},null,"",null,{"$f":"IF(VLOOKUP(A483,Usability!$A$12:$C$31,3,FALSE)=\"NA\", 0, IFERROR(VLOOKUP(C483,$Q$3:$R$6, 2, FALSE),\"N/A\"))","v":"N/A"},"N/A",null,{"$f":"IF(VLOOKUP(A483,Quality!$A$13:$H$32,8,FALSE)=\"NA\", 0, IFERROR(VLOOKUP(C483,$Q$3:$R$6, 2, FALSE),\"N/A\"))","v":"N/A"},"N/A"]
["S6",{"$f":"\"Data: \"& VLOOKUP(A484,Configuration!$B$33:$C$52,2,FALSE)","v":"Data: "},"Answer","clearRow",{"$f":"IF(E483=\"Yes\", \"Yes\", IF(VLOOKUP(A484,Configuration!$B$33:$C$52,2,FALSE)=0, \"Yes\", \"No\"))","v":"Yes"},null,"",null,{"$f":"IF(VLOOKUP(A484,Usability!$A$12:$C$31,3,FALSE)=\"NA\", 0, IFERROR(VLOOKUP(C484,$Q$3:$R$6, 2, FALSE),\"N/A\"))","v":"N/A"},"N/A",null,{"$f":"IF(VLOOKUP(A484,Quality!$A$13:$H$32,8,FALSE)=\"NA\", 0, IFERROR(VLOOKUP(C484,$Q$3:$R$6, 2, FALSE),\"N/A\"))","v":"N/A"},"N/A"]
["S7",{"$f":"\"Data: \"& VLOOKUP(A485,Configuration!$B$33:$C$52,2,FALSE)","v":"Data: "},"Answer","clearRow",{"$f":"IF(E484=\"Yes\", \"Yes\", IF(VLOOKUP(A485,Configuration!$B$33:$C$52,2,FALSE)=0, \"Yes\", \"No\"))","v":"Yes"},null,"",null,{"$f":"IF(VLOOKUP(A485,Usability!$A$12:$C$31,3,FALSE)=\"NA\", 0, IFERROR(VLOOKUP(C485,$Q$3:$R$6, 2, FALSE),\"N/A\"))","v":"N/A"},"N/A",null,{"$f":"IF(VLOOKUP(A485,Quality!$A$13:$H$32,8,FALSE)=\"NA\", 0, IFERROR(VLOOKUP(C485,$Q$3:$R$6, 2, FALSE),\"N/A\"))","v":"N/A"},"N/A"]
["S8",{"$f":"\"Data: \"& VLOOKUP(A486,Configuration!$B$33:$C$52,2,FALSE)","v":"Data: "},"Answer","clearRow",{"$f":"IF(E485=\"Yes\", \"Yes\", IF(VLOOKUP(A486,Configuration!$B$33:$C$52,2,FALSE)=0, \"Yes\", \"No\"))","v":"Yes"},null,"",null,{"$f":"IF(VLOOKUP(A486,Usability!$A$12:$C$31,3,FALSE)=\"NA\", 0, IFERROR(VLOOKUP(C486,$Q$3:$R$6, 2, FALSE),\"N/A\"))","v":"N/A"},"N/A",null,{"$f":"IF(VLOOKUP(A486,Quality!$A$13:$H$32,8,FALSE)=\"NA\", 0, IFERROR(VLOOKUP(C486,$Q$3:$R$6, 2, FALSE),\"N/A\"))","v":"N/A"},"N/A"]
["S9",{"$f":"\"Data: \"& VLOOKUP(A487,Configuration!$B$33:$C$52,2,FALSE)","v":"Data: "},"Answer","clearRow",{"$f":"IF(E486=\"Yes\", \"Yes\", IF(VLOOKUP(A487,Configuration!$B$33:$C$52,2,FALSE)=0, \"Yes\", \"No\"))","v":"Yes"},null,"",null,{"$f":"IF(VLOOKUP(A487,Usability!$A$12:$C$31,3,FALSE)=\"NA\", 0, IFERROR(VLOOKUP(C487,$Q$3:$R$6, 2, FALSE),\"N/A\"))","v":"N/A"},"N/A",null,{"$f":"IF(VLOOKUP(A487,Quality!$A$13:$H$32,8,FALSE)=\"NA\", 0, IFERROR(VLOOKUP(C487,$Q$3:$R$6, 2, FALSE),\"N/A\"))","v":"N/A"},"N/A"]
["S10",{"$f":"\"Data: \"& VLOOKUP(A488,Configuration!$B$33:$C$52,2,FALSE)","v":"Data: "},"Answer","clearRow",{"$f":"IF(E487=\"Yes\", \"Yes\", IF(VLOOKUP(A488,Configuration!$B$33:$C$52,2,FALSE)=0, \"Yes\", \"No\"))","v":"Yes"},null,"",null,{"$f":"IF(VLOOKUP(A488,Usability!$A$12:$C$31,3,FALSE)=\"NA\", 0, IFERROR(VLOOKUP(C488,$Q$3:$R$6, 2, FALSE),\"N/A\"))","v":"N/A"},"N/A",null,{"$f":"IF(VLOOKUP(A488,Quality!$A$13:$H$32,8,FALSE)=\"NA\", 0, IFERROR(VLOOKUP(C488,$Q$3:$R$6, 2, FALSE),\"N/A\"))","v":"N/A"},"N/A"]
["S11",{"$f":"\"Data: \"& VLOOKUP(A489,Configuration!$B$33:$C$52,2,FALSE)","v":"Data: "},"Answer","clearRow",{"$f":"IF(E488=\"Yes\", \"Yes\", IF(VLOOKUP(A489,Configuration!$B$33:$C$52,2,FALSE)=0, \"Yes\", \"No\"))","v":"Yes"},null,"",null,{"$f":"IF(VLOOKUP(A489,Usability!$A$12:$C$31,3,FALSE)=\"NA\", 0, IFERROR(VLOOKUP(C489,$Q$3:$R$6, 2, FALSE),\"N/A\"))","v":"N/A"},"N/A",null,{"$f":"IF(VLOOKUP(A489,Quality!$A$13:$H$32,8,FALSE)=\"NA\", 0, IFERROR(VLOOKUP(C489,$Q$3:$R$6, 2, FALSE),\"N/A\"))","v":"N/A"},"N/A"]
["S12",{"$f":"\"Data: \"& VLOOKUP(A490,Configuration!$B$33:$C$52,2,FALSE)","v":"Data: "},"Answer","clearRow",{"$f":"IF(E489=\"Yes\", \"Yes\", IF(VLOOKUP(A490,Configuration!$B$33:$C$52,2,FALSE)=0, \"Yes\", \"No\"))","v":"Yes"},null,"",null,{"$f":"IF(VLOOKUP(A490,Usability!$A$12:$C$31,3,FALSE)=\"NA\", 0, IFERROR(VLOOKUP(C490,$Q$3:$R$6, 2, FALSE),\"N/A\"))","v":"N/A"},"N/A",null,{"$f":"IF(VLOOKUP(A490,Quality!$A$13:$H$32,8,FALSE)=\"NA\", 0, IFERROR(VLOOKUP(C490,$Q$3:$R$6, 2, FALSE),\"N/A\"))","v":"N/A"},"N/A"]
["S13",{"$f":"\"Data: \"& VLOOKUP(A491,Configuration!$B$33:$C$52,2,FALSE)","v":"Data: "},"Answer","clearRow",{"$f":"IF(E490=\"Yes\", \"Yes\", IF(VLOOKUP(A491,Configuration!$B$33:$C$52,2,FALSE)=0, \"Yes\", \"No\"))","v":"Yes"},null,"",null,{"$f":"IF(VLOOKUP(A491,Usability!$A$12:$C$31,3,FALSE)=\"NA\", 0, IFERROR(VLOOKUP(C491,$Q$3:$R$6, 2, FALSE),\"N/A\"))","v":"N/A"},"N/A",null,{"$f":"IF(VLOOKUP(A491,Quality!$A$13:$H$32,8,FALSE)=\"NA\", 0, IFERROR(VLOOKUP(C491,$Q$3:$R$6, 2, FALSE),\"N/A\"))","v":"N/A"},"N/A"]
["S14",{"$f":"\"Data: \"& VLOOKUP(A492,Configuration!$B$33:$C$52,2,FALSE)","v":"Data: "},"Answer","clearRow",{"$f":"IF(E491=\"Yes\", \"Yes\", IF(VLOOKUP(A492,Configuration!$B$33:$C$52,2,FALSE)=0, \"Yes\", \"No\"))","v":"Yes"},null,"",null,{"$f":"IF(VLOOKUP(A492,Usability!$A$12:$C$31,3,FALSE)=\"NA\", 0, IFERROR(VLOOKUP(C492,$Q$3:$R$6, 2, FALSE),\"N/A\"))","v":"N/A"},"N/A",null,{"$f":"IF(VLOOKUP(A492,Quality!$A$13:$H$32,8,FALSE)=\"NA\", 0, IFERROR(VLOOKUP(C492,$Q$3:$R$6, 2, FALSE),\"N/A\"))","v":"N/A"},"N/A"]
["S15",{"$f":"\"Data: \"& VLOOKUP(A493,Configuration!$B$33:$C$52,2,FALSE)","v":"Data: "},"Answer","clearRow",{"$f":"IF(E492=\"Yes\", \"Yes\", IF(VLOOKUP(A493,Configuration!$B$33:$C$52,2,FALSE)=0, \"Yes\", \"No\"))","v":"Yes"},null,"",null,{"$f":"IF(VLOOKUP(A493,Usability!$A$12:$C$31,3,FALSE)=\"NA\", 0, IFERROR(VLOOKUP(C493,$Q$3:$R$6, 2, FALSE),\"N/A\"))","v":"N/A"},"N/A",null,{"$f":"IF(VLOOKUP(A493,Quality!$A$13:$H$32,8,FALSE)=\"NA\", 0, IFERROR(VLOOKUP(C493,$Q$3:$R$6, 2, FALSE),\"N/A\"))","v":"N/A"},"N/A"]
["S16",{"$f":"\"Data: \"& VLOOKUP(A494,Configuration!$B$33:$C$52,2,FALSE)","v":"Data: "},"Answer","clearRow",{"$f":"IF(E493=\"Yes\", \"Yes\", IF(VLOOKUP(A494,Configuration!$B$33:$C$52,2,FALSE)=0, \"Yes\", \"No\"))","v":"Yes"},null,"",null,{"$f":"IF(VLOOKUP(A494,Usability!$A$12:$C$31,3,FALSE)=\"NA\", 0, IFERROR(VLOOKUP(C494,$Q$3:$R$6, 2, FALSE),\"N/A\"))","v":"N/A"},"N/A",null,{"$f":"IF(VLOOKUP(A494,Quality!$A$13:$H$32,8,FALSE)=\"NA\", 0, IFERROR(VLOOKUP(C494,$Q$3:$R$6, 2, FALSE),\"N/A\"))","v":"N/A"},"N/A"]
["S17",{"$f":"\"Data: \"& VLOOKUP(A495,Configuration!$B$33:$C$52,2,FALSE)","v":"Data: "},"Answer","clearRow",{"$f":"IF(E494=\"Yes\", \"Yes\", IF(VLOOKUP(A495,Configuration!$B$33:$C$52,2,FALSE)=0, \"Yes\", \"No\"))","v":"Yes"},null,"",null,{"$f":"IF(VLOOKUP(A495,Usability!$A$12:$C$31,3,FALSE)=\"NA\", 0, IFERROR(VLOOKUP(C495,$Q$3:$R$6, 2, FALSE),\"N/A\"))","v":"N/A"},"N/A",null,{"$f":"IF(VLOOKUP(A495,Quality!$A$13:$H$32,8,FALSE)=\"NA\", 0, IFERROR(VLOOKUP(C495,$Q$3:$R$6, 2, FALSE),\"N/A\"))","v":"N/A"},"N/A"]
["S18",{"$f":"\"Data: \"& VLOOKUP(A496,Configuration!$B$33:$C$52,2,FALSE)","v":"Data: "},"Answer","clearRow",{"$f":"IF(E495=\"Yes\", \"Yes\", IF(VLOOKUP(A496,Configuration!$B$33:$C$52,2,FALSE)=0, \"Yes\", \"No\"))","v":"Yes"},null,"",null,{"$f":"IF(VLOOKUP(A496,Usability!$A$12:$C$31,3,FALSE)=\"NA\", 0, IFERROR(VLOOKUP(C496,$Q$3:$R$6, 2, FALSE),\"N/A\"))","v":"N/A"},"N/A",null,{"$f":"IF(VLOOKUP(A496,Quality!$A$13:$H$32,8,FALSE)=\"NA\", 0, IFERROR(VLOOKUP(C496,$Q$3:$R$6, 2, FALSE),\"N/A\"))","v":"N/A"},"N/A"]
["S19",{"$f":"\"Data: \"& VLOOKUP(A497,Configuration!$B$33:$C$52,2,FALSE)","v":"Data: "},"Answer","clearRow",{"$f":"IF(E496=\"Yes\", \"Yes\", IF(VLOOKUP(A497,Configuration!$B$33:$C$52,2,FALSE)=0, \"Yes\", \"No\"))","v":"Yes"},null,"",null,{"$f":"IF(VLOOKUP(A497,Usability!$A$12:$C$31,3,FALSE)=\"NA\", 0, IFERROR(VLOOKUP(C497,$Q$3:$R$6, 2, FALSE),\"N/A\"))","v":"N/A"},"N/A",null,{"$f":"IF(VLOOKUP(A497,Quality!$A$13:$H$32,8,FALSE)=\"NA\", 0, IFERROR(VLOOKUP(C497,$Q$3:$R$6, 2, FALSE),\"N/A\"))","v":"N/A"},"N/A"]
["S20",{"$f":"\"Data: \"& VLOOKUP(A498,Configuration!$B$33:$C$52,2,FALSE)","v":"Data: "},"Answer","clearRow",{"$f":"IF(E497=\"Yes\", \"Yes\", IF(VLOOKUP(A498,Configuration!$B$33:$C$52,2,FALSE)=0, \"Yes\", \"No\"))","v":"Yes"},null,"",null,{"$f":"IF(VLOOKUP(A498,Usability!$A$12:$C$31,3,FALSE)=\"NA\", 0, IFERROR(VLOOKUP(C498,$Q$3:$R$6, 2, FALSE),\"N/A\"))","v":"N/A"},"N/A",null,{"$f":"IF(VLOOKUP(A498,Quality!$A$13:$H$32,8,FALSE)=\"NA\", 0, IFERROR(VLOOKUP(C498,$Q$3:$R$6, 2, FALSE),\"N/A\"))","v":"N/A"},"N/A"]
[null,null,null,null,{"$f":"IF(E478=\"Yes\", \"Yes\", \"No\")","v":"Yes"}]
[null,"Comments:",null,null,{"$f":"IF(E478=\"Yes\", \"Yes\", \"No\")","v":"Yes"}]
[null,null,null,null,{"$f":"IF(E478=\"Yes\", \"Yes\", \"No\")","v":"Yes"}]
[null,null,null,null,{"$f":"IF(E477=\"Yes\", \"Yes\", \"No\")","v":"Yes"}]
[null,null,null,null,{"$f":"IF(E478=\"Yes\", \"Yes\", \"No\")","v":"Yes"}]
["A20",{"$f":"\"Activity: \"& VLOOKUP(A504,Configuration!$B$11:$C$30,2, FALSE)","v":"Activity: "},"Importance Rating",null,{"$f":"IF(VLOOKUP(A504,Configuration!$B$11:$C$30,2,FALSE)=0,\"Yes\", \"No\")","v":"Yes"},null,null,null,{"$f":"SUM(I505:I524)","v":0},null,{"$f":"IF(OR(Progress4<>1, COUNT(G505:G524)<>COUNTIF(E505:E524,\"=No\")),\"\",SUMPRODUCT(J505:J524,Usability!$F$12:$F$31))","v":""},{"$f":"SUM(L505:L524)","v":0},null,{"$f":"IF(OR(Progress3<>1, COUNT(G505:G524)<>COUNTIF(E505:E524,\"=No\")),\"\",SUMPRODUCT(M505:M524,Quality!$H$13:$H$32))","v":""}]
["S1",{"$f":"\"Data: \"& VLOOKUP(A505,Configuration!$B$33:$C$52,2,FALSE)","v":"Data: Pavement Distress, Rutting and Roughness"},"Answer","clearRow",{"$f":"IF(E504=\"Yes\", \"Yes\", IF(VLOOKUP(A505,Configuration!$B$33:$C$52,2,FALSE)=0, \"Yes\", \"No\"))","v":"Yes"},null,{"$f":"IF(C505<>\"Answer\",1,\"\")","v":""},null,{"$f":"IF(VLOOKUP(A505,Usability!$A$12:$C$31,3,FALSE)=\"NA\", 0, IFERROR(VLOOKUP(C505,$Q$3:$R$6, 2, FALSE),\"N/A\"))","v":"N/A"},{"$f":"IFERROR(I505/$I$504,\"N/A\")","v":"N/A"},null,{"$f":"IF(VLOOKUP(A505,Quality!$A$13:$H$32,8,FALSE)=\"NA\", 0, IFERROR(VLOOKUP(C505,$Q$3:$R$6, 2, FALSE),\"N/A\"))","v":"N/A"},{"$f":"IFERROR(L505/$L$504,\"N/A\")","v":"N/A"}]
["S2",{"$f":"\"Data: \"& VLOOKUP(A506,Configuration!$B$33:$C$52,2,FALSE)","v":"Data: Linear Referencing (routes, intersections, mileposts)"},"Answer","clearRow",{"$f":"IF(E505=\"Yes\", \"Yes\", IF(VLOOKUP(A506,Configuration!$B$33:$C$52,2,FALSE)=0, \"Yes\", \"No\"))","v":"Yes"},null,"",null,{"$f":"IF(VLOOKUP(A506,Usability!$A$12:$C$31,3,FALSE)=\"NA\", 0, IFERROR(VLOOKUP(C506,$Q$3:$R$6, 2, FALSE),\"N/A\"))","v":"N/A"},{"$f":"IFERROR(I506/$I$504,\"N/A\")","v":"N/A"},null,{"$f":"IF(VLOOKUP(A506,Quality!$A$13:$H$32,8,FALSE)=\"NA\", 0, IFERROR(VLOOKUP(C506,$Q$3:$R$6, 2, FALSE),\"N/A\"))","v":"N/A"},"N/A"]
["S3",{"$f":"\"Data: \"& VLOOKUP(A507,Configuration!$B$33:$C$52,2,FALSE)","v":"Data: Traffic - AADT, Trucks, ESALS"},"Answer","clearRow",{"$f":"IF(E506=\"Yes\", \"Yes\", IF(VLOOKUP(A507,Configuration!$B$33:$C$52,2,FALSE)=0, \"Yes\", \"No\"))","v":"Yes"},null,"",null,{"$f":"IF(VLOOKUP(A507,Usability!$A$12:$C$31,3,FALSE)=\"NA\", 0, IFERROR(VLOOKUP(C507,$Q$3:$R$6, 2, FALSE),\"N/A\"))","v":"N/A"},"N/A",null,{"$f":"IF(VLOOKUP(A507,Quality!$A$13:$H$32,8,FALSE)=\"NA\", 0, IFERROR(VLOOKUP(C507,$Q$3:$R$6, 2, FALSE),\"N/A\"))","v":"N/A"},"N/A"]
["S4",{"$f":"\"Data: \"& VLOOKUP(A508,Configuration!$B$33:$C$52,2,FALSE)","v":"Data: Pavement Structure Characteristics"},"Answer","clearRow",{"$f":"IF(E507=\"Yes\", \"Yes\", IF(VLOOKUP(A508,Configuration!$B$33:$C$52,2,FALSE)=0, \"Yes\", \"No\"))","v":"Yes"},null,"",null,{"$f":"IF(VLOOKUP(A508,Usability!$A$12:$C$31,3,FALSE)=\"NA\", 0, IFERROR(VLOOKUP(C508,$Q$3:$R$6, 2, FALSE),\"N/A\"))","v":"N/A"},"N/A",null,{"$f":"IF(VLOOKUP(A508,Quality!$A$13:$H$32,8,FALSE)=\"NA\", 0, IFERROR(VLOOKUP(C508,$Q$3:$R$6, 2, FALSE),\"N/A\"))","v":"N/A"},"N/A"]
["S5",{"$f":"\"Data: \"& VLOOKUP(A509,Configuration!$B$33:$C$52,2,FALSE)","v":"Data: Road Inventory: # Lanes, Functional Class"},"Answer","clearRow",{"$f":"IF(E508=\"Yes\", \"Yes\", IF(VLOOKUP(A509,Configuration!$B$33:$C$52,2,FALSE)=0, \"Yes\", \"No\"))","v":"Yes"},null,"",null,{"$f":"IF(VLOOKUP(A509,Usability!$A$12:$C$31,3,FALSE)=\"NA\", 0, IFERROR(VLOOKUP(C509,$Q$3:$R$6, 2, FALSE),\"N/A\"))","v":"N/A"},"N/A",null,{"$f":"IF(VLOOKUP(A509,Quality!$A$13:$H$32,8,FALSE)=\"NA\", 0, IFERROR(VLOOKUP(C509,$Q$3:$R$6, 2, FALSE),\"N/A\"))","v":"N/A"},"N/A"]
["S6",{"$f":"\"Data: \"& VLOOKUP(A510,Configuration!$B$33:$C$52,2,FALSE)","v":"Data: "},"Answer","clearRow",{"$f":"IF(E509=\"Yes\", \"Yes\", IF(VLOOKUP(A510,Configuration!$B$33:$C$52,2,FALSE)=0, \"Yes\", \"No\"))","v":"Yes"},null,"",null,{"$f":"IF(VLOOKUP(A510,Usability!$A$12:$C$31,3,FALSE)=\"NA\", 0, IFERROR(VLOOKUP(C510,$Q$3:$R$6, 2, FALSE),\"N/A\"))","v":"N/A"},"N/A",null,{"$f":"IF(VLOOKUP(A510,Quality!$A$13:$H$32,8,FALSE)=\"NA\", 0, IFERROR(VLOOKUP(C510,$Q$3:$R$6, 2, FALSE),\"N/A\"))","v":"N/A"},"N/A"]
["S7",{"$f":"\"Data: \"& VLOOKUP(A511,Configuration!$B$33:$C$52,2,FALSE)","v":"Data: "},"Answer","clearRow",{"$f":"IF(E510=\"Yes\", \"Yes\", IF(VLOOKUP(A511,Configuration!$B$33:$C$52,2,FALSE)=0, \"Yes\", \"No\"))","v":"Yes"},null,"",null,{"$f":"IF(VLOOKUP(A511,Usability!$A$12:$C$31,3,FALSE)=\"NA\", 0, IFERROR(VLOOKUP(C511,$Q$3:$R$6, 2, FALSE),\"N/A\"))","v":"N/A"},"N/A",null,{"$f":"IF(VLOOKUP(A511,Quality!$A$13:$H$32,8,FALSE)=\"NA\", 0, IFERROR(VLOOKUP(C511,$Q$3:$R$6, 2, FALSE),\"N/A\"))","v":"N/A"},"N/A"]
["S8",{"$f":"\"Data: \"& VLOOKUP(A512,Configuration!$B$33:$C$52,2,FALSE)","v":"Data: "},"Answer","clearRow",{"$f":"IF(E511=\"Yes\", \"Yes\", IF(VLOOKUP(A512,Configuration!$B$33:$C$52,2,FALSE)=0, \"Yes\", \"No\"))","v":"Yes"},null,"",null,{"$f":"IF(VLOOKUP(A512,Usability!$A$12:$C$31,3,FALSE)=\"NA\", 0, IFERROR(VLOOKUP(C512,$Q$3:$R$6, 2, FALSE),\"N/A\"))","v":"N/A"},"N/A",null,{"$f":"IF(VLOOKUP(A512,Quality!$A$13:$H$32,8,FALSE)=\"NA\", 0, IFERROR(VLOOKUP(C512,$Q$3:$R$6, 2, FALSE),\"N/A\"))","v":"N/A"},"N/A"]
["S9",{"$f":"\"Data: \"& VLOOKUP(A513,Configuration!$B$33:$C$52,2,FALSE)","v":"Data: "},"Answer","clearRow",{"$f":"IF(E512=\"Yes\", \"Yes\", IF(VLOOKUP(A513,Configuration!$B$33:$C$52,2,FALSE)=0, \"Yes\", \"No\"))","v":"Yes"},null,"",null,{"$f":"IF(VLOOKUP(A513,Usability!$A$12:$C$31,3,FALSE)=\"NA\", 0, IFERROR(VLOOKUP(C513,$Q$3:$R$6, 2, FALSE),\"N/A\"))","v":"N/A"},"N/A",null,{"$f":"IF(VLOOKUP(A513,Quality!$A$13:$H$32,8,FALSE)=\"NA\", 0, IFERROR(VLOOKUP(C513,$Q$3:$R$6, 2, FALSE),\"N/A\"))","v":"N/A"},"N/A"]
["S10",{"$f":"\"Data: \"& VLOOKUP(A514,Configuration!$B$33:$C$52,2,FALSE)","v":"Data: "},"Answer","clearRow",{"$f":"IF(E513=\"Yes\", \"Yes\", IF(VLOOKUP(A514,Configuration!$B$33:$C$52,2,FALSE)=0, \"Yes\", \"No\"))","v":"Yes"},null,"",null,{"$f":"IF(VLOOKUP(A514,Usability!$A$12:$C$31,3,FALSE)=\"NA\", 0, IFERROR(VLOOKUP(C514,$Q$3:$R$6, 2, FALSE),\"N/A\"))","v":"N/A"},"N/A",null,{"$f":"IF(VLOOKUP(A514,Quality!$A$13:$H$32,8,FALSE)=\"NA\", 0, IFERROR(VLOOKUP(C514,$Q$3:$R$6, 2, FALSE),\"N/A\"))","v":"N/A"},"N/A"]
["S11",{"$f":"\"Data: \"& VLOOKUP(A515,Configuration!$B$33:$C$52,2,FALSE)","v":"Data: "},"Answer","clearRow",{"$f":"IF(E514=\"Yes\", \"Yes\", IF(VLOOKUP(A515,Configuration!$B$33:$C$52,2,FALSE)=0, \"Yes\", \"No\"))","v":"Yes"},null,"",null,{"$f":"IF(VLOOKUP(A515,Usability!$A$12:$C$31,3,FALSE)=\"NA\", 0, IFERROR(VLOOKUP(C515,$Q$3:$R$6, 2, FALSE),\"N/A\"))","v":"N/A"},"N/A",null,{"$f":"IF(VLOOKUP(A515,Quality!$A$13:$H$32,8,FALSE)=\"NA\", 0, IFERROR(VLOOKUP(C515,$Q$3:$R$6, 2, FALSE),\"N/A\"))","v":"N/A"},"N/A"]
["S12",{"$f":"\"Data: \"& VLOOKUP(A516,Configuration!$B$33:$C$52,2,FALSE)","v":"Data: "},"Answer","clearRow",{"$f":"IF(E515=\"Yes\", \"Yes\", IF(VLOOKUP(A516,Configuration!$B$33:$C$52,2,FALSE)=0, \"Yes\", \"No\"))","v":"Yes"},null,"",null,{"$f":"IF(VLOOKUP(A516,Usability!$A$12:$C$31,3,FALSE)=\"NA\", 0, IFERROR(VLOOKUP(C516,$Q$3:$R$6, 2, FALSE),\"N/A\"))","v":"N/A"},"N/A",null,{"$f":"IF(VLOOKUP(A516,Quality!$A$13:$H$32,8,FALSE)=\"NA\", 0, IFERROR(VLOOKUP(C516,$Q$3:$R$6, 2, FALSE),\"N/A\"))","v":"N/A"},"N/A"]
["S13",{"$f":"\"Data: \"& VLOOKUP(A517,Configuration!$B$33:$C$52,2,FALSE)","v":"Data: "},"Answer","clearRow",{"$f":"IF(E516=\"Yes\", \"Yes\", IF(VLOOKUP(A517,Configuration!$B$33:$C$52,2,FALSE)=0, \"Yes\", \"No\"))","v":"Yes"},null,"",null,{"$f":"IF(VLOOKUP(A517,Usability!$A$12:$C$31,3,FALSE)=\"NA\", 0, IFERROR(VLOOKUP(C517,$Q$3:$R$6, 2, FALSE),\"N/A\"))","v":"N/A"},"N/A",null,{"$f":"IF(VLOOKUP(A517,Quality!$A$13:$H$32,8,FALSE)=\"NA\", 0, IFERROR(VLOOKUP(C517,$Q$3:$R$6, 2, FALSE),\"N/A\"))","v":"N/A"},"N/A"]
["S14",{"$f":"\"Data: \"& VLOOKUP(A518,Configuration!$B$33:$C$52,2,FALSE)","v":"Data: "},"Answer","clearRow",{"$f":"IF(E517=\"Yes\", \"Yes\", IF(VLOOKUP(A518,Configuration!$B$33:$C$52,2,FALSE)=0, \"Yes\", \"No\"))","v":"Yes"},null,"",null,{"$f":"IF(VLOOKUP(A518,Usability!$A$12:$C$31,3,FALSE)=\"NA\", 0, IFERROR(VLOOKUP(C518,$Q$3:$R$6, 2, FALSE),\"N/A\"))","v":"N/A"},"N/A",null,{"$f":"IF(VLOOKUP(A518,Quality!$A$13:$H$32,8,FALSE)=\"NA\", 0, IFERROR(VLOOKUP(C518,$Q$3:$R$6, 2, FALSE),\"N/A\"))","v":"N/A"},"N/A"]
["S15",{"$f":"\"Data: \"& VLOOKUP(A519,Configuration!$B$33:$C$52,2,FALSE)","v":"Data: "},"Answer","clearRow",{"$f":"IF(E518=\"Yes\", \"Yes\", IF(VLOOKUP(A519,Configuration!$B$33:$C$52,2,FALSE)=0, \"Yes\", \"No\"))","v":"Yes"},null,"",null,{"$f":"IF(VLOOKUP(A519,Usability!$A$12:$C$31,3,FALSE)=\"NA\", 0, IFERROR(VLOOKUP(C519,$Q$3:$R$6, 2, FALSE),\"N/A\"))","v":"N/A"},"N/A",null,{"$f":"IF(VLOOKUP(A519,Quality!$A$13:$H$32,8,FALSE)=\"NA\", 0, IFERROR(VLOOKUP(C519,$Q$3:$R$6, 2, FALSE),\"N/A\"))","v":"N/A"},"N/A"]
["S16",{"$f":"\"Data: \"& VLOOKUP(A520,Configuration!$B$33:$C$52,2,FALSE)","v":"Data: "},"Answer","clearRow",{"$f":"IF(E519=\"Yes\", \"Yes\", IF(VLOOKUP(A520,Configuration!$B$33:$C$52,2,FALSE)=0, \"Yes\", \"No\"))","v":"Yes"},null,"",null,{"$f":"IF(VLOOKUP(A520,Usability!$A$12:$C$31,3,FALSE)=\"NA\", 0, IFERROR(VLOOKUP(C520,$Q$3:$R$6, 2, FALSE),\"N/A\"))","v":"N/A"},"N/A",null,{"$f":"IF(VLOOKUP(A520,Quality!$A$13:$H$32,8,FALSE)=\"NA\", 0, IFERROR(VLOOKUP(C520,$Q$3:$R$6, 2, FALSE),\"N/A\"))","v":"N/A"},"N/A"]
["S17",{"$f":"\"Data: \"& VLOOKUP(A521,Configuration!$B$33:$C$52,2,FALSE)","v":"Data: "},"Answer","clearRow",{"$f":"IF(E520=\"Yes\", \"Yes\", IF(VLOOKUP(A521,Configuration!$B$33:$C$52,2,FALSE)=0, \"Yes\", \"No\"))","v":"Yes"},null,"",null,{"$f":"IF(VLOOKUP(A521,Usability!$A$12:$C$31,3,FALSE)=\"NA\", 0, IFERROR(VLOOKUP(C521,$Q$3:$R$6, 2, FALSE),\"N/A\"))","v":"N/A"},"N/A",null,{"$f":"IF(VLOOKUP(A521,Quality!$A$13:$H$32,8,FALSE)=\"NA\", 0, IFERROR(VLOOKUP(C521,$Q$3:$R$6, 2, FALSE),\"N/A\"))","v":"N/A"},"N/A"]
["S18",{"$f":"\"Data: \"& VLOOKUP(A522,Configuration!$B$33:$C$52,2,FALSE)","v":"Data: "},"Answer","clearRow",{"$f":"IF(E521=\"Yes\", \"Yes\", IF(VLOOKUP(A522,Configuration!$B$33:$C$52,2,FALSE)=0, \"Yes\", \"No\"))","v":"Yes"},null,"",null,{"$f":"IF(VLOOKUP(A522,Usability!$A$12:$C$31,3,FALSE)=\"NA\", 0, IFERROR(VLOOKUP(C522,$Q$3:$R$6, 2, FALSE),\"N/A\"))","v":"N/A"},"N/A",null,{"$f":"IF(VLOOKUP(A522,Quality!$A$13:$H$32,8,FALSE)=\"NA\", 0, IFERROR(VLOOKUP(C522,$Q$3:$R$6, 2, FALSE),\"N/A\"))","v":"N/A"},"N/A"]
["S19",{"$f":"\"Data: \"& VLOOKUP(A523,Configuration!$B$33:$C$52,2,FALSE)","v":"Data: "},"Answer","clearRow",{"$f":"IF(E522=\"Yes\", \"Yes\", IF(VLOOKUP(A523,Configuration!$B$33:$C$52,2,FALSE)=0, \"Yes\", \"No\"))","v":"Yes"},null,"",null,{"$f":"IF(VLOOKUP(A523,Usability!$A$12:$C$31,3,FALSE)=\"NA\", 0, IFERROR(VLOOKUP(C523,$Q$3:$R$6, 2, FALSE),\"N/A\"))","v":"N/A"},"N/A",null,{"$f":"IF(VLOOKUP(A523,Quality!$A$13:$H$32,8,FALSE)=\"NA\", 0, IFERROR(VLOOKUP(C523,$Q$3:$R$6, 2, FALSE),\"N/A\"))","v":"N/A"},"N/A"]
["S20",{"$f":"\"Data: \"& VLOOKUP(A524,Configuration!$B$33:$C$52,2,FALSE)","v":"Data: "},"Answer","clearRow",{"$f":"IF(E523=\"Yes\", \"Yes\", IF(VLOOKUP(A524,Configuration!$B$33:$C$52,2,FALSE)=0, \"Yes\", \"No\"))","v":"Yes"},null,"",null,{"$f":"IF(VLOOKUP(A524,Usability!$A$12:$C$31,3,FALSE)=\"NA\", 0, IFERROR(VLOOKUP(C524,$Q$3:$R$6, 2, FALSE),\"N/A\"))","v":"N/A"},"N/A",null,{"$f":"IF(VLOOKUP(A524,Quality!$A$13:$H$32,8,FALSE)=\"NA\", 0, IFERROR(VLOOKUP(C524,$Q$3:$R$6, 2, FALSE),\"N/A\"))","v":"N/A"},"N/A"]
[null,null,null,null,{"$f":"IF(E504=\"Yes\", \"Yes\", \"No\")","v":"Yes"}]
[null,"Comments:",null,null,{"$f":"IF(E504=\"Yes\", \"Yes\", \"No\")","v":"Yes"}]
[null,null,null,null,{"$f":"IF(E504=\"Yes\", \"Yes\", \"No\")","v":"Yes"}]
[null,null,null,null,{"$f":"IF(E504=\"Yes\", \"Yes\", \"No\")","v":"Yes"}]

{"sheet":"Availability","index":5,"n_rows":33,"n_cols":13,"rows_kept":33,"cut":false,"hidden":false,"merged":[[32,1,33,2],[3,1,3,2],[4,1,4,2],[5,1,5,2],[6,1,6,2]]}
[1,null,null,"clearCol","hideCol","progressCol",null,null,null,null,null,null,"picklist"]
[null,{"$f":"\"Data Availability Rating: \"&Configuration!C8","v":"Data Availability Rating: Pavement Management"},null,null,null,{"$f":"COUNTIFS(D12:D31, \"=clearRow\",E12:E31, \"=No\")","v":5},null,null,null,null,null,null,"Answer"]
[null,"How would you rate the availability of data to help you with these activities?",null,null,null,{"$f":"COUNTIF(C12:C31, \"<>Answer\")","v":0},null,null,null,null,null,null,"Poor"]
[null,"Poor: Little or no data available to support this activity",null,null,null,{"$f":"F3/F2","v":0},null,null,null,null,null,null,"Fair"]
[null,"Fair: Limited data available - large gaps remain",null,null,null,null,null,null,null,null,null,null,"Good"]
[null,"Good: Basic data are available - some gaps remain",null,null,null,null,null,null,null,null,null,null,"Excellent"]
[null,"Excellent: Sufficient data are available to meet needs - no gaps",null,null,null,null,"Progress:",{"$f":"IFERROR(F4,0)","v":0},null,null,null,null,"NA"]
[null,"NA: Don't know - not enough information"]
[]
[]
["lookupVal","Activity","Availability Rating"]
["A1",{"$f":"IF(VLOOKUP(A12,Configuration!$B$11:$C$30, 2, FALSE)=0, \"\", VLOOKUP(A12,Configuration!$B$11:$C$30, 2, FALSE))","v":"Understanding System Performance"},"Answer","clearRow",{"$f":"IF(VLOOKUP(A12,Configuration!$B$11:$C$30,2,FALSE)=0, \"Yes\", \"No\")","v":"No"}]
["A2",{"$f":"IF(VLOOKUP(A13,Configuration!$B$11:$C$30, 2, FALSE)=0, \"\", VLOOKUP(A13,Configuration!$B$11:$C$30, 2, FALSE))","v":"Tracking Accomplishments, Costs and Resource Allocation"},"Answer","clearRow",{"$f":"IF(VLOOKUP(A13,Configuration!$B$11:$C$30,2,FALSE)=0, \"Yes\", \"No\")","v":"No"}]
["A3",{"$f":"IF(VLOOKUP(A14,Configuration!$B$11:$C$30, 2, FALSE)=0, \"\", VLOOKUP(A14,Configuration!$B$11:$C$30, 2, FALSE))","v":"Anticipating Future Needs"},"Answer","clearRow",{"$f":"IF(VLOOKUP(A14,Configuration!$B$11:$C$30,2,FALSE)=0, \"Yes\", \"No\")","v":"No"}]
["A4",{"$f":"IF(VLOOKUP(A15,Configuration!$B$11:$C$30, 2, FALSE)=0, \"\", VLOOKUP(A15,Configuration!$B$11:$C$30, 2, FALSE))","v":"Performance Diagnostics"},"Answer","clearRow",{"$f":"IF(VLOOKUP(A15,Configuration!$B$11:$C$30,2,FALSE)=0, \"Yes\", \"No\")","v":"No"}]
["A5",{"$f":"IF(VLOOKUP(A16,Configuration!$B$11:$C$30, 2, FALSE)=0, \"\", VLOOKUP(A16,Configuration!$B$11:$C$30, 2, FALSE))","v":"Identifying Improvement Actions"},"Answer","clearRow",{"$f":"IF(VLOOKUP(A16,Configuration!$B$11:$C$30,2,FALSE)=0, \"Yes\", \"No\")","v":"No"}]
["A6",{"$f":"IF(VLOOKUP(A17,Configuration!$B$11:$C$30, 2, FALSE)=0, \"\", VLOOKUP(A17,Configuration!$B$11:$C$30, 2, FALSE))","v":""},"Answer","clearRow",{"$f":"IF(VLOOKUP(A17,Configuration!$B$11:$C$30,2,FALSE)=0, \"Yes\", \"No\")","v":"Yes"}]
["A7",{"$f":"IF(VLOOKUP(A18,Configuration!$B$11:$C$30, 2, FALSE)=0, \"\", VLOOKUP(A18,Configuration!$B$11:$C$30, 2, FALSE))","v":""},"Answer","clearRow",{"$f":"IF(VLOOKUP(A18,Configuration!$B$11:$C$30,2,FALSE)=0, \"Yes\", \"No\")","v":"Yes"}]
["A8",{"$f":"IF(VLOOKUP(A19,Configuration!$B$11:$C$30, 2, FALSE)=0, \"\", VLOOKUP(A19,Configuration!$B$11:$C$30, 2, FALSE))","v":""},"Answer","clearRow",{"$f":"IF(VLOOKUP(A19,Configuration!$B$11:$C$30,2,FALSE)=0, \"Yes\", \"No\")","v":"Yes"}]
["A9",{"$f":"IF(VLOOKUP(A20,Configuration!$B$11:$C$30, 2, FALSE)=0, \"\", VLOOKUP(A20,Configuration!$B$11:$C$30, 2, FALSE))","v":""},"Answer","clearRow",{"$f":"IF(VLOOKUP(A20,Configuration!$B$11:$C$30,2,FALSE)=0, \"Yes\", \"No\")","v":"Yes"}]
["A10",{"$f":"IF(VLOOKUP(A21,Configuration!$B$11:$C$30, 2, FALSE)=0, \"\", VLOOKUP(A21,Configuration!$B$11:$C$30, 2, FALSE))","v":""},"Answer","clearRow",{"$f":"IF(VLOOKUP(A21,Configuration!$B$11:$C$30,2,FALSE)=0, \"Yes\", \"No\")","v":"Yes"}]
["A11",{"$f":"IF(VLOOKUP(A22,Configuration!$B$11:$C$30, 2, FALSE)=0, \"\", VLOOKUP(A22,Configuration!$B$11:$C$30, 2, FALSE))","v":""},"Answer","clearRow",{"$f":"IF(VLOOKUP(A22,Configuration!$B$11:$C$30,2,FALSE)=0, \"Yes\", \"No\")","v":"Yes"}]
["A12",{"$f":"IF(VLOOKUP(A23,Configuration!$B$11:$C$30, 2, FALSE)=0, \"\", VLOOKUP(A23,Configuration!$B$11:$C$30, 2, FALSE))","v":""},"Answer","clearRow",{"$f":"IF(VLOOKUP(A23,Configuration!$B$11:$C$30,2,FALSE)=0, \"Yes\", \"No\")","v":"Yes"}]
["A13",{"$f":"IF(VLOOKUP(A24,Configuration!$B$11:$C$30, 2, FALSE)=0, \"\", VLOOKUP(A24,Configuration!$B$11:$C$30, 2, FALSE))","v":""},"Answer","clearRow",{"$f":"IF(VLOOKUP(A24,Configuration!$B$11:$C$30,2,FALSE)=0, \"Yes\", \"No\")","v":"Yes"}]
["A14",{"$f":"IF(VLOOKUP(A25,Configuration!$B$11:$C$30, 2, FALSE)=0, \"\", VLOOKUP(A25,Configuration!$B$11:$C$30, 2, FALSE))","v":""},"Answer","clearRow",{"$f":"IF(VLOOKUP(A25,Configuration!$B$11:$C$30,2,FALSE)=0, \"Yes\", \"No\")","v":"Yes"}]
["A15",{"$f":"IF(VLOOKUP(A26,Configuration!$B$11:$C$30, 2, FALSE)=0, \"\", VLOOKUP(A26,Configuration!$B$11:$C$30, 2, FALSE))","v":""},"Answer","clearRow",{"$f":"IF(VLOOKUP(A26,Configuration!$B$11:$C$30,2,FALSE)=0, \"Yes\", \"No\")","v":"Yes"}]
["A16",{"$f":"IF(VLOOKUP(A27,Configuration!$B$11:$C$30, 2, FALSE)=0, \"\", VLOOKUP(A27,Configuration!$B$11:$C$30, 2, FALSE))","v":""},"Answer","clearRow",{"$f":"IF(VLOOKUP(A27,Configuration!$B$11:$C$30,2,FALSE)=0, \"Yes\", \"No\")","v":"Yes"}]
["A17",{"$f":"IF(VLOOKUP(A28,Configuration!$B$11:$C$30, 2, FALSE)=0, \"\", VLOOKUP(A28,Configuration!$B$11:$C$30, 2, FALSE))","v":""},"Answer","clearRow",{"$f":"IF(VLOOKUP(A28,Configuration!$B$11:$C$30,2,FALSE)=0, \"Yes\", \"No\")","v":"Yes"}]
["A18",{"$f":"IF(VLOOKUP(A29,Configuration!$B$11:$C$30, 2, FALSE)=0, \"\", VLOOKUP(A29,Configuration!$B$11:$C$30, 2, FALSE))","v":""},"Answer","clearRow",{"$f":"IF(VLOOKUP(A29,Configuration!$B$11:$C$30,2,FALSE)=0, \"Yes\", \"No\")","v":"Yes"}]
["A19",{"$f":"IF(VLOOKUP(A30,Configuration!$B$11:$C$30, 2, FALSE)=0, \"\", VLOOKUP(A30,Configuration!$B$11:$C$30, 2, FALSE))","v":""},"Answer","clearRow",{"$f":"IF(VLOOKUP(A30,Configuration!$B$11:$C$30,2,FALSE)=0, \"Yes\", \"No\")","v":"Yes"}]
["A20",{"$f":"IF(VLOOKUP(A31,Configuration!$B$11:$C$30, 2, FALSE)=0, \"\", VLOOKUP(A31,Configuration!$B$11:$C$30, 2, FALSE))","v":""},"Answer","clearRow",{"$f":"IF(VLOOKUP(A31,Configuration!$B$11:$C$30,2,FALSE)=0, \"Yes\", \"No\")","v":"Yes"}]
[]
[null,"Comments:"]

{"sheet":"Quality","index":6,"n_rows":57,"n_cols":17,"rows_kept":57,"cut":false,"hidden":false,"merged":[[33,1,34,4],[10,2,10,4]]}
[1,null,null,null,null,"clearCol","hideCol","calcCol","progressCol",null,null,null,null,null,"picklist","lookup","lookup2"]
[null,{"$f":"\"Data Quality Rating: \"&Configuration!C8","v":"Data Quality Rating: Pavement Management"},null,null,null,null,null,null,{"$f":"COUNTIFS(F12:F36, \"=clearRow\",G12:G36, \"=No\")*3","v":15},null,null,null,null,null,"Answer"]
[null,"How would you rate the quality of available data for these activities - considering level of detail, timeliness, completeness and consistency?",null,null,null,null,null,null,{"$f":"COUNTIF(C13:E32,\"<>Answer\")","v":0},null,null,null,null,null,"Poor",1,"Poor"]
[null,"Poor: Data aren't detailed, current, accurate or complete enough to be useful",null,null,null,null,null,null,{"$f":"I3/I2","v":0},null,null,null,null,null,"Fair",2,"Fair"]
[null,"Fair: Data are useful but lack of currency, accuracy or completeness limits value",null,null,null,null,null,null,null,null,null,null,null,null,"Good",3,"Good"]
[null,"Good: Data quality is acceptable but should be improved",null,null,null,null,null,null,null,null,null,null,null,null,"Excellent",4,"Excellent"]
[null,"Excellent: Data quality is sufficient for this activity - no improvements are needed",null,null,null,null,null,null,"Progress:",{"$f":"IFERROR(I4,0)","v":0},null,null,null,null,"NA",0,"NA"]
[null,"NA: Don't know - not enough information"]
[]
[]
["lookupVal",null,"Quality Rating"]
[null,"Data Source","Currency","Accuracy","Completeness"]
["S1",{"$f":"IF(VLOOKUP(A13,Configuration!$B$33:$C$52,2,FALSE)=0,\"\", VLOOKUP(A13,Configuration!$B$33:$C$52,2,FALSE))","v":"Pavement Distress, Rutting and Roughness"},"Answer","Answer","Answer","clearRow",{"$f":"IF(B13<>\"\", \"No\", \"Yes\")","v":"No"},{"$f":"IF(AND(C13=\"NA\", D13=\"NA\", E13=\"NA\"), \"NA\", IFERROR(MIN(C38:E38),\"\"))","v":""}]
["S2",{"$f":"IF(VLOOKUP(A14,Configuration!$B$33:$C$52,2,FALSE)=0,\"\", VLOOKUP(A14,Configuration!$B$33:$C$52,2,FALSE))","v":"Linear Referencing (routes, intersections, mileposts)"},"Answer","Answer","Answer","clearRow",{"$f":"IF(B14<>\"\", \"No\", \"Yes\")","v":"No"},{"$f":"IF(AND(C14=\"NA\", D14=\"NA\", E14=\"NA\"), \"NA\", IFERROR(MIN(C39:E39),\"\"))","v":""}]
["S3",{"$f":"IF(VLOOKUP(A15,Configuration!$B$33:$C$52,2,FALSE)=0,\"\", VLOOKUP(A15,Configuration!$B$33:$C$52,2,FALSE))","v":"Traffic - AADT, Trucks, ESALS"},"Answer","Answer","Answer","clearRow","No",""]
["S4",{"$f":"IF(VLOOKUP(A16,Configuration!$B$33:$C$52,2,FALSE)=0,\"\", VLOOKUP(A16,Configuration!$B$33:$C$52,2,FALSE))","v":"Pavement Structure Characteristics"},"Answer","Answer","Answer","clearRow","No",""]
["S5",{"$f":"IF(VLOOKUP(A17,Configuration!$B$33:$C$52,2,FALSE)=0,\"\", VLOOKUP(A17,Configuration!$B$33:$C$52,2,FALSE))","v":"Road Inventory: # Lanes, Functional Class"},"Answer","Answer","Answer","clearRow","No",""]
["S6",{"$f":"IF(VLOOKUP(A18,Configuration!$B$33:$C$52,2,FALSE)=0,\"\", VLOOKUP(A18,Configuration!$B$33:$C$52,2,FALSE))","v":""},"Answer","Answer","Answer","clearRow","Yes",""]
["S7",{"$f":"IF(VLOOKUP(A19,Configuration!$B$33:$C$52,2,FALSE)=0,\"\", VLOOKUP(A19,Configuration!$B$33:$C$52,2,FALSE))","v":""},"Answer","Answer","Answer","clearRow","Yes",""]
["S8",{"$f":"IF(VLOOKUP(A20,Configuration!$B$33:$C$52,2,FALSE)=0,\"\", VLOOKUP(A20,Configuration!$B$33:$C$52,2,FALSE))","v":""},"Answer","Answer","Answer","clearRow","Yes",""]
["S9",{"$f":"IF(VLOOKUP(A21,Configuration!$B$33:$C$52,2,FALSE)=0,\"\", VLOOKUP(A21,Configuration!$B$33:$C$52,2,FALSE))","v":""},"Answer","Answer","Answer","clearRow","Yes",""]
["S10",{"$f":"IF(VLOOKUP(A22,Configuration!$B$33:$C$52,2,FALSE)=0,\"\", VLOOKUP(A22,Configuration!$B$33:$C$52,2,FALSE))","v":""},"Answer","Answer","Answer","clearRow","Yes",""]
["S11",{"$f":"IF(VLOOKUP(A23,Configuration!$B$33:$C$52,2,FALSE)=0,\"\", VLOOKUP(A23,Configuration!$B$33:$C$52,2,FALSE))","v":""},"Answer","Answer","Answer","clearRow","Yes",""]
["S12",{"$f":"IF(VLOOKUP(A24,Configuration!$B$33:$C$52,2,FALSE)=0,\"\", VLOOKUP(A24,Configuration!$B$33:$C$52,2,FALSE))","v":""},"Answer","Answer","Answer","clearRow","Yes",""]
["S13",{"$f":"IF(VLOOKUP(A25,Configuration!$B$33:$C$52,2,FALSE)=0,\"\", VLOOKUP(A25,Configuration!$B$33:$C$52,2,FALSE))","v":""},"Answer","Answer","Answer","clearRow","Yes",""]
["S14",{"$f":"IF(VLOOKUP(A26,Configuration!$B$33:$C$52,2,FALSE)=0,\"\", VLOOKUP(A26,Configuration!$B$33:$C$52,2,FALSE))","v":""},"Answer","Answer","Answer","clearRow","Yes",""]
["S15",{"$f":"IF(VLOOKUP(A27,Configuration!$B$33:$C$52,2,FALSE)=0,\"\", VLOOKUP(A27,Configuration!$B$33:$C$52,2,FALSE))","v":""},"Answer","Answer","Answer","clearRow","Yes",""]
["S16",{"$f":"IF(VLOOKUP(A28,Configuration!$B$33:$C$52,2,FALSE)=0,\"\", VLOOKUP(A28,Configuration!$B$33:$C$52,2,FALSE))","v":""},"Answer","Answer","Answer","clearRow","Yes",""]
["S17",{"$f":"IF(VLOOKUP(A29,Configuration!$B$33:$C$52,2,FALSE)=0,\"\", VLOOKUP(A29,Configuration!$B$33:$C$52,2,FALSE))","v":""},"Answer","Answer","Answer","clearRow","Yes",""]
["S18",{"$f":"IF(VLOOKUP(A30,Configuration!$B$33:$C$52,2,FALSE)=0,\"\", VLOOKUP(A30,Configuration!$B$33:$C$52,2,FALSE))","v":""},"Answer","Answer","Answer","clearRow","Yes",""]
["S19",{"$f":"IF(VLOOKUP(A31,Configuration!$B$33:$C$52,2,FALSE)=0,\"\", VLOOKUP(A31,Configuration!$B$33:$C$52,2,FALSE))","v":""},"Answer","Answer","Answer","clearRow","Yes",""]
["S20",{"$f":"IF(VLOOKUP(A32,Configuration!$B$33:$C$52,2,FALSE)=0,\"\", VLOOKUP(A32,Configuration!$B$33:$C$52,2,FALSE))","v":""},"Answer","Answer","Answer","clearRow","Yes",""]
[]
[null,"Comments:"]
[]
[]
[]
[null,null,{"$f":"IF(C13=\"NA\", \"NA\", VLOOKUP(C13,$O$3:$P$7,2,FALSE))","v":{"$error":"#N/A"}},{"$f":"IF(D13=\"NA\", \"NA\", VLOOKUP(D13,$O$3:$P$7,2,FALSE))","v":{"$error":"#N/A"}},{"$error":"#N/A"}]
[null,null,{"$f":"IF(C14=\"NA\", \"NA\", VLOOKUP(C14,$O$3:$P$7,2,FALSE))","v":{"$error":"#N/A"}},{"$error":"#N/A"},{"$error":"#N/A"}]
[null,null,{"$f":"IF(C15=\"NA\", \"NA\", VLOOKUP(C15,$O$3:$P$7,2,FALSE))","v":{"$error":"#N/A"}},{"$error":"#N/A"},{"$error":"#N/A"}]
[null,null,{"$f":"IF(C16=\"NA\", \"NA\", VLOOKUP(C16,$O$3:$P$7,2,FALSE))","v":{"$error":"#N/A"}},{"$error":"#N/A"},{"$error":"#N/A"}]
[null,null,{"$f":"IF(C17=\"NA\", \"NA\", VLOOKUP(C17,$O$3:$P$7,2,FALSE))","v":{"$error":"#N/A"}},{"$error":"#N/A"},{"$error":"#N/A"}]
[null,null,{"$f":"IF(C18=\"NA\", \"NA\", VLOOKUP(C18,$O$3:$P$7,2,FALSE))","v":{"$error":"#N/A"}},{"$error":"#N/A"},{"$error":"#N/A"}]
[null,null,{"$f":"IF(C19=\"NA\", \"NA\", VLOOKUP(C19,$O$3:$P$7,2,FALSE))","v":{"$error":"#N/A"}},{"$error":"#N/A"},{"$error":"#N/A"}]
[null,null,{"$f":"IF(C20=\"NA\", \"NA\", VLOOKUP(C20,$O$3:$P$7,2,FALSE))","v":{"$error":"#N/A"}},{"$error":"#N/A"},{"$error":"#N/A"}]
[null,null,{"$f":"IF(C21=\"NA\", \"NA\", VLOOKUP(C21,$O$3:$P$7,2,FALSE))","v":{"$error":"#N/A"}},{"$error":"#N/A"},{"$error":"#N/A"}]
[null,null,{"$f":"IF(C22=\"NA\", \"NA\", VLOOKUP(C22,$O$3:$P$7,2,FALSE))","v":{"$error":"#N/A"}},{"$error":"#N/A"},{"$error":"#N/A"}]
[null,null,{"$f":"IF(C23=\"NA\", \"NA\", VLOOKUP(C23,$O$3:$P$7,2,FALSE))","v":{"$error":"#N/A"}},{"$error":"#N/A"},{"$error":"#N/A"}]
[null,null,{"$f":"IF(C24=\"NA\", \"NA\", VLOOKUP(C24,$O$3:$P$7,2,FALSE))","v":{"$error":"#N/A"}},{"$error":"#N/A"},{"$error":"#N/A"}]
[null,null,{"$f":"IF(C25=\"NA\", \"NA\", VLOOKUP(C25,$O$3:$P$7,2,FALSE))","v":{"$error":"#N/A"}},{"$error":"#N/A"},{"$error":"#N/A"}]
[null,null,{"$f":"IF(C26=\"NA\", \"NA\", VLOOKUP(C26,$O$3:$P$7,2,FALSE))","v":{"$error":"#N/A"}},{"$error":"#N/A"},{"$error":"#N/A"}]
[null,null,{"$f":"IF(C27=\"NA\", \"NA\", VLOOKUP(C27,$O$3:$P$7,2,FALSE))","v":{"$error":"#N/A"}},{"$error":"#N/A"},{"$error":"#N/A"}]
[null,null,{"$f":"IF(C28=\"NA\", \"NA\", VLOOKUP(C28,$O$3:$P$7,2,FALSE))","v":{"$error":"#N/A"}},{"$error":"#N/A"},{"$error":"#N/A"}]
[null,null,{"$f":"IF(C29=\"NA\", \"NA\", VLOOKUP(C29,$O$3:$P$7,2,FALSE))","v":{"$error":"#N/A"}},{"$error":"#N/A"},{"$error":"#N/A"}]
[null,null,{"$f":"IF(C30=\"NA\", \"NA\", VLOOKUP(C30,$O$3:$P$7,2,FALSE))","v":{"$error":"#N/A"}},{"$error":"#N/A"},{"$error":"#N/A"}]
[null,null,{"$f":"IF(C31=\"NA\", \"NA\", VLOOKUP(C31,$O$3:$P$7,2,FALSE))","v":{"$error":"#N/A"}},{"$error":"#N/A"},{"$error":"#N/A"}]
[null,null,{"$f":"IF(C32=\"NA\", \"NA\", VLOOKUP(C32,$O$3:$P$7,2,FALSE))","v":{"$error":"#N/A"}},{"$error":"#N/A"},{"$error":"#N/A"}]

{"sheet":"Usability","index":7,"n_rows":33,"n_cols":14,"rows_kept":33,"cut":false,"hidden":false,"merged":[[3,1,3,2],[4,1,4,2],[5,1,5,2],[6,1,6,2],[32,1,33,2]]}
[1,null,null,"clearCol","hideCol","calcCol","progressCol",null,null,null,null,null,"picklist"]
[null,{"$f":"\"Data Usability Rating: \"&Configuration!C8","v":"Data Usability Rating: Pavement Management"},null,null,null,null,{"$f":"COUNTIFS(D12:D31, \"=clearRow\",E12:E31, \"=No\")","v":5},null,null,null,null,null,"Answer"]
[null,"How would you rate the ease of accessing, summarizing and using the available data?",null,null,null,null,{"$f":"COUNTIF(C12:C31,\"<>Answer\")","v":0},null,null,null,null,null,"Poor",1]
[null,"Poor: Data are available but require substantial effort to translate into usable form",null,null,null,null,{"$f":"G3/G2","v":0},null,null,null,null,null,"Fair",2]
[null,"Fair: Data are available but require moderate effort to translate into usable form",null,null,null,null,null,null,null,null,null,null,"Good",3]
[null,"Good: Data are available in a usable form but improvements to reporting capabilities would be helpful",null,null,null,null,null,null,null,null,null,null,"Excellent",4]
[null,"Excellent: Data are available in a usable form - no improvements needed",null,null,null,null,"Progress:",{"$f":"IFERROR(G4,0)","v":0},null,null,null,null,"NA",0]
[null,"NA: Don't know - not enough information"]
[]
["lookupVal"]
[null,"Data Source","Usability Rating"]
["S1",{"$f":"IF(VLOOKUP(A12,Configuration!$B$33:$C$52,2,FALSE)=0,\"\", VLOOKUP(A12,Configuration!$B$33:$C$52,2,FALSE))","v":"Pavement Distress, Rutting and Roughness"},"Answer","clearRow",{"$f":"IF(B12<>\"\", \"No\", \"Yes\")","v":"No"},{"$f":"IFERROR(VLOOKUP(C12,$M$3:$N$7,2,FALSE), \"\")","v":""}]
["S2",{"$f":"IF(VLOOKUP(A13,Configuration!$B$33:$C$52,2,FALSE)=0,\"\", VLOOKUP(A13,Configuration!$B$33:$C$52,2,FALSE))","v":"Linear Referencing (routes, intersections, mileposts)"},"Answer","clearRow",{"$f":"IF(B13<>\"\", \"No\", \"Yes\")","v":"No"},{"$f":"IFERROR(VLOOKUP(C13,$M$3:$N$7,2,FALSE), \"\")","v":""}]
["S3",{"$f":"IF(VLOOKUP(A14,Configuration!$B$33:$C$52,2,FALSE)=0,\"\", VLOOKUP(A14,Configuration!$B$33:$C$52,2,FALSE))","v":"Traffic - AADT, Trucks, ESALS"},"Answer","clearRow","No",""]
["S4",{"$f":"IF(VLOOKUP(A15,Configuration!$B$33:$C$52,2,FALSE)=0,\"\", VLOOKUP(A15,Configuration!$B$33:$C$52,2,FALSE))","v":"Pavement Structure Characteristics"},"Answer","clearRow","No",""]
["S5",{"$f":"IF(VLOOKUP(A16,Configuration!$B$33:$C$52,2,FALSE)=0,\"\", VLOOKUP(A16,Configuration!$B$33:$C$52,2,FALSE))","v":"Road Inventory: # Lanes, Functional Class"},"Answer","clearRow","No",""]
["S6",{"$f":"IF(VLOOKUP(A17,Configuration!$B$33:$C$52,2,FALSE)=0,\"\", VLOOKUP(A17,Configuration!$B$33:$C$52,2,FALSE))","v":""},"Answer","clearRow","Yes",""]
["S7",{"$f":"IF(VLOOKUP(A18,Configuration!$B$33:$C$52,2,FALSE)=0,\"\", VLOOKUP(A18,Configuration!$B$33:$C$52,2,FALSE))","v":""},"Answer","clearRow","Yes",""]
["S8",{"$f":"IF(VLOOKUP(A19,Configuration!$B$33:$C$52,2,FALSE)=0,\"\", VLOOKUP(A19,Configuration!$B$33:$C$52,2,FALSE))","v":""},"Answer","clearRow","Yes",""]
["S9",{"$f":"IF(VLOOKUP(A20,Configuration!$B$33:$C$52,2,FALSE)=0,\"\", VLOOKUP(A20,Configuration!$B$33:$C$52,2,FALSE))","v":""},"Answer","clearRow","Yes",""]
["S10",{"$f":"IF(VLOOKUP(A21,Configuration!$B$33:$C$52,2,FALSE)=0,\"\", VLOOKUP(A21,Configuration!$B$33:$C$52,2,FALSE))","v":""},"Answer","clearRow","Yes",""]
["S11",{"$f":"IF(VLOOKUP(A22,Configuration!$B$33:$C$52,2,FALSE)=0,\"\", VLOOKUP(A22,Configuration!$B$33:$C$52,2,FALSE))","v":""},"Answer","clearRow","Yes",""]
["S12",{"$f":"IF(VLOOKUP(A23,Configuration!$B$33:$C$52,2,FALSE)=0,\"\", VLOOKUP(A23,Configuration!$B$33:$C$52,2,FALSE))","v":""},"Answer","clearRow","Yes",""]
["S13",{"$f":"IF(VLOOKUP(A24,Configuration!$B$33:$C$52,2,FALSE)=0,\"\", VLOOKUP(A24,Configuration!$B$33:$C$52,2,FALSE))","v":""},"Answer","clearRow","Yes",""]
["S14",{"$f":"IF(VLOOKUP(A25,Configuration!$B$33:$C$52,2,FALSE)=0,\"\", VLOOKUP(A25,Configuration!$B$33:$C$52,2,FALSE))","v":""},"Answer","clearRow","Yes",""]
["S15",{"$f":"IF(VLOOKUP(A26,Configuration!$B$33:$C$52,2,FALSE)=0,\"\", VLOOKUP(A26,Configuration!$B$33:$C$52,2,FALSE))","v":""},"Answer","clearRow","Yes",""]
["S16",{"$f":"IF(VLOOKUP(A27,Configuration!$B$33:$C$52,2,FALSE)=0,\"\", VLOOKUP(A27,Configuration!$B$33:$C$52,2,FALSE))","v":""},"Answer","clearRow","Yes",""]
["S17",{"$f":"IF(VLOOKUP(A28,Configuration!$B$33:$C$52,2,FALSE)=0,\"\", VLOOKUP(A28,Configuration!$B$33:$C$52,2,FALSE))","v":""},"Answer","clearRow","Yes",""]
["S18",{"$f":"IF(VLOOKUP(A29,Configuration!$B$33:$C$52,2,FALSE)=0,\"\", VLOOKUP(A29,Configuration!$B$33:$C$52,2,FALSE))","v":""},"Answer","clearRow","Yes",""]
["S19",{"$f":"IF(VLOOKUP(A30,Configuration!$B$33:$C$52,2,FALSE)=0,\"\", VLOOKUP(A30,Configuration!$B$33:$C$52,2,FALSE))","v":""},"Answer","clearRow","Yes",""]
["S20",{"$f":"IF(VLOOKUP(A31,Configuration!$B$33:$C$52,2,FALSE)=0,\"\", VLOOKUP(A31,Configuration!$B$33:$C$52,2,FALSE))","v":""},"Answer","clearRow","Yes",""]
[]
[null,"Comments:"]

{"sheet":"Results","index":8,"n_rows":76,"n_cols":12,"rows_kept":76,"cut":false,"hidden":false,"merged":[[5,3,5,5],[3,1,3,6]]}
[null,null,null,null,null,null,null,"hideCol"]
[null,null,null,null,null,null,null,null,null,1,"Poor",1]
[null,null,null,null,null,null,null,null,null,2,"Fair",2]
[null,{"$f":"\"Results: \"&Configuration!C8","v":"Results: Pavement Management"},null,null,null,null,null,null,null,3,"Good",3]
[null,null,null,null,null,null,null,null,null,4,"Excellent",4]
[null,null,null,"Quality"]
["lookupVal","Data Source","Importance","Currency","Accuracy","Completeness","Usability"]
["S1",{"$f":"VLOOKUP(A8,Configuration!$B$33:$C$52, 2, FALSE)","v":"Pavement Distress, Rutting and Roughness"},{"$f":"VLOOKUP(A8,Importance!$A$11:$F$30,6,FALSE)","v":""},{"$f":"IF(VLOOKUP(A8,Quality!$A$13:$E$32,3,FALSE)=\"Answer\",\"\", VLOOKUP(A8,Quality!$A$13:$E$32,3,FALSE))","v":""},{"$f":"IF(VLOOKUP(A8,Quality!$A$13:$E$32,4,FALSE)=\"Answer\",\"\",VLOOKUP(A8,Quality!$A$13:$E$32,4,FALSE))","v":""},{"$f":"IF(VLOOKUP(A8,Quality!$A$13:$E$32,5,FALSE)=\"Answer\", \"\", VLOOKUP(A8,Quality!$A$13:$E$32,5,FALSE))","v":""},{"$f":"IF(VLOOKUP(A8,Usability!$A$12:$C$31,3,FALSE)=\"Answer\",\"\",VLOOKUP(A8,Usability!$A$12:$C$31,3,FALSE))","v":""},{"$f":"IF(VLOOKUP(A8,Configuration!$B$33:$C$52,2,FALSE)=0, \"Yes\", \"No\")","v":"No"}]
["S2",{"$f":"VLOOKUP(A9,Configuration!$B$33:$C$52, 2, FALSE)","v":"Linear Referencing (routes, intersections, mileposts)"},{"$f":"VLOOKUP(A9,Importance!$A$11:$F$30,6,FALSE)","v":""},{"$f":"IF(VLOOKUP(A9,Quality!$A$13:$E$32,3,FALSE)=\"Answer\",\"\", VLOOKUP(A9,Quality!$A$13:$E$32,3,FALSE))","v":""},{"$f":"IF(VLOOKUP(A9,Quality!$A$13:$E$32,4,FALSE)=\"Answer\",\"\",VLOOKUP(A9,Quality!$A$13:$E$32,4,FALSE))","v":""},{"$f":"IF(VLOOKUP(A9,Quality!$A$13:$E$32,5,FALSE)=\"Answer\", \"\", VLOOKUP(A9,Quality!$A$13:$E$32,5,FALSE))","v":""},{"$f":"IF(VLOOKUP(A9,Usability!$A$12:$C$31,3,FALSE)=\"Answer\",\"\",VLOOKUP(A9,Usability!$A$12:$C$31,3,FALSE))","v":""},{"$f":"IF(VLOOKUP(A9,Configuration!$B$33:$C$52,2,FALSE)=0, \"Yes\", \"No\")","v":"No"}]
["S3",{"$f":"VLOOKUP(A10,Configuration!$B$33:$C$52, 2, FALSE)","v":"Traffic - AADT, Trucks, ESALS"},{"$f":"VLOOKUP(A10,Importance!$A$11:$F$30,6,FALSE)","v":""},{"$f":"IF(VLOOKUP(A10,Quality!$A$13:$E$32,3,FALSE)=\"Answer\",\"\", VLOOKUP(A10,Quality!$A$13:$E$32,3,FALSE))","v":""},{"$f":"IF(VLOOKUP(A10,Quality!$A$13:$E$32,4,FALSE)=\"Answer\",\"\",VLOOKUP(A10,Quality!$A$13:$E$32,4,FALSE))","v":""},{"$f":"IF(VLOOKUP(A10,Quality!$A$13:$E$32,5,FALSE)=\"Answer\", \"\", VLOOKUP(A10,Quality!$A$13:$E$32,5,FALSE))","v":""},{"$f":"IF(VLOOKUP(A10,Usability!$A$12:$C$31,3,FALSE)=\"Answer\",\"\",VLOOKUP(A10,Usability!$A$12:$C$31,3,FALSE))","v":""},{"$f":"IF(VLOOKUP(A10,Configuration!$B$33:$C$52,2,FALSE)=0, \"Yes\", \"No\")","v":"No"}]
["S4",{"$f":"VLOOKUP(A11,Configuration!$B$33:$C$52, 2, FALSE)","v":"Pavement Structure Characteristics"},{"$f":"VLOOKUP(A11,Importance!$A$11:$F$30,6,FALSE)","v":""},{"$f":"IF(VLOOKUP(A11,Quality!$A$13:$E$32,3,FALSE)=\"Answer\",\"\", VLOOKUP(A11,Quality!$A$13:$E$32,3,FALSE))","v":""},{"$f":"IF(VLOOKUP(A11,Quality!$A$13:$E$32,4,FALSE)=\"Answer\",\"\",VLOOKUP(A11,Quality!$A$13:$E$32,4,FALSE))","v":""},{"$f":"IF(VLOOKUP(A11,Quality!$A$13:$E$32,5,FALSE)=\"Answer\", \"\", VLOOKUP(A11,Quality!$A$13:$E$32,5,FALSE))","v":""},{"$f":"IF(VLOOKUP(A11,Usability!$A$12:$C$31,3,FALSE)=\"Answer\",\"\",VLOOKUP(A11,Usability!$A$12:$C$31,3,FALSE))","v":""},{"$f":"IF(VLOOKUP(A11,Configuration!$B$33:$C$52,2,FALSE)=0, \"Yes\", \"No\")","v":"No"}]
["S5",{"$f":"VLOOKUP(A12,Configuration!$B$33:$C$52, 2, FALSE)","v":"Road Inventory: # Lanes, Functional Class"},{"$f":"VLOOKUP(A12,Importance!$A$11:$F$30,6,FALSE)","v":""},{"$f":"IF(VLOOKUP(A12,Quality!$A$13:$E$32,3,FALSE)=\"Answer\",\"\", VLOOKUP(A12,Quality!$A$13:$E$32,3,FALSE))","v":""},{"$f":"IF(VLOOKUP(A12,Quality!$A$13:$E$32,4,FALSE)=\"Answer\",\"\",VLOOKUP(A12,Quality!$A$13:$E$32,4,FALSE))","v":""},{"$f":"IF(VLOOKUP(A12,Quality!$A$13:$E$32,5,FALSE)=\"Answer\", \"\", VLOOKUP(A12,Quality!$A$13:$E$32,5,FALSE))","v":""},{"$f":"IF(VLOOKUP(A12,Usability!$A$12:$C$31,3,FALSE)=\"Answer\",\"\",VLOOKUP(A12,Usability!$A$12:$C$31,3,FALSE))","v":""},{"$f":"IF(VLOOKUP(A12,Configuration!$B$33:$C$52,2,FALSE)=0, \"Yes\", \"No\")","v":"No"}]
["S6",{"$f":"VLOOKUP(A13,Configuration!$B$33:$C$52, 2, FALSE)","v":0},{"$f":"VLOOKUP(A13,Importance!$A$11:$F$30,6,FALSE)","v":""},{"$f":"IF(VLOOKUP(A13,Quality!$A$13:$E$32,3,FALSE)=\"Answer\",\"\", VLOOKUP(A13,Quality!$A$13:$E$32,3,FALSE))","v":""},{"$f":"IF(VLOOKUP(A13,Quality!$A$13:$E$32,4,FALSE)=\"Answer\",\"\",VLOOKUP(A13,Quality!$A$13:$E$32,4,FALSE))","v":""},{"$f":"IF(VLOOKUP(A13,Quality!$A$13:$E$32,5,FALSE)=\"Answer\", \"\", VLOOKUP(A13,Quality!$A$13:$E$32,5,FALSE))","v":""},{"$f":"IF(VLOOKUP(A13,Usability!$A$12:$C$31,3,FALSE)=\"Answer\",\"\",VLOOKUP(A13,Usability!$A$12:$C$31,3,FALSE))","v":""},{"$f":"IF(VLOOKUP(A13,Configuration!$B$33:$C$52,2,FALSE)=0, \"Yes\", \"No\")","v":"Yes"}]
["S7",{"$f":"VLOOKUP(A14,Configuration!$B$33:$C$52, 2, FALSE)","v":0},{"$f":"VLOOKUP(A14,Importance!$A$11:$F$30,6,FALSE)","v":""},{"$f":"IF(VLOOKUP(A14,Quality!$A$13:$E$32,3,FALSE)=\"Answer\",\"\", VLOOKUP(A14,Quality!$A$13:$E$32,3,FALSE))","v":""},{"$f":"IF(VLOOKUP(A14,Quality!$A$13:$E$32,4,FALSE)=\"Answer\",\"\",VLOOKUP(A14,Quality!$A$13:$E$32,4,FALSE))","v":""},{"$f":"IF(VLOOKUP(A14,Quality!$A$13:$E$32,5,FALSE)=\"Answer\", \"\", VLOOKUP(A14,Quality!$A$13:$E$32,5,FALSE))","v":""},{"$f":"IF(VLOOKUP(A14,Usability!$A$12:$C$31,3,FALSE)=\"Answer\",\"\",VLOOKUP(A14,Usability!$A$12:$C$31,3,FALSE))","v":""},{"$f":"IF(VLOOKUP(A14,Configuration!$B$33:$C$52,2,FALSE)=0, \"Yes\", \"No\")","v":"Yes"}]
["S8",{"$f":"VLOOKUP(A15,Configuration!$B$33:$C$52, 2, FALSE)","v":0},{"$f":"VLOOKUP(A15,Importance!$A$11:$F$30,6,FALSE)","v":""},{"$f":"IF(VLOOKUP(A15,Quality!$A$13:$E$32,3,FALSE)=\"Answer\",\"\", VLOOKUP(A15,Quality!$A$13:$E$32,3,FALSE))","v":""},{"$f":"IF(VLOOKUP(A15,Quality!$A$13:$E$32,4,FALSE)=\"Answer\",\"\",VLOOKUP(A15,Quality!$A$13:$E$32,4,FALSE))","v":""},{"$f":"IF(VLOOKUP(A15,Quality!$A$13:$E$32,5,FALSE)=\"Answer\", \"\", VLOOKUP(A15,Quality!$A$13:$E$32,5,FALSE))","v":""},{"$f":"IF(VLOOKUP(A15,Usability!$A$12:$C$31,3,FALSE)=\"Answer\",\"\",VLOOKUP(A15,Usability!$A$12:$C$31,3,FALSE))","v":""},{"$f":"IF(VLOOKUP(A15,Configuration!$B$33:$C$52,2,FALSE)=0, \"Yes\", \"No\")","v":"Yes"}]
["S9",{"$f":"VLOOKUP(A16,Configuration!$B$33:$C$52, 2, FALSE)","v":0},{"$f":"VLOOKUP(A16,Importance!$A$11:$F$30,6,FALSE)","v":""},{"$f":"IF(VLOOKUP(A16,Quality!$A$13:$E$32,3,FALSE)=\"Answer\",\"\", VLOOKUP(A16,Quality!$A$13:$E$32,3,FALSE))","v":""},{"$f":"IF(VLOOKUP(A16,Quality!$A$13:$E$32,4,FALSE)=\"Answer\",\"\",VLOOKUP(A16,Quality!$A$13:$E$32,4,FALSE))","v":""},{"$f":"IF(VLOOKUP(A16,Quality!$A$13:$E$32,5,FALSE)=\"Answer\", \"\", VLOOKUP(A16,Quality!$A$13:$E$32,5,FALSE))","v":""},{"$f":"IF(VLOOKUP(A16,Usability!$A$12:$C$31,3,FALSE)=\"Answer\",\"\",VLOOKUP(A16,Usability!$A$12:$C$31,3,FALSE))","v":""},{"$f":"IF(VLOOKUP(A16,Configuration!$B$33:$C$52,2,FALSE)=0, \"Yes\", \"No\")","v":"Yes"}]
["S10",{"$f":"VLOOKUP(A17,Configuration!$B$33:$C$52, 2, FALSE)","v":0},{"$f":"VLOOKUP(A17,Importance!$A$11:$F$30,6,FALSE)","v":""},{"$f":"IF(VLOOKUP(A17,Quality!$A$13:$E$32,3,FALSE)=\"Answer\",\"\", VLOOKUP(A17,Quality!$A$13:$E$32,3,FALSE))","v":""},{"$f":"IF(VLOOKUP(A17,Quality!$A$13:$E$32,4,FALSE)=\"Answer\",\"\",VLOOKUP(A17,Quality!$A$13:$E$32,4,FALSE))","v":""},{"$f":"IF(VLOOKUP(A17,Quality!$A$13:$E$32,5,FALSE)=\"Answer\", \"\", VLOOKUP(A17,Quality!$A$13:$E$32,5,FALSE))","v":""},{"$f":"IF(VLOOKUP(A17,Usability!$A$12:$C$31,3,FALSE)=\"Answer\",\"\",VLOOKUP(A17,Usability!$A$12:$C$31,3,FALSE))","v":""},{"$f":"IF(VLOOKUP(A17,Configuration!$B$33:$C$52,2,FALSE)=0, \"Yes\", \"No\")","v":"Yes"}]
["S11",{"$f":"VLOOKUP(A18,Configuration!$B$33:$C$52, 2, FALSE)","v":0},{"$f":"VLOOKUP(A18,Importance!$A$11:$F$30,6,FALSE)","v":""},{"$f":"IF(VLOOKUP(A18,Quality!$A$13:$E$32,3,FALSE)=\"Answer\",\"\", VLOOKUP(A18,Quality!$A$13:$E$32,3,FALSE))","v":""},{"$f":"IF(VLOOKUP(A18,Quality!$A$13:$E$32,4,FALSE)=\"Answer\",\"\",VLOOKUP(A18,Quality!$A$13:$E$32,4,FALSE))","v":""},{"$f":"IF(VLOOKUP(A18,Quality!$A$13:$E$32,5,FALSE)=\"Answer\", \"\", VLOOKUP(A18,Quality!$A$13:$E$32,5,FALSE))","v":""},{"$f":"IF(VLOOKUP(A18,Usability!$A$12:$C$31,3,FALSE)=\"Answer\",\"\",VLOOKUP(A18,Usability!$A$12:$C$31,3,FALSE))","v":""},{"$f":"IF(VLOOKUP(A18,Configuration!$B$33:$C$52,2,FALSE)=0, \"Yes\", \"No\")","v":"Yes"}]
["S12",{"$f":"VLOOKUP(A19,Configuration!$B$33:$C$52, 2, FALSE)","v":0},{"$f":"VLOOKUP(A19,Importance!$A$11:$F$30,6,FALSE)","v":""},{"$f":"IF(VLOOKUP(A19,Quality!$A$13:$E$32,3,FALSE)=\"Answer\",\"\", VLOOKUP(A19,Quality!$A$13:$E$32,3,FALSE))","v":""},{"$f":"IF(VLOOKUP(A19,Quality!$A$13:$E$32,4,FALSE)=\"Answer\",\"\",VLOOKUP(A19,Quality!$A$13:$E$32,4,FALSE))","v":""},{"$f":"IF(VLOOKUP(A19,Quality!$A$13:$E$32,5,FALSE)=\"Answer\", \"\", VLOOKUP(A19,Quality!$A$13:$E$32,5,FALSE))","v":""},{"$f":"IF(VLOOKUP(A19,Usability!$A$12:$C$31,3,FALSE)=\"Answer\",\"\",VLOOKUP(A19,Usability!$A$12:$C$31,3,FALSE))","v":""},{"$f":"IF(VLOOKUP(A19,Configuration!$B$33:$C$52,2,FALSE)=0, \"Yes\", \"No\")","v":"Yes"}]
["S13",{"$f":"VLOOKUP(A20,Configuration!$B$33:$C$52, 2, FALSE)","v":0},{"$f":"VLOOKUP(A20,Importance!$A$11:$F$30,6,FALSE)","v":""},{"$f":"IF(VLOOKUP(A20,Quality!$A$13:$E$32,3,FALSE)=\"Answer\",\"\", VLOOKUP(A20,Quality!$A$13:$E$32,3,FALSE))","v":""},{"$f":"IF(VLOOKUP(A20,Quality!$A$13:$E$32,4,FALSE)=\"Answer\",\"\",VLOOKUP(A20,Quality!$A$13:$E$32,4,FALSE))","v":""},{"$f":"IF(VLOOKUP(A20,Quality!$A$13:$E$32,5,FALSE)=\"Answer\", \"\", VLOOKUP(A20,Quality!$A$13:$E$32,5,FALSE))","v":""},{"$f":"IF(VLOOKUP(A20,Usability!$A$12:$C$31,3,FALSE)=\"Answer\",\"\",VLOOKUP(A20,Usability!$A$12:$C$31,3,FALSE))","v":""},{"$f":"IF(VLOOKUP(A20,Configuration!$B$33:$C$52,2,FALSE)=0, \"Yes\", \"No\")","v":"Yes"}]
["S14",{"$f":"VLOOKUP(A21,Configuration!$B$33:$C$52, 2, FALSE)","v":0},{"$f":"VLOOKUP(A21,Importance!$A$11:$F$30,6,FALSE)","v":""},{"$f":"IF(VLOOKUP(A21,Quality!$A$13:$E$32,3,FALSE)=\"Answer\",\"\", VLOOKUP(A21,Quality!$A$13:$E$32,3,FALSE))","v":""},{"$f":"IF(VLOOKUP(A21,Quality!$A$13:$E$32,4,FALSE)=\"Answer\",\"\",VLOOKUP(A21,Quality!$A$13:$E$32,4,FALSE))","v":""},{"$f":"IF(VLOOKUP(A21,Quality!$A$13:$E$32,5,FALSE)=\"Answer\", \"\", VLOOKUP(A21,Quality!$A$13:$E$32,5,FALSE))","v":""},{"$f":"IF(VLOOKUP(A21,Usability!$A$12:$C$31,3,FALSE)=\"Answer\",\"\",VLOOKUP(A21,Usability!$A$12:$C$31,3,FALSE))","v":""},{"$f":"IF(VLOOKUP(A21,Configuration!$B$33:$C$52,2,FALSE)=0, \"Yes\", \"No\")","v":"Yes"}]
["S15",{"$f":"VLOOKUP(A22,Configuration!$B$33:$C$52, 2, FALSE)","v":0},{"$f":"VLOOKUP(A22,Importance!$A$11:$F$30,6,FALSE)","v":""},{"$f":"IF(VLOOKUP(A22,Quality!$A$13:$E$32,3,FALSE)=\"Answer\",\"\", VLOOKUP(A22,Quality!$A$13:$E$32,3,FALSE))","v":""},{"$f":"IF(VLOOKUP(A22,Quality!$A$13:$E$32,4,FALSE)=\"Answer\",\"\",VLOOKUP(A22,Quality!$A$13:$E$32,4,FALSE))","v":""},{"$f":"IF(VLOOKUP(A22,Quality!$A$13:$E$32,5,FALSE)=\"Answer\", \"\", VLOOKUP(A22,Quality!$A$13:$E$32,5,FALSE))","v":""},{"$f":"IF(VLOOKUP(A22,Usability!$A$12:$C$31,3,FALSE)=\"Answer\",\"\",VLOOKUP(A22,Usability!$A$12:$C$31,3,FALSE))","v":""},{"$f":"IF(VLOOKUP(A22,Configuration!$B$33:$C$52,2,FALSE)=0, \"Yes\", \"No\")","v":"Yes"}]
["S16",{"$f":"VLOOKUP(A23,Configuration!$B$33:$C$52, 2, FALSE)","v":0},{"$f":"VLOOKUP(A23,Importance!$A$11:$F$30,6,FALSE)","v":""},{"$f":"IF(VLOOKUP(A23,Quality!$A$13:$E$32,3,FALSE)=\"Answer\",\"\", VLOOKUP(A23,Quality!$A$13:$E$32,3,FALSE))","v":""},{"$f":"IF(VLOOKUP(A23,Quality!$A$13:$E$32,4,FALSE)=\"Answer\",\"\",VLOOKUP(A23,Quality!$A$13:$E$32,4,FALSE))","v":""},{"$f":"IF(VLOOKUP(A23,Quality!$A$13:$E$32,5,FALSE)=\"Answer\", \"\", VLOOKUP(A23,Quality!$A$13:$E$32,5,FALSE))","v":""},{"$f":"IF(VLOOKUP(A23,Usability!$A$12:$C$31,3,FALSE)=\"Answer\",\"\",VLOOKUP(A23,Usability!$A$12:$C$31,3,FALSE))","v":""},{"$f":"IF(VLOOKUP(A23,Configuration!$B$33:$C$52,2,FALSE)=0, \"Yes\", \"No\")","v":"Yes"}]
["S17",{"$f":"VLOOKUP(A24,Configuration!$B$33:$C$52, 2, FALSE)","v":0},{"$f":"VLOOKUP(A24,Importance!$A$11:$F$30,6,FALSE)","v":""},{"$f":"IF(VLOOKUP(A24,Quality!$A$13:$E$32,3,FALSE)=\"Answer\",\"\", VLOOKUP(A24,Quality!$A$13:$E$32,3,FALSE))","v":""},{"$f":"IF(VLOOKUP(A24,Quality!$A$13:$E$32,4,FALSE)=\"Answer\",\"\",VLOOKUP(A24,Quality!$A$13:$E$32,4,FALSE))","v":""},{"$f":"IF(VLOOKUP(A24,Quality!$A$13:$E$32,5,FALSE)=\"Answer\", \"\", VLOOKUP(A24,Quality!$A$13:$E$32,5,FALSE))","v":""},{"$f":"IF(VLOOKUP(A24,Usability!$A$12:$C$31,3,FALSE)=\"Answer\",\"\",VLOOKUP(A24,Usability!$A$12:$C$31,3,FALSE))","v":""},{"$f":"IF(VLOOKUP(A24,Configuration!$B$33:$C$52,2,FALSE)=0, \"Yes\", \"No\")","v":"Yes"}]
["S18",{"$f":"VLOOKUP(A25,Configuration!$B$33:$C$52, 2, FALSE)","v":0},{"$f":"VLOOKUP(A25,Importance!$A$11:$F$30,6,FALSE)","v":""},{"$f":"IF(VLOOKUP(A25,Quality!$A$13:$E$32,3,FALSE)=\"Answer\",\"\", VLOOKUP(A25,Quality!$A$13:$E$32,3,FALSE))","v":""},{"$f":"IF(VLOOKUP(A25,Quality!$A$13:$E$32,4,FALSE)=\"Answer\",\"\",VLOOKUP(A25,Quality!$A$13:$E$32,4,FALSE))","v":""},{"$f":"IF(VLOOKUP(A25,Quality!$A$13:$E$32,5,FALSE)=\"Answer\", \"\", VLOOKUP(A25,Quality!$A$13:$E$32,5,FALSE))","v":""},{"$f":"IF(VLOOKUP(A25,Usability!$A$12:$C$31,3,FALSE)=\"Answer\",\"\",VLOOKUP(A25,Usability!$A$12:$C$31,3,FALSE))","v":""},{"$f":"IF(VLOOKUP(A25,Configuration!$B$33:$C$52,2,FALSE)=0, \"Yes\", \"No\")","v":"Yes"}]
["S19",{"$f":"VLOOKUP(A26,Configuration!$B$33:$C$52, 2, FALSE)","v":0},{"$f":"VLOOKUP(A26,Importance!$A$11:$F$30,6,FALSE)","v":""},{"$f":"IF(VLOOKUP(A26,Quality!$A$13:$E$32,3,FALSE)=\"Answer\",\"\", VLOOKUP(A26,Quality!$A$13:$E$32,3,FALSE))","v":""},{"$f":"IF(VLOOKUP(A26,Quality!$A$13:$E$32,4,FALSE)=\"Answer\",\"\",VLOOKUP(A26,Quality!$A$13:$E$32,4,FALSE))","v":""},{"$f":"IF(VLOOKUP(A26,Quality!$A$13:$E$32,5,FALSE)=\"Answer\", \"\", VLOOKUP(A26,Quality!$A$13:$E$32,5,FALSE))","v":""},{"$f":"IF(VLOOKUP(A26,Usability!$A$12:$C$31,3,FALSE)=\"Answer\",\"\",VLOOKUP(A26,Usability!$A$12:$C$31,3,FALSE))","v":""},{"$f":"IF(VLOOKUP(A26,Configuration!$B$33:$C$52,2,FALSE)=0, \"Yes\", \"No\")","v":"Yes"}]
["S20",{"$f":"VLOOKUP(A27,Configuration!$B$33:$C$52, 2, FALSE)","v":0},{"$f":"VLOOKUP(A27,Importance!$A$11:$F$30,6,FALSE)","v":""},{"$f":"IF(VLOOKUP(A27,Quality!$A$13:$E$32,3,FALSE)=\"Answer\",\"\", VLOOKUP(A27,Quality!$A$13:$E$32,3,FALSE))","v":""},{"$f":"IF(VLOOKUP(A27,Quality!$A$13:$E$32,4,FALSE)=\"Answer\",\"\",VLOOKUP(A27,Quality!$A$13:$E$32,4,FALSE))","v":""},{"$f":"IF(VLOOKUP(A27,Quality!$A$13:$E$32,5,FALSE)=\"Answer\", \"\", VLOOKUP(A27,Quality!$A$13:$E$32,5,FALSE))","v":""},{"$f":"IF(VLOOKUP(A27,Usability!$A$12:$C$31,3,FALSE)=\"Answer\",\"\",VLOOKUP(A27,Usability!$A$12:$C$31,3,FALSE))","v":""},{"$f":"IF(VLOOKUP(A27,Configuration!$B$33:$C$52,2,FALSE)=0, \"Yes\", \"No\")","v":"Yes"}]
[]
["lookupVal","Activity","Availability","Quality","Usability"]
["A1",{"$f":"VLOOKUP(A30,Configuration!B4:C24, 2, FALSE)","v":"Understanding System Performance"},{"$f":"IF(VLOOKUP(A30,Availability!$A$12:$C$31,3,FALSE)=\"Answer\", 0, VLOOKUP(A30,Availability!$A$12:$C$31,3,FALSE))","v":0},{"$f":"IFERROR(VLOOKUP(ROUND(VLOOKUP(A30,Importance!$A$10:$N$528, 14, FALSE),0),$J$2:$K$5,2,FALSE),0)","v":0},{"$f":"IFERROR(VLOOKUP(ROUND(VLOOKUP(A30,Importance!$A$10:$N$528, 11, FALSE),0),$J$2:$K$5,2,FALSE),0)","v":0},null,null,{"$f":"IF(VLOOKUP(A30,Configuration!$B$11:$C$30,2,FALSE)=0, \"Yes\", \"No\")","v":"No"},{"$f":"IFERROR(VLOOKUP(C30,$K$2:$L$5,2,FALSE),\"\")","v":""},{"$f":"IFERROR(VLOOKUP(D30,$K$2:$L$5,2,FALSE),\"\")","v":""},{"$f":"IFERROR(VLOOKUP(E30,$K$2:$L$5,2,FALSE),\"\")","v":""}]
["A2",{"$f":"VLOOKUP(A31,Configuration!B5:C25, 2, FALSE)","v":"Tracking Accomplishments, Costs and Resource Allocation"},{"$f":"IF(VLOOKUP(A31,Availability!$A$12:$C$31,3,FALSE)=\"Answer\", 0, VLOOKUP(A31,Availability!$A$12:$C$31,3,FALSE))","v":0},{"$f":"IFERROR(VLOOKUP(ROUND(VLOOKUP(A31,Importance!$A$10:$N$528, 14, FALSE),0),$J$2:$K$5,2,FALSE),0)","v":0},{"$f":"IFERROR(VLOOKUP(ROUND(VLOOKUP(A31,Importance!$A$10:$N$528, 11, FALSE),0),$J$2:$K$5,2,FALSE),0)","v":0},null,null,{"$f":"IF(VLOOKUP(A31,Configuration!$B$11:$C$30,2,FALSE)=0, \"Yes\", \"No\")","v":"No"},{"$f":"IFERROR(VLOOKUP(C31,$K$2:$L$5,2,FALSE),\"\")","v":""},"",""]
["A3",{"$f":"VLOOKUP(A32,Configuration!B7:C26, 2, FALSE)","v":"Anticipating Future Needs"},{"$f":"IF(VLOOKUP(A32,Availability!$A$12:$C$31,3,FALSE)=\"Answer\", 0, VLOOKUP(A32,Availability!$A$12:$C$31,3,FALSE))","v":0},{"$f":"IFERROR(VLOOKUP(ROUND(VLOOKUP(A32,Importance!$A$10:$N$528, 14, FALSE),0),$J$2:$K$5,2,FALSE),0)","v":0},{"$f":"IFERROR(VLOOKUP(ROUND(VLOOKUP(A32,Importance!$A$10:$N$528, 11, FALSE),0),$J$2:$K$5,2,FALSE),0)","v":0},null,null,{"$f":"IF(VLOOKUP(A32,Configuration!$B$11:$C$30,2,FALSE)=0, \"Yes\", \"No\")","v":"No"},"","",""]
["A4",{"$f":"VLOOKUP(A33,Configuration!B8:C27, 2, FALSE)","v":"Performance Diagnostics"},{"$f":"IF(VLOOKUP(A33,Availability!$A$12:$C$31,3,FALSE)=\"Answer\", 0, VLOOKUP(A33,Availability!$A$12:$C$31,3,FALSE))","v":0},{"$f":"IFERROR(VLOOKUP(ROUND(VLOOKUP(A33,Importance!$A$10:$N$528, 14, FALSE),0),$J$2:$K$5,2,FALSE),0)","v":0},{"$f":"IFERROR(VLOOKUP(ROUND(VLOOKUP(A33,Importance!$A$10:$N$528, 11, FALSE),0),$J$2:$K$5,2,FALSE),0)","v":0},null,null,{"$f":"IF(VLOOKUP(A33,Configuration!$B$11:$C$30,2,FALSE)=0, \"Yes\", \"No\")","v":"No"},"","",""]
["A5",{"$f":"VLOOKUP(A34,Configuration!B9:C28, 2, FALSE)","v":"Identifying Improvement Actions"},{"$f":"IF(VLOOKUP(A34,Availability!$A$12:$C$31,3,FALSE)=\"Answer\", 0, VLOOKUP(A34,Availability!$A$12:$C$31,3,FALSE))","v":0},{"$f":"IFERROR(VLOOKUP(ROUND(VLOOKUP(A34,Importance!$A$10:$N$528, 14, FALSE),0),$J$2:$K$5,2,FALSE),0)","v":0},{"$f":"IFERROR(VLOOKUP(ROUND(VLOOKUP(A34,Importance!$A$10:$N$528, 11, FALSE),0),$J$2:$K$5,2,FALSE),0)","v":0},null,null,{"$f":"IF(VLOOKUP(A34,Configuration!$B$11:$C$30,2,FALSE)=0, \"Yes\", \"No\")","v":"No"},"","",""]
["A6",{"$f":"VLOOKUP(A35,Configuration!B10:C29, 2, FALSE)","v":0},{"$f":"IF(VLOOKUP(A35,Availability!$A$12:$C$31,3,FALSE)=\"Answer\", 0, VLOOKUP(A35,Availability!$A$12:$C$31,3,FALSE))","v":0},{"$f":"IFERROR(VLOOKUP(ROUND(VLOOKUP(A35,Importance!$A$10:$N$528, 14, FALSE),0),$J$2:$K$5,2,FALSE),0)","v":0},{"$f":"IFERROR(VLOOKUP(ROUND(VLOOKUP(A35,Importance!$A$10:$N$528, 11, FALSE),0),$J$2:$K$5,2,FALSE),0)","v":0},null,null,{"$f":"IF(VLOOKUP(A35,Configuration!$B$11:$C$30,2,FALSE)=0, \"Yes\", \"No\")","v":"Yes"},"","",""]
["A7",{"$f":"VLOOKUP(A36,Configuration!B11:C30, 2, FALSE)","v":0},{"$f":"IF(VLOOKUP(A36,Availability!$A$12:$C$31,3,FALSE)=\"Answer\", 0, VLOOKUP(A36,Availability!$A$12:$C$31,3,FALSE))","v":0},{"$f":"IFERROR(VLOOKUP(ROUND(VLOOKUP(A36,Importance!$A$10:$N$528, 14, FALSE),0),$J$2:$K$5,2,FALSE),0)","v":0},{"$f":"IFERROR(VLOOKUP(ROUND(VLOOKUP(A36,Importance!$A$10:$N$528, 11, FALSE),0),$J$2:$K$5,2,FALSE),0)","v":0},null,null,{"$f":"IF(VLOOKUP(A36,Configuration!$B$11:$C$30,2,FALSE)=0, \"Yes\", \"No\")","v":"Yes"},"","",""]
["A8",{"$f":"VLOOKUP(A37,Configuration!B12:C31, 2, FALSE)","v":0},{"$f":"IF(VLOOKUP(A37,Availability!$A$12:$C$31,3,FALSE)=\"Answer\", 0, VLOOKUP(A37,Availability!$A$12:$C$31,3,FALSE))","v":0},{"$f":"IFERROR(VLOOKUP(ROUND(VLOOKUP(A37,Importance!$A$10:$N$528, 14, FALSE),0),$J$2:$K$5,2,FALSE),0)","v":0},{"$f":"IFERROR(VLOOKUP(ROUND(VLOOKUP(A37,Importance!$A$10:$N$528, 11, FALSE),0),$J$2:$K$5,2,FALSE),0)","v":0},null,null,{"$f":"IF(VLOOKUP(A37,Configuration!$B$11:$C$30,2,FALSE)=0, \"Yes\", \"No\")","v":"Yes"},"","",""]
["A9",{"$f":"VLOOKUP(A38,Configuration!B13:C32, 2, FALSE)","v":0},{"$f":"IF(VLOOKUP(A38,Availability!$A$12:$C$31,3,FALSE)=\"Answer\", 0, VLOOKUP(A38,Availability!$A$12:$C$31,3,FALSE))","v":0},{"$f":"IFERROR(VLOOKUP(ROUND(VLOOKUP(A38,Importance!$A$10:$N$528, 14, FALSE),0),$J$2:$K$5,2,FALSE),0)","v":0},{"$f":"IFERROR(VLOOKUP(ROUND(VLOOKUP(A38,Importance!$A$10:$N$528, 11, FALSE),0),$J$2:$K$5,2,FALSE),0)","v":0},null,null,{"$f":"IF(VLOOKUP(A38,Configuration!$B$11:$C$30,2,FALSE)=0, \"Yes\", \"No\")","v":"Yes"},"","",""]
["A10",{"$f":"VLOOKUP(A39,Configuration!B14:C33, 2, FALSE)","v":0},{"$f":"IF(VLOOKUP(A39,Availability!$A$12:$C$31,3,FALSE)=\"Answer\", 0, VLOOKUP(A39,Availability!$A$12:$C$31,3,FALSE))","v":0},{"$f":"IFERROR(VLOOKUP(ROUND(VLOOKUP(A39,Importance!$A$10:$N$528, 14, FALSE),0),$J$2:$K$5,2,FALSE),0)","v":0},{"$f":"IFERROR(VLOOKUP(ROUND(VLOOKUP(A39,Importance!$A$10:$N$528, 11, FALSE),0),$J$2:$K$5,2,FALSE),0)","v":0},null,null,{"$f":"IF(VLOOKUP(A39,Configuration!$B$11:$C$30,2,FALSE)=0, \"Yes\", \"No\")","v":"Yes"},"","",""]
["A11",{"$f":"VLOOKUP(A40,Configuration!B15:C34, 2, FALSE)","v":0},{"$f":"IF(VLOOKUP(A40,Availability!$A$12:$C$31,3,FALSE)=\"Answer\", 0, VLOOKUP(A40,Availability!$A$12:$C$31,3,FALSE))","v":0},{"$f":"IFERROR(VLOOKUP(ROUND(VLOOKUP(A40,Importance!$A$10:$N$528, 14, FALSE),0),$J$2:$K$5,2,FALSE),0)","v":0},{"$f":"IFERROR(VLOOKUP(ROUND(VLOOKUP(A40,Importance!$A$10:$N$528, 11, FALSE),0),$J$2:$K$5,2,FALSE),0)","v":0},null,null,{"$f":"IF(VLOOKUP(A40,Configuration!$B$11:$C$30,2,FALSE)=0, \"Yes\", \"No\")","v":"Yes"},"","",""]
["A12",{"$f":"VLOOKUP(A41,Configuration!B16:C35, 2, FALSE)","v":0},{"$f":"IF(VLOOKUP(A41,Availability!$A$12:$C$31,3,FALSE)=\"Answer\", 0, VLOOKUP(A41,Availability!$A$12:$C$31,3,FALSE))","v":0},{"$f":"IFERROR(VLOOKUP(ROUND(VLOOKUP(A41,Importance!$A$10:$N$528, 14, FALSE),0),$J$2:$K$5,2,FALSE),0)","v":0},{"$f":"IFERROR(VLOOKUP(ROUND(VLOOKUP(A41,Importance!$A$10:$N$528, 11, FALSE),0),$J$2:$K$5,2,FALSE),0)","v":0},null,null,{"$f":"IF(VLOOKUP(A41,Configuration!$B$11:$C$30,2,FALSE)=0, \"Yes\", \"No\")","v":"Yes"},"","",""]
["A13",{"$f":"VLOOKUP(A42,Configuration!B17:C36, 2, FALSE)","v":0},{"$f":"IF(VLOOKUP(A42,Availability!$A$12:$C$31,3,FALSE)=\"Answer\", 0, VLOOKUP(A42,Availability!$A$12:$C$31,3,FALSE))","v":0},{"$f":"IFERROR(VLOOKUP(ROUND(VLOOKUP(A42,Importance!$A$10:$N$528, 14, FALSE),0),$J$2:$K$5,2,FALSE),0)","v":0},{"$f":"IFERROR(VLOOKUP(ROUND(VLOOKUP(A42,Importance!$A$10:$N$528, 11, FALSE),0),$J$2:$K$5,2,FALSE),0)","v":0},null,null,{"$f":"IF(VLOOKUP(A42,Configuration!$B$11:$C$30,2,FALSE)=0, \"Yes\", \"No\")","v":"Yes"},"","",""]
["A14",{"$f":"VLOOKUP(A43,Configuration!B18:C37, 2, FALSE)","v":0},{"$f":"IF(VLOOKUP(A43,Availability!$A$12:$C$31,3,FALSE)=\"Answer\", 0, VLOOKUP(A43,Availability!$A$12:$C$31,3,FALSE))","v":0},{"$f":"IFERROR(VLOOKUP(ROUND(VLOOKUP(A43,Importance!$A$10:$N$528, 14, FALSE),0),$J$2:$K$5,2,FALSE),0)","v":0},{"$f":"IFERROR(VLOOKUP(ROUND(VLOOKUP(A43,Importance!$A$10:$N$528, 11, FALSE),0),$J$2:$K$5,2,FALSE),0)","v":0},null,null,{"$f":"IF(VLOOKUP(A43,Configuration!$B$11:$C$30,2,FALSE)=0, \"Yes\", \"No\")","v":"Yes"},"","",""]
["A15",{"$f":"VLOOKUP(A44,Configuration!B19:C38, 2, FALSE)","v":0},{"$f":"IF(VLOOKUP(A44,Availability!$A$12:$C$31,3,FALSE)=\"Answer\", 0, VLOOKUP(A44,Availability!$A$12:$C$31,3,FALSE))","v":0},{"$f":"IFERROR(VLOOKUP(ROUND(VLOOKUP(A44,Importance!$A$10:$N$528, 14, FALSE),0),$J$2:$K$5,2,FALSE),0)","v":0},{"$f":"IFERROR(VLOOKUP(ROUND(VLOOKUP(A44,Importance!$A$10:$N$528, 11, FALSE),0),$J$2:$K$5,2,FALSE),0)","v":0},null,null,{"$f":"IF(VLOOKUP(A44,Configuration!$B$11:$C$30,2,FALSE)=0, \"Yes\", \"No\")","v":"Yes"},"","",""]
["A16",{"$f":"VLOOKUP(A45,Configuration!B20:C39, 2, FALSE)","v":0},{"$f":"IF(VLOOKUP(A45,Availability!$A$12:$C$31,3,FALSE)=\"Answer\", 0, VLOOKUP(A45,Availability!$A$12:$C$31,3,FALSE))","v":0},{"$f":"IFERROR(VLOOKUP(ROUND(VLOOKUP(A45,Importance!$A$10:$N$528, 14, FALSE),0),$J$2:$K$5,2,FALSE),0)","v":0},{"$f":"IFERROR(VLOOKUP(ROUND(VLOOKUP(A45,Importance!$A$10:$N$528, 11, FALSE),0),$J$2:$K$5,2,FALSE),0)","v":0},null,null,{"$f":"IF(VLOOKUP(A45,Configuration!$B$11:$C$30,2,FALSE)=0, \"Yes\", \"No\")","v":"Yes"},"","",""]
["A17",{"$f":"VLOOKUP(A46,Configuration!B21:C40, 2, FALSE)","v":0},{"$f":"IF(VLOOKUP(A46,Availability!$A$12:$C$31,3,FALSE)=\"Answer\", 0, VLOOKUP(A46,Availability!$A$12:$C$31,3,FALSE))","v":0},{"$f":"IFERROR(VLOOKUP(ROUND(VLOOKUP(A46,Importance!$A$10:$N$528, 14, FALSE),0),$J$2:$K$5,2,FALSE),0)","v":0},{"$f":"IFERROR(VLOOKUP(ROUND(VLOOKUP(A46,Importance!$A$10:$N$528, 11, FALSE),0),$J$2:$K$5,2,FALSE),0)","v":0},null,null,{"$f":"IF(VLOOKUP(A46,Configuration!$B$11:$C$30,2,FALSE)=0, \"Yes\", \"No\")","v":"Yes"},"","",""]
["A18",{"$f":"VLOOKUP(A47,Configuration!B22:C41, 2, FALSE)","v":0},{"$f":"IF(VLOOKUP(A47,Availability!$A$12:$C$31,3,FALSE)=\"Answer\", 0, VLOOKUP(A47,Availability!$A$12:$C$31,3,FALSE))","v":0},{"$f":"IFERROR(VLOOKUP(ROUND(VLOOKUP(A47,Importance!$A$10:$N$528, 14, FALSE),0),$J$2:$K$5,2,FALSE),0)","v":0},{"$f":"IFERROR(VLOOKUP(ROUND(VLOOKUP(A47,Importance!$A$10:$N$528, 11, FALSE),0),$J$2:$K$5,2,FALSE),0)","v":0},null,null,{"$f":"IF(VLOOKUP(A47,Configuration!$B$11:$C$30,2,FALSE)=0, \"Yes\", \"No\")","v":"Yes"},"","",""]
["A19",{"$f":"VLOOKUP(A48,Configuration!B23:C42, 2, FALSE)","v":0},{"$f":"IF(VLOOKUP(A48,Availability!$A$12:$C$31,3,FALSE)=\"Answer\", 0, VLOOKUP(A48,Availability!$A$12:$C$31,3,FALSE))","v":0},{"$f":"IFERROR(VLOOKUP(ROUND(VLOOKUP(A48,Importance!$A$10:$N$528, 14, FALSE),0),$J$2:$K$5,2,FALSE),0)","v":0},{"$f":"IFERROR(VLOOKUP(ROUND(VLOOKUP(A48,Importance!$A$10:$N$528, 11, FALSE),0),$J$2:$K$5,2,FALSE),0)","v":0},null,null,{"$f":"IF(VLOOKUP(A48,Configuration!$B$11:$C$30,2,FALSE)=0, \"Yes\", \"No\")","v":"Yes"},"","",""]
["A20",{"$f":"VLOOKUP(A49,Configuration!B24:C43, 2, FALSE)","v":0},{"$f":"IF(VLOOKUP(A49,Availability!$A$12:$C$31,3,FALSE)=\"Answer\", 0, VLOOKUP(A49,Availability!$A$12:$C$31,3,FALSE))","v":0},{"$f":"IFERROR(VLOOKUP(ROUND(VLOOKUP(A49,Importance!$A$10:$N$528, 14, FALSE),0),$J$2:$K$5,2,FALSE),0)","v":0},{"$f":"IFERROR(VLOOKUP(ROUND(VLOOKUP(A49,Importance!$A$10:$N$528, 11, FALSE),0),$J$2:$K$5,2,FALSE),0)","v":0},null,null,{"$f":"IF(VLOOKUP(A49,Configuration!$B$11:$C$30,2,FALSE)=0, \"Yes\", \"No\")","v":"Yes"},"","",""]
[null,null,null,null,null,null,null,null,"","",""]
["lookupVal",{"$f":"\"Business Area: \"&BAFill","v":"Business Area: Pavement Management"},"Availability","Quality","Usability"]
["A1","Conservative (limiting activity)",{"$f":"IF($H$52<>H$53,\"\",IF(COUNTIF(C30:C49,\"=Poor\")>0, \"Poor\", IF(COUNTIF(C30:C49,\"=Fair\")>0, \"Fair\", IF(COUNTIF(C30:C49,\"=Good\")>0, \"Good\", IF(COUNTIF(C30:C49,\"=Excellent\")>0, \"Excellent\", \"\")))))","v":""},{"$f":"IF($H$52<>I$53,\"\",IF(COUNTIF(D30:D49,\"=Poor\")>0, \"Poor\", IF(COUNTIF(D30:D49,\"=Fair\")>0, \"Fair\", IF(COUNTIF(D30:D49,\"=Good\")>0, \"Good\", IF(COUNTIF(D30:D49,\"=Excellent\")>0, \"Excellent\", \"\")))))","v":""},"",null,null,{"$f":"COUNTIF(H30:H49,\"=No\")","v":5}]
["A2","Optimistic (average of activities)",{"$f":"IFERROR(IF($H$52<>H$53,\"\",VLOOKUP(ROUND(AVERAGE(I30:I49),0),$J$2:$K$5,2,FALSE)), \"\")","v":""},{"$f":"IFERROR(IF($H$52<>I$53,\"\",VLOOKUP(ROUND(AVERAGE(J30:J49),0),$J$2:$K$5,2,FALSE)),\"\")","v":""},{"$f":"IFERROR(IF($H$52<>J$53,\"\",VLOOKUP(ROUND(AVERAGE(K30:K49),0),$J$2:$K$5,2,FALSE)),\"\")","v":""},null,null,{"$f":"COUNTIF(C30:C49,\"*\")","v":0},{"$f":"COUNTIF(D30:D49,\"*\")","v":0},{"$f":"COUNTIF(E30:E49,\"*\")","v":0}]
[null,null,{"$f":"VLOOKUP(C52,$K$2:$L$5,2,FALSE)","v":{"$error":"#N/A"}},{"$f":"VLOOKUP(D52,$K$2:$L$5,2,FALSE)","v":{"$error":"#N/A"}},{"$error":"#N/A"}]
[null,null,{"$f":"VLOOKUP(C53,$K$2:$L$5,2,FALSE)","v":{"$error":"#N/A"}},{"$error":"#N/A"},{"$error":"#N/A"}]
[null,null,1,1,1,1,1]
[]
[]
[]
[]
[]
[]
[]
[]
[]
[]
[]
[]
[]
[]
[]
[null,"Progress"]
[null,"Importance",{"$f":"Importance!H4","v":0}]
[null,"Availability",{"$f":"Availability!F4","v":0}]
[null,"Quality",{"$f":"Quality!I4","v":0}]
[null,"Usability",{"$f":"Usability!G4","v":0}]