{"text_format":"1","workbook":"xlsx","n_sheets":8,"sheets":["ATC Toolkit Input","ATC Toolkit Instructions","Tool 1. ATC Project Selection","Tool 2. ATC Implementation","Table 2.1 - WBS","Tool 3. ATC Evaluation","Tool 4. ATC Perform. Assessment","Table 4.1 - ATC Inventory"],"not_rendered":{"charts":0,"images":14,"macros":1,"external_links":0,"defined_names":144,"comments":0,"pivot_tables":0},"unopened":[],"bounds":{"document_bytes":16777216,"sheet_cells":100000,"rows_first":2000,"rows_last":500,"rows_between":2000,"halvings":0,"cell_chars":16384,"cell_head_chars":4096},"cells_cut":0,"cells_raw":0,"read":"part_too_large","date_system":"1900"}

{"sheet":"ATC Toolkit Input","index":0,"n_rows":219,"n_cols":9,"rows_kept":219,"cut":false,"hidden":true,"merged":[[1,1,1,7],[3,1,3,7],[11,1,11,7],[13,2,13,6],[191,2,191,7],[57,2,59,2],[61,2,65,2],[36,2,44,2],[18,2,18,6],[46,2,53,2],[106,2,109,2],[99,2,104,2],[84,2,89,2],[73,2,82,2],[167,2,167,7],[207,1,207,7],[116,2,121,2],[123,2,127,2],[134,2,138,2],[140,2,145,2],[149,2,149,7]]}
[]
[null,"ATC Toolkit Input"]
[]
[null,"Tool 1. ATC Project Selection"]
[]
[null,null,"Checklist Options ",null,"No",null,"Yes",null,"Risk Register"]
[null,null,"-",null,"-",null,"-",null,"-"]
[null,null,"Yes",null,"N/A",null,"Yes",null,"Yes"]
[null,null,"No",null,null,null,"No",null,"No "]
[null,null,null,null,null,null,null,null,"N/A"]
[]
[null,"Tool 2. ATC Implementation"]
[]
[null,2.1,"ATC Receipt and Evaluation Process"]
[]
[null,null,"Figure 2.1 Generic ATC Receipt and Evaluation Process"]
[]
[]
[null,2.2000000000000002,"Contracting Method Considerations "]
[]
[null,null,"Contracting Method",null,"Applicable/Not Applicable",null,"Not Applicable"]
[null,null,"-",null,"-",null,"N/A"]
[null,null,"Design-Bid-Build (DBB)",null,"Applicable"]
[null,null,"Design-Build (DB)",null,"Not Applicable"]
[null,null,"Progressive Design-Build (PDB)"]
[null,null,"Construction Manager/General Contractor (CMGC)"]
[null,null,"Public Private Partnership (P3)"]
[]
[]
[]
{"$rows_left_out":190}
{"sheet":"ATC Toolkit Instructions","index":1,"n_rows":114,"n_cols":3,"rows_kept":114,"cut":false,"hidden":false,"merged":[[1,1,1,7],[3,2,3,7],[6,2,6,7],[5,1,5,7],[40,2,40,5],[7,2,7,7],[8,2,8,7],[9,2,9,7],[31,2,31,7],[46,2,46,7],[11,1,11,7],[12,1,14,6],[15,1,15,6],[17,2,17,7],[19,1,19,7],[33,1,33,7],[20,2,20,7],[21,2,21,7],[22,2,22,7],[24,2,24,7],[26,1,26,7],[27,2,27,7],[28,2,28,7],[29,2,29,7],[30,2,30,7],[41,2,41,4],[42,2,42,4],[34,2,34,5],[44,1,44,7],[38,2,38,4],[39,2,39,4],[35,2,35,4],[36,2,36,4],[37,2,37,4],[55,1,55,7],[59,1,59,7],[57,2,57,7],[61,2,61,5],[48,1,48,7],[49,2,49,7],[50,2,50,7],[51,2,51,7],[52,2,52,7],[53,2,53,7],[62,2,62,5],[63,2,63,5],[64,2,64,5],[66,1,66,7],[68,2,68,7],[96,2,96,7],[98,2,110,6],[113,1,113,7],[111,2,111,6],[70,1,70,7],[71,2,71,7],[72,2,72,7],[73,2,73,7],[75,2,89,6],[90,2,90,6],[92,1,92,7],[94,2,94,7],[95,2,95,7]]}
[]
[null,"ATC Toolkit Instructions"]
[]
[null,0.1,"Instructions "]
[]
[null,"This spreadsheet is a toolkit that includes four tools designed to cover the life cycle of the ATC process from making the decision as to whether ATCs are appropriate for a given project to assessing the performance of approved ATCs after construction is complete and producing feedback based on lessons learned. The four tools are as follows:"]
[null,"• ","Tool #1: ATC Project Selection "]
[null,"• ","Tool #2: ATC Implementation"]
[null,"• ","Tool #3: ATC Evaluation"]
[null,"• ","Tool #4: ATC Performance Assessment"]
[]
[null,"The toolkit spreadsheet is designed to stand alone with detailed explanations contained in the introductory section of each tool in the spreadsheet. The spreadsheet is also designed to be tailored to the specifics of each agency’s unique process and within the context of its constraints. For example, ATC Tool #2 requires the agency to develop a set of design work packages for the project under analysis. Most agencies have a standard set of disciplinary design packages within their project development and design documentation. So, the set of design packages currently shown in the tool is a placeholder and meant to be replaced by the agency as appropriate.\n\nTools #1 through #3 lead to a recommendation and are meant to inform the ATC decision process NOT to provide the decision itself. At each step in the process, the agency project team will use the tool first as a checklist to make sure that all the necessary factors have been considered and included in the process and secondly, as a structured method to inform the dialog necessary to make the decision required at each step in the process. Hence, Tool #3 will produce a recommendation regarding whether to approve the ATC as submitted, approve with conditions, or reject. The agency team must not regard that output as definitive but merely indicative assisting the team to make its final decision outside the tool.\n\nLastly, a word of caution. The semantics of the project development and delivery process are not standard across the nation with common terms like “preliminary engineering” including different activities from state to state. To surmount this issue, the toolkit adopted a previous research projects generic model for the project development and delivery process shown in  the figure below that is based on the tasks that are completed at each stage in the process. An agency can overlay its own process with its own terminology on that shown in the figure to provide an accurate reference timeline when using the toolkit.\n"]
[]
[]
[]
[null,"Figure 0.1 Generic Project Development and Delivery Phases"]
[]
[null,0.2,"ATC Tool #1 ATC Project Selection"]
[]
[null,"The first tool in the toolkit seeks to determine if a given project is well-suited for the employment of ATCs. It consists of a checklist of factors that could potentially be addressed by ATCs. It is meant to be used in conjunction with the project’s risk register, if there is one, and essentially lays out the major risks and opportunities faced by many typical projects. Tool #1 operates on the following underlying assumptions. "]
[null,"• ","The project should have sufficient flexibility in its technical content and administrative arrangements to permit viable ATC options to be generated by industry during procurement. If there is no apparent flexibility, then the tool will not recommend ATC usage. "]
[null,"• ","Since different proposers will possess differing preferred means and methods that the ATC process can capture potential benefits due to allowing each competitor to tailor their proposal to their preferred approach. "]
[null,"• ","The agency’s must have the internal capacity to support the ATC process in a timely manner given the project’s procurement timeline. If the agency is not able to furnish the necessary resources to allow the timely review and approval of ATCs, the tool will again recommend against ATC usage."]
[]
[null,0.3,"ATC Tool #2 ATC Implementation"]
[]
[null,"The second tool in the toolkit seeks to assist the agency team in making a comprehensive analysis of the factors that require consideration within the specific ACM chosen for project delivery. It can also be used as a tool to compare more than one ACM’s suitability for ATC usage. The tool requires the agency select one of five ACMs:"]
[null,1,"Design-Bid-Build (DBB)"]
[null,2,"Design-Build (DB)"]
[null,3,"Progressive Design-Build (PDB)"]
{"$rows_left_out":85}
{"sheet":"Tool 1. ATC Project Selection","index":2,"n_rows":54,"n_cols":8,"rows_kept":54,"cut":false,"hidden":false,"merged":[[35,3,35,5],[25,3,25,5],[27,3,27,5],[29,3,29,5],[31,3,31,5],[33,3,33,5],[48,2,50,5],[48,7,49,7],[53,3,54,5],[37,3,37,5],[39,3,39,5],[41,3,41,5],[43,3,43,5],[45,2,46,5],[45,7,46,7],[52,3,52,5],[1,1,1,7],[3,2,3,7],[5,2,5,7],[16,2,16,7],[23,2,23,5],[21,2,21,5],[18,3,18,5],[6,2,6,7],[8,2,9,7],[11,2,14,7]]}
[]
[null,"Tool 1. ATC Project Selection"]
[]
[null,1.1000000000000001,"General Recommendations"]
[]
[null,"• ","The ATC Project Selection Checklist presented in this tool should be completed by a panel formed by planners, designers, and construction personnel."]
[null,"• ","The decision to include ATCs should be made as early as possible in the design process to ensure the agency will be comfortable with potential changes. Ideally, it would be made before the project’s environmental clearance and other state-level permits are completed to minimize the chances that the technical commitments made during the environmental review and permitting process do not reduce potential ATC benefits or stifle them altogether."]
[]
[null,"• ","Note: The semantics of project development and delivery process is not standard across the nation. Therefore, the following model will be used to describe the various tasks that are typically completed."]
[]
[]
[]
[]
[]
[]
[]
[null,1.2,"ATC Project Selection Checklist "]
[]
[null,null,null,"Note: \nAll orange boxes in this ATC Tool contain drop-down menus. Please select the appropriate choice from each drop-down menu. Check Yes or No in every box."]
[]
[]
[null,"1.2.1","Does the ATC Project Selection Panel foresee risk events in the project's Risk Register that could potentially be mitigated/overcome by ATCs proposed by competing contractors?",null,null,null,null,"-"]
[]
[null,"1.2.2","Does the ATC Project Selection Panel foresee major project specific risks or challenges on the areas listed below that could potentially mitigated/overcome by ATCs proposed by competing contractors?"]
[]
[null,null,"1.2.2.1","Project Scope",null,null,null,"-"]
[]
[null,null,"1.2.2.2","Life-Cycle Cost",null,null,null,"-"]
[]
[null,null,"1.2.2.3","Project Schedule",null,null,null,"-"]
{"$rows_left_out":25}
{"sheet":"Tool 2. ATC Implementation","index":3,"n_rows":377,"n_cols":8,"rows_kept":377,"cut":false,"hidden":false,"merged":[[359,2,359,7],[368,2,368,4],[369,2,369,4],[370,2,370,4],[371,2,371,4],[372,2,372,4],[373,2,373,4],[374,2,374,4],[110,1,110,7],[116,2,123,5],[124,2,131,5],[152,1,152,7],[158,2,162,5],[163,2,168,5],[183,2,185,5],[186,2,195,5],[186,7,187,7],[124,7,125,7],[132,7,133,7],[138,7,139,7],[112,2,115,5],[154,7,155,7],[158,7,159,7],[163,7,164,7],[375,2,375,4],[376,2,376,4],[368,5,368,6],[369,5,369,6],[370,5,370,6],[371,5,371,6],[372,5,372,6],[373,5,373,6],[374,5,374,6],[375,5,375,6],[376,5,376,6],[348,2,352,5],[353,2,357,5],[348,7,349,7],[353,7,354,7],[330,1,330,7],[332,2,340,5],[84,2,87,5],[54,1,54,7],[67,2,75,5],[91,1,91,8],[97,2,103,5],[172,2,177,5],[178,2,181,5],[172,7,173,7],[178,7,179,7],[305,2,307,7],[308,3,310,7],[301,3,304,7],[312,3,312,5],[320,3,323,5],[341,2,346,5],[332,7,333,7],[341,7,342,7],[314,3,315,7],[316,3,318,5],[325,3,327,5],[316,7,317,7],[320,7,321,7],[45,2,46,4],[45,5,46,7],[48,1,48,7],[89,2,89,7],[49,1,49,7],[77,2,79,5],[80,2,83,5],[84,7,85,7],[77,7,78,7],[80,7,81,7],[108,2,108,7],[293,2,293,7],[295,2,296,7],[298,3,300,7],[143,7,144,7],[143,2,148,5],[150,2,150,7],[170,2,170,7],[93,7,94,7],[93,2,96,5],[1,1,1,7],[3,2,3,7],[41,2,41,7],[5,2,5,16383],[6,2,38,7],[39,2,39,7],[56,2,65,5],[56,7,57,7],[67,7,68,7],[43,3,43,5],[51,2,52,5],[51,7,52,7],[132,2,137,5],[138,2,142,5],[242,2,242,7],[154,2,157,5],[104,2,107,5],[97,7,98,7],[104,7,105,7],[196,2,196,7],[211,2,212,7],[183,7,184,7],[203,7,204,7],[112,7,113,7],[116,7,117,7],[280,2,282,5],[284,2,292,5],[238,3,240,5],[238,7,239,7],[214,3,217,5],[219,3,222,5],[223,3,227,5],[228,3,232,5],[233,3,237,5],[214,7,215,7],[219,7,220,7],[223,7,224,7],[228,7,229,7],[233,7,234,7],[361,2,367,7],[198,1,198,7],[200,2,202,5],[200,7,201,7],[203,2,209,5],[244,1,244,7],[266,2,268,5],[246,7,247,7],[252,7,253,7],[257,7,258,7],[263,7,264,7],[266,7,267,7],[269,7,270,7],[274,7,275,7],[277,7,278,7],[280,7,281,7],[284,7,285,7],[246,2,250,5],[252,2,256,5],[257,2,262,5],[263,2,265,5],[269,2,272,5],[274,2,276,5],[277,2,278,5]]}
[]
[null,"Tool 2. ATC Implementation"]
[]
[null,2.1,"ATC Generic Submission and Evaluation Process "]
[]
[null,"•","Figure 2.1 is a generic representation of the process implemented by state transportation agencies for the receipt and evaluation of ATCs. Before beginning, review the flow chart and compare it to the current agency process that matches the constraints of their enabling statutes and regulations regarding ATCs.  Next, compare it to the current project's unique requirements and characteristics and determine if a variation, such as dropping the CATC component, is in order."]
[]
[]
[]
[]
[]
[]
[]
[]
[]
[]
[]
[]
[]
[]
[]
[]
[]
[]
[]
[]
[]
[]
[]
[]
{"$rows_left_out":348}
{"sheet":"Table 2.1 - WBS","index":4,"n_rows":32,"n_cols":15,"rows_kept":32,"cut":false,"hidden":false,"merged":[[31,1,32,9],[29,1,29,4],[30,1,30,4],[27,1,27,4],[28,1,28,4],[1,0,2,9],[8,1,8,9],[10,1,10,9],[12,1,12,9],[14,1,14,9],[5,1,5,9],[6,1,6,9],[16,1,16,9],[23,1,23,4],[24,1,24,4],[25,1,25,4],[26,1,26,4],[18,1,18,4],[19,1,19,4],[20,1,20,4],[21,1,21,4],[22,1,22,4]]}
[]
["Table 2.1 Work Breakdown Structure"]
[]
[]
[null,"Note:"]
[null,"The below WBS is meant to be generic. A work package is defined as a major component of the project's scope of work from development through delivery."]
[null,"The agency can replace the generic WBS with their own. However, a word of caution to not overcomplicate the WBS is offered as this is meant as a high-level planning tool rather than the detailed approach used for working-level design and construction WBSs."]
[]
[null,"• Please fill out columns A, B1, B2, and C based on the following instructions:"]
[]
[null,"Column A: Identify those work packages that are dependent on means and methods assumptions."]
[]
[null,"Column B1: Identify design packages closely related to key project objectives and to major anticipated risk factors."]
[]
[null,"Column B2: Identify those work packages selected in Column B1 that could be improved through ATCs facilitating the accomplishment of project objectives and mitigating overall project risk."]
[]
[null,"Column C: Identify the work packages associated to major design features and/or construction elements/activities. "]
[]
[null,"Work Package",null,null,null,"A","B1","B2","C","ATC Potential"]
[null,"Context – Economical / business / abutting properties ",null,null,null,null,null,null,null,{"$f":"IF(O20=TRUE,IF(OR(AND(M20=TRUE,N20=TRUE),L20=TRUE),\"Major Package with ATC Potential\",\"---------\"),IF(OR(AND(M20=TRUE,N20=TRUE),L20=TRUE),\"Package with ATC Potential\",\"---------\"))","v":"---------"},null,false,false,false,false]
[null,"Planning – meeting project goals / identified purpose and need ",null,null,null,null,null,null,null,{"$f":"IF(O21=TRUE,IF(OR(AND(M21=TRUE,N21=TRUE),L21=TRUE),\"Major Package with ATC Potential\",\"---------\"),IF(OR(AND(M21=TRUE,N21=TRUE),L21=TRUE),\"Package with ATC Potential\",\"---------\"))","v":"---------"},null,false,false,false,false]
[null,"Local Agency / Stakeholder (State Aid) – local / stakeholder interests & needs as defined with community engagement & outreach ",null,null,null,null,null,null,null,"---------",null,false,false,false,false]
[null,"Right of Way / Land Management (acquisitions, temporary construction easements, permanent easements, public land leasing / agreements) ",null,null,null,null,null,null,null,"---------",null,false,false,false,false]
[null,"Environmental / Natural Resources   ",null,null,null,null,null,null,null,"---------",null,false,false,false,false]
[null,"Design – Bridge assets, those structures that are defined as ‘bridge assets’ ",null,null,null,null,null,null,null,"---------",null,false,false,false,false]
[null,"Design – mobility / Other assets (roadway geometrics, assets within the right of way)",null,null,null,null,null,null,null,"---------",null,false,false,false,false]
[null,"Design – Drainage / Hydraulics (Stormwater management, NPDES, drainage assets, etc.) ",null,null,null,null,null,null,null,"---------",null,false,false,false,false]
[null,"Design – Traffic (maintenance & protection of traffic, signage, striping, lighting, signals, etc.) ",null,null,null,null,null,null,null,"---------",null,false,false,false,false]
[null,"Utilities – existing, relocation, future (prior rights, agreements, negotiations) ",null,null,null,null,null,null,null,"---------",null,false,false,false,false]
[null,"Construction (constructability, staging, sequencing, phasing) ",null,null,null,null,null,null,null,"---------",null,false,false,false,false]
{"$rows_left_out":3}
{"sheet":"Tool 3. ATC Evaluation","index":5,"n_rows":256,"n_cols":19,"rows_kept":256,"cut":false,"hidden":false,"merged":[[255,2,255,6],[250,2,250,6],[251,2,251,6],[252,2,252,6],[253,2,253,6],[254,2,254,6],[245,2,245,6],[246,2,246,6],[247,2,247,6],[248,2,248,6],[249,2,249,6],[240,2,240,6],[241,2,241,6],[242,2,242,6],[243,2,243,6],[244,2,244,6],[236,2,236,6],[235,2,235,6],[237,2,237,6],[238,2,238,6],[239,2,239,6],[213,4,213,5],[214,4,214,5],[101,2,102,7],[177,2,178,7],[173,2,174,7],[169,2,170,7],[140,2,140,7],[128,2,128,7],[132,2,132,7],[137,2,138,7],[133,2,134,7],[176,2,176,7],[168,2,168,7],[172,2,172,7],[149,2,150,7],[145,2,146,7],[141,2,142,7],[164,2,164,7],[156,2,156,7],[153,2,154,7],[85,4,85,7],[85,2,86,2],[88,4,88,5],[89,4,89,5],[87,6,87,7],[88,6,88,7],[89,6,89,7],[220,4,220,5],[160,2,160,7],[165,2,166,7],[161,2,162,7],[157,2,158,7],[125,2,126,7],[121,2,122,7],[117,2,118,7],[136,2,136,7],[182,2,186,7],[148,2,148,7],[152,2,152,7],[144,2,144,7],[215,4,215,5],[210,4,210,5],[211,4,211,5],[212,4,212,5],[234,2,234,6],[230,4,230,5],[231,4,231,5],[225,4,225,5],[226,4,226,5],[227,4,227,5],[228,4,228,5],[229,4,229,5],[216,4,216,5],[217,4,217,5],[218,4,218,5],[219,4,219,5],[232,2,233,6],[222,4,222,5],[223,4,223,5],[224,4,224,5],[221,4,221,5],[64,5,64,8],[65,5,65,8],[66,5,66,8],[67,5,67,8],[83,2,83,7],[180,2,180,7],[48,2,48,7],[86,4,86,5],[86,6,86,7],[87,4,87,5],[91,2,98,7],[100,2,100,7],[50,2,53,7],[55,2,55,6],[112,2,112,7],[104,2,104,7],[108,2,108,7],[109,2,110,7],[113,2,114,7],[105,2,106,7],[124,2,124,7],[116,2,116,7],[120,2,120,7],[129,2,130,7],[32,6,34,7],[5,2,6,8],[68,5,68,8],[69,5,69,8],[70,5,70,8],[80,5,80,8],[81,5,81,8],[1,1,1,7],[3,2,3,7],[18,1,18,7],[20,2,20,7],[22,2,24,8],[26,6,31,7],[71,5,71,8],[72,5,72,8],[73,5,73,8],[74,5,74,8],[75,5,75,8],[76,5,76,8],[77,5,77,8],[78,5,78,8],[79,5,79,8],[62,5,62,8],[63,5,63,8]]}
[]
[null,"Tool 3. ATC Evaluation"]
[]
[null,3.1,"ATC Evaluation Process Introduction "]
[]
[null,"•","The process presented in this tool is intended to improve the objectivity of ATC evaluation procedures by standardizing ATCs “equal to or better than” analyses. The process is a decision-making method that facilitates trade-offs among multiple evaluation attributes according to weights previously determined by the ATC Evaluation Panel for all attributes. The ATC evaluation process is performed in four steps, as illustrated in Figure 3.1."]
[]
[]
[]
[]
[]
[]
[]
[]
[]
[]
[]
[]
[null,"3.1 ATC Evaluation Process"]
[]
[null,3.2,"Step 1. Define ATC Evaluation Attributes "]
[]
[null,"•","Select the set of evaluation attributes that best represent the goals of the ATC project under consideration. Submitted ATCs will be evaluated on their potential to improve the baseline design on the selected attributes."]
[]
[]
[]
[null,null,"Evaluation Attribute","Select","No Conditions Allowed",null,"Note: \nBefore evaluating a new ATC or a new selection of evaluation attributes, clear all fields in this ATC Tool by clicking on the following button ",null,null,"Helper1","Helper2","Helper3"]
[null,false,"Lifecycle Cost",null,null,false,null,null,null,1,{"$f":"IF(B28=TRUE,J28,\"\")","v":""},{"$f":"IF(J28<=$K$48,SMALL($K$28:$K$47,J28),\"\")","v":""}]
[null,false,"Road User Costs (during construction)",null,null,false,null,null,null,2,{"$f":"IF(B29=TRUE,J29,\"\")","v":""},{"$f":"IF(J29<=$K$48,SMALL($K$28:$K$47,J29),\"\")","v":""}]
[null,false,"Constructability",null,null,false,null,null,null,3,"",""]
{"$rows_left_out":227}
{"sheet":"Tool 4. ATC Perform. Assessment","index":6,"n_rows":68,"n_cols":9,"rows_kept":68,"cut":false,"hidden":false,"merged":[[66,7,66,8],[67,7,67,8],[64,5,64,6],[65,5,65,6],[66,5,66,6],[67,5,67,6],[64,7,64,8],[65,7,65,8],[62,7,62,8],[63,7,63,8],[54,7,54,8],[55,7,55,8],[56,7,56,8],[57,7,57,8],[58,7,58,8],[58,5,58,6],[59,5,59,6],[60,5,60,6],[61,5,61,6],[59,7,59,8],[60,7,60,8],[61,7,61,8],[58,3,58,4],[59,3,59,4],[60,3,60,4],[61,3,61,4],[62,3,62,4],[43,2,43,5],[43,6,43,9],[55,3,55,4],[56,3,56,4],[57,3,57,4],[54,3,54,4],[54,5,54,6],[55,5,55,6],[56,5,56,6],[49,2,49,3],[52,2,52,7],[45,6,45,7],[47,2,47,3],[47,6,47,7],[57,5,57,6],[3,2,3,7],[1,0,1,10],[7,2,7,5],[5,2,6,9],[19,2,19,7],[9,2,9,9],[11,2,11,5],[13,2,13,5],[15,2,15,5],[17,2,17,5],[66,3,66,4],[67,3,67,4],[21,2,21,5],[21,6,21,9],[25,2,25,3],[23,6,23,7],[25,6,25,7],[30,2,30,7],[32,2,32,5],[32,6,32,9],[34,6,34,7],[27,2,27,3],[36,2,36,3],[36,6,36,7],[38,2,38,3],[41,2,41,7],[62,5,62,6],[63,5,63,6],[63,3,63,4],[64,3,64,4],[65,3,65,4]]}
[]
["Tool 4. ATC Performance Assessment"]
[]
[null,4.0999999999999996,"Introduction to ATC Performance Indicators Tool"]
[]
[null,"•","The ATC Performance Indicators and Lessons Learned presented in this tool are extracted from Table 4.1 ATC Inventory."]
[]
[null,null,"Click here to see Table 4.1 ATC Inventory."]
[]
[null,"•","This tool is divided into four section as follows:"]
[]
[null,null,"4.2 ATC Cost Performance"]
[]
[null,null,"4.3 Stipend Performance"]
[]
[null,null,"4.4 ATC Schedule Performance"]
[]
[null,null,"4.5 Project ATC Lessons Learned "]
[]
[null,4.2,"ATC Cost Performance"]
[]
[null,null,"Project Level",null,null,null,"Agency Level"]
[]
[null,null,"• Project ID","-",null,null,"• Apparent Agency Savings ($M)",null,{"$f":"CONCATENATE(\"$\",'Table 4.1 - ATC Inventory'!Q33,\" M\")","v":"$11 M"}]
[]
[null,null,"• Apparent Project Savings ($M)",null,{"$f":"IF(D24=\"-\",\"-\",CONCATENATE(\"$\",VLOOKUP('Tool 4. ATC Perform. Assessment'!D24,'Table 4.1 - ATC Inventory'!$B$10:$J$33,8,FALSE)-VLOOKUP('Tool 4. ATC Perform. Assessment'!D24,'Table 4.1 - ATC Inventory'!$B$10:$J$33,9,FALSE),\" M\"))","v":"-"},null,"• Apparent Agency Savings (%)",null,{"$f":"'Table 4.1 - ATC Inventory'!Q33/'Table 4.1 - ATC Inventory'!O33","v":4.5267489711934158E-2}]
[]
[null,null,"• Apparent Project Savings (%)",null,{"$f":"IF(D24=\"-\",\"-\",(VLOOKUP('Tool 4. ATC Perform. Assessment'!D24,'Table 4.1 - ATC Inventory'!$B$10:$J$33,8,FALSE)-VLOOKUP('Tool 4. ATC Perform. Assessment'!D24,'Table 4.1 - ATC Inventory'!$B$10:$J$33,9,FALSE))/VLOOKUP('Tool 4. ATC Perform. Assessment'!D24,'Table 4.1 - ATC Inventory'!$B$10:$J$33,8,FALSE))","v":"-"}]
[]
[]
{"$rows_left_out":39}
{"sheet":"Table 4.1 - ATC Inventory","index":7,"n_rows":0,"n_cols":0,"rows_kept":0,"cut":false,"hidden":false,"merged":[],"read":"part_too_large"}