{"text_format":"1","workbook":"xlsx","n_sheets":7,"sheets":["ReadMe","Project Location","Tributary Area","BMP Design","Results Summary Report","Graph Parameters","Rain Gage Summary"],"not_rendered":{"charts":1,"images":3,"macros":1,"external_links":3,"defined_names":37,"comments":0,"pivot_tables":2},"unopened":[],"bounds":{"document_bytes":16777216,"sheet_cells":100000,"rows_first":2000,"rows_last":500,"rows_between":2000,"halvings":0,"cell_chars":16384,"cell_head_chars":4096},"cells_cut":0,"cells_raw":0,"read":"whole","date_system":"1900"}

{"sheet":"ReadMe","index":0,"n_rows":13,"n_cols":2,"rows_kept":13,"cut":false,"hidden":false,"merged":[[25,1,25,5],[25,6,25,11],[8,1,8,11],[9,1,9,11],[19,1,19,5],[19,6,19,11],[2,1,2,11],[10,1,10,11],[11,1,11,11],[12,1,12,11],[18,1,18,5],[18,6,18,11],[3,1,3,11],[4,1,4,11],[5,1,5,11],[6,1,6,11],[7,1,7,11],[26,1,26,5],[26,6,26,11],[27,1,27,5],[27,6,27,11],[28,1,28,5],[28,6,28,11]]}
["NCHRP 25-51 Roadside BMP Clogging Risk Assessment Tool"]
["Readme Notes"]
[1,"Please read the User's Guide before using the Tool."]
[2,"Tool inputs are intended to be populated sequentially (i.e., Project Location, Tributary Area, then BMP Design). Inputs on previous tabs can later be modified by skipping backward and forward, however skipping forward as part of the initial tool parameterization will potentially introduce errors."]
[3,"The tool is navigated using the tabs at the bottom of the workbook. "]
[4,"The user is responsible for ensuring that input parameters are reasonable. It is possible to enter inputs that are outside of acceptable ranges. Valid ranges are provided in cell descriptions. Negative numbers are never reasonable for populating the Tool and will not return valid results. "]
[5,"The user should review all provided descriptions and ensure that default values are applicable to the project site."]
[6,"Where dropdown boxes are available for input parameters, values must be selected from the dropdown menu. The Tool cannot accept custom inputs for these fields. "]
[7,"The Tool requires macros to be enabled. If macros are not enabled, the Tool will not function."]
[8,"The Tool is intended to be operated with Excel set to \"Auto Calculate\" mode; not \"Manual Calculate\" mode. To change this setting, go to the \"Formulas\" ribbon and select \"Calculation Options\"."]
[9,"Any changes to the structure of this workbook (tab names, inserting or deleting columns or rows, etc.) will render the Tool non-functional. Several precautions were taken to prevent this kind of action, but it is ultimately the user's responsibility to maintain a functional workbook. The user may create new worksheets for the purpose of calculations and notes, but any other structural changes must be avoided. "]
[10,"The workbook is saved as a Template file (.xltm). Opening the file by double-clicking will create a new macro-enabled workbook (.xlsm) that can be saved by the user without the risk of over-writing the template. If the user would like to edit the template, first open Excel and then navigate to the .xltm file."]
[11,"Many cells and sheets in this workbook are protected. To unprotect/protect a sheet, go to \"Review\" or \"File\" and click the appropriate selection. The password is \"NCHRP\". It is the user's responsibility to maintain a functional workbook."]

{"sheet":"Project Location","index":1,"n_rows":51,"n_cols":29,"rows_kept":51,"cut":false,"hidden":false,"merged":[[22,14,25,15],[0,14,0,15],[18,14,18,15],[7,14,7,15],[9,2,9,8],[10,2,10,8],[7,0,7,11]]}
[{"$f":"ReadMe!A1","v":"NCHRP 25-51 Roadside BMP Clogging Risk Assessment Tool"},null,null,null,null,null,null,null,null,null,null,null,null,null,"Key",null,null,null,null,null,null,null,null,"Section","State",null,{"$f":"VLOOKUP(C11,Y2:Z51,2,FALSE)","v":{"$error":"#N/A"}},"Section",4]
["Project Title",null,"Example Run",null,null,null,null,null,null,null,null,null,null,null,"User Steps","Default data; editing allowed with rationale",null,null,null,null,null,null,null,7,"Alabama","AL"]
["Project Location",null,"Horton, KS",null,null,null,null,null,null,null,null,null,null,null,"User Entered Data","Guidance",null,null,null,null,null,null,null,"X","Alaska","AK",null,"Row Labels"]
["Company",null,"ABC Engineering",null,null,null,null,null,null,null,null,null,null,null,"Reference Data; do not edit cells","Reference Links",null,null,null,null,null,null,null,2,"Arizona","AZ",null,"Colorado"]
[null,null,null,null,null,null,null,null,null,null,null,null,null,null,null,null,null,null,null,null,null,null,null,6,"Arkansas","AR",null,"Kansas"]
["Project Location and Climate Selection",null,null,null,null,null,null,null,null,null,null,null,null,null,null,null,null,null,null,null,null,null,null,2,"California","CA",null,"New Mexico"]
[null,null,null,null,null,null,null,null,null,null,null,null,null,null,null,null,null,null,null,null,null,null,null,4,"Colorado","CO",null,"Oklahoma"]
["Step 1: Select the Region your Project is Located",null,null,null,null,null,null,null,null,null,null,null,null,null,"Step 2: Select the state your project is located and the rain gage closest to the project",null,null,null,null,null,null,null,null,10,"Connecticut","CT",null,"Texas"]
[null,null,null,null,null,null,null,null,null,null,null,null,null,null,null,null,null,null,null,null,null,null,null,9,"Delaware","DE",null,"Grand Total"]
[null,null,null,null,null,null,null,null,null,null,null,null,null,null,"States within Selected Region","Rain Gages Available in State",null,null,null,null,null,null,null,7,"Florida","FL"]
[null,null,null,null,null,null,null,null,null,null,null,null,null,null,"Kansas","[3] NORTHEAST - HORTON",null,null,null,null,null,null,null,7,"Georgia","GA"]
[null,null,null,null,null,null,null,null,null,null,null,null,null,null,null,null,null,null,null,null,null,null,null,"X","Hawaii","HI"]
[null,null,null,null,null,null,null,null,null,null,null,null,null,null,null,null,null,null,null,null,null,null,null,1,"Idaho","ID"]
[null,null,null,null,null,null,null,null,null,null,null,null,null,null,"COOP ID",{"$f":"IF(P11=\"\",\"Select Rain Gage\",VLOOKUP(P11,'Rain Gage Summary'!B2:J348,9,FALSE))","v":143810},null,null,null,null,null,null,null,5,"Illinois","IL"]
[null,null,null,null,null,null,null,null,null,null,null,null,null,null,"Elevation (ft)",{"$f":"IF(P11=\"\",\"Select Rain Gage\",VLOOKUP(P11,'Rain Gage Summary'!B2:J348,5,FALSE))","v":1030},null,null,null,null,null,null,null,5,"Indiana","IN",null,"# states"]
{"$rows_left_out":37}
{"sheet":"Tributary Area","index":2,"n_rows":149,"n_cols":26,"rows_kept":149,"cut":false,"hidden":false,"merged":[[41,0,41,2],[0,3,0,4],[36,0,36,2],[1,1,1,2],[2,1,2,2],[3,1,3,2],[7,0,7,2],[13,0,13,2],[23,0,23,2],[25,0,25,2],[29,0,29,2],[31,0,31,2]]}
[{"$f":"'Project Location'!A1","v":"NCHRP 25-51 Roadside BMP Clogging Risk Assessment Tool"},null,null,"Key"]
["Project Title",{"$f":"'Project Location'!C2","v":"Example Run"},null,"User Steps","Default data; editing allowed with rationale"]
["Project Location",{"$f":"'Project Location'!C3","v":"Horton, KS"},null,"User Entered Data","Guidance"]
["Company",{"$f":"'Project Location'!C4","v":"ABC Engineering"},null,"Reference Data; do not edit cells","Reference Links"]
[]
["Tributary Area Attributes"]
[]
["Step 1: Provide data describing the roadway sediment concentration",null,null,null,null,null,"Look Up Tables and Lists"]
["Sediment Concentration Parameter","Value","Guidance",null,null,null,{"$f":"B10","v":"25K to 50K"},{"$f":"VLOOKUP(G9,G11:H15,2,FALSE)","v":57},{"$f":"B20","v":"Yes"}]
["Average Annual Daily Traffic Volume ","25K to 50K","Enter the average annual daily traffic (AADT) volume, the average number of vehicles that pass a roadway point in 24 hours. This value will be used to determine the default roadway TSS concentration.",null,null,null,"AADT","TSS (mg/L)","Additional Run On Area"]
["Default Roadway TSS Concentration (mg/L)",{"$f":"H9","v":57},"Default roadway TSS concentrations are median values based on AADT recorded in the Highway Runoff Database (HRDB; Granato & Cazenas, 2009).",null,null,null,"Less than 25K",43,"Yes"]
["User-Provided Roadway TSS Concentration (mg/L)",50,"Enter a site-specific roadway TSS concentration if available. If no value is entered here, the default roadway TSS concentration will be used.",null,null,null,"25K to 50K",57,"No"]
[null,null,null,null,null,null,"50K to 100K",95]
["Step 2: Provide data describing the roadway tributary area of the project",null,null,null,null,null,"Greater than 100K",107]
["Tributary Area Parameter","Value","Guidance",null,null,null,"Unknown (All AADT Combined)",70]
{"$rows_left_out":135}
{"sheet":"BMP Design","index":3,"n_rows":32,"n_cols":36,"rows_kept":32,"cut":false,"hidden":false,"merged":[[20,0,20,2],[0,3,0,4],[1,1,1,2],[2,1,2,2],[3,1,3,2],[7,0,7,2]]}
[{"$f":"'Project Location'!A1","v":"NCHRP 25-51 Roadside BMP Clogging Risk Assessment Tool"},null,null,"Key"]
["Project Title",{"$f":"'Project Location'!C2","v":"Example Run"},null,"User Steps","Default data; editing allowed with rationale"]
["Project Location",{"$f":"'Project Location'!C3","v":"Horton, KS"},null,"User Entered Data","Guidance"]
["Company",{"$f":"'Project Location'!C4","v":"ABC Engineering"},null,"Reference Data; do not edit cells","Reference Links"]
[]
["BMP Design Inputs"]
[]
["Step 1: Provide data describing the media/soil parameters of the practice",null,null,null,null,null,"Look Up Tables and Lists",null,null,null,{"$f":"IF(B26=\"Off-Line\",0.8,IF(B26=\"On-Line\",1,\"Select Practice Type\"))","v":0.8},null,{"$f":"IF(M9=\"Sediment Forebay Only\",0.25,IF(M9=\"TAPE Pretreatment GULD\",0.5,IF(M9=\"TAPE Basic Treatment GULD\",0.8,\"Enter Removal Efficiency\")))","v":0.5}]
["Parameter","Value","Guidance",null,null,null,{"$f":"B11","v":"Sand (HSG A)"},{"$f":"VLOOKUP(G9,G11:H21,2,FALSE)","v":4.49},{"$f":"B10","v":"Infiltration"},{"$f":"B14","v":"Yes"},{"$f":"B26","v":"Off-Line"},{"$f":"B28","v":"Yes"},{"$f":"B29","v":"TAPE Pretreatment GULD"},{"$f":"B31","v":"Surface"},{"$f":"B32","v":"Vegetated"},null,null,"Infiltration Rates of Selected Practice",null,null,null,null,null,"Load to Clog Calculation",null,null,null,null,null,null,null,null,null,null,"Rate of Reduction (in/hr/lb/ft2)"]
["Practice Type","Infiltration","Infiltration practices refer to retention facilities designed to infiltrate water into the existing underlying soils (i.e. infiltration basin and bioretention without an underdrain).\nFiltration practices refer to detention facilities with flow through a media layer which leaves the site through controlled drainage (i.e. sand filter and bioretention with an underdrain).",null,null,null,"Underlying Soil","Infiltration Rate (in/hr)","Practice Type?","Media Layer Present?","Flow Configuration?","Pretreatment Present?","Type of Pretreatment?","Location?","Vegetation?",null,null,"Practice Type:","Infiltration","Filtration","Selected","Location","Vegetated","Bin","Bin Initial Infiltration Rate (in/hr)","Bin Final Infiltration Rate (in/hr)","Rate of Reduction (in/hr/lb/ft2)","Scenario Initial Infiltration Rate (in/hr)","Scenario Final Infiltration Rate (in/hr)","Load to Clog (lb/ft2)","Graph Initial Infiltration Rate (in/hr)","Graph Final Infiltration Rate (in/hr)","Applied Load (lb/ft2)",null,"25th Percentile (Not Used)","Median (Applied to All Practices)"]
["Underlying Soil Type","Sand (HSG A)","Hydrologic soil group (HSG) is provided in parenthesis for the soil type. Refer to the USDA Texture Triangle for soil type gradations. ",null,null,null,"Sand (HSG A)",4.49,"Infiltration","Yes","Off-Line","Yes","Sediment Forebay Only","Surface","Vegetated",null,null,"Initial Infiltration Rate (in/hr):",{"$f":"IF(B14=\"Yes\",B15,IF(B13=\"\",B12,B13))","v":10},{"$f":"B18","v":30},{"$f":"IF(B10=\"Infiltration\",S11,T11)","v":10},{"$f":"N9","v":"Surface"},{"$f":"O9","v":"Vegetated"},1,150,25,180.26883187102348,{"$f":"IF(U11>Y11,Y11,U11)","v":10},{"$f":"IF(U12<Z11,Z11,U12)","v":25},{"$f":"IF((AB11-AC11)/AA11>0,(AB11-AC11)/AA11,0)","v":0},{"$f":"IF(U11>Y11,Y11,U11)","v":10},{"$f":"IF(U11>Z11,Z11,U11)","v":10},{"$f":"IF((AE11-AF11)/AA11>0,(AE11-AF11)/AA11,0)","v":0},null,314.58678502982525,180.26883187102348]
["Default Initial Soil Infiltration Rate (in/hr)",{"$f":"H9","v":4.49},"Default value do not edit. The infiltration rate is determined based on the underlying soil type input. Values extracted from the USDA SPAW Soil Water Characteristics Model.",null,null,null,"Loamy Sand (HSG A)",3.59,"Filtration","No","On-Line","No","TAPE Pretreatment GULD","Below Grade","Unvegetated",null,null,"Final Infiltration Rate (in/hr):",{"$f":"B16","v":0.5},{"$f":"B19","v":0.5},{"$f":"IF(B10=\"Infiltration\",S12,T12)","v":0.5},null,null,2,25,2.5,9.718122209821427,{"$f":"IF(U11>Y12,Y12,U11)","v":10},{"$f":"IF(U12<Z12,Z12,U12)","v":2.5},{"$f":"IF((AB12-AC12)/AA12>0,(AB12-AC12)/AA12,0)","v":0.77175403211335147},{"$f":"IF(U11>Y12,Y12,U11)","v":10},{"$f":"IF(U11>Z12,Z12,U11)","v":2.5},{"$f":"IF((AE12-AF12)/AA12>0,(AE12-AF12)/AA12,0)+AG11","v":0.77175403211335147},null,10.131033166310674,9.718122209821427]
["User-Provided Soil Infiltration Rate (in/hr)",1.33,"Enter a site-specific underlying soil infiltration rate if available. If no value is entered here, the default soil infiltration rate will be used.",null,null,null,"Sandy Loam (HSG A)",1.98,null,null,null,null,"TAPE Basic Treatment GULD",null,null,null,null,null,null,null,null,null,null,3,2.5,0.75,2.2660734331405483,{"$f":"IF(U11>Y13,Y13,U11)","v":2.5},{"$f":"IF(U12<Z13,Z13,U12)","v":0.75},{"$f":"IF((AB13-AC13)/AA13>0,(AB13-AC13)/AA13,0)","v":0.77226094018263003},{"$f":"IF(U11>Y13,Y13,U11)","v":2.5},{"$f":"IF(U11>Z13,Z13,U11)","v":0.75},{"$f":"IF((AE13-AF13)/AA13>0,(AE13-AF13)/AA13,0)+AG12","v":1.5440149722959815},null,3.6751062729779411,2.2660734331405483]
["Will a sacrificial media or sand layer be used over the underlying soil?","Yes","This refers to a more granular media that is placed above the in situ soil to reduce clogging risks. Recommended depth is 6 inches or greater. This should have a higher infiltration rate than the underlying soil. ",null,null,null,"Silt (HSG B)",0.75,null,null,null,null,"User Specified",null,null,null,null,null,null,null,null,null,null,4,0.75,0.25,0.56610332652082573,{"$f":"IF(U11>Y14,Y14,U11)","v":0.75},{"$f":"IF(U12<Z14,Z14,U12)","v":0.5},{"$f":"IF((AB14-AC14)/AA14>0,(AB14-AC14)/AA14,0)","v":0.44161549365282354},{"$f":"IF(U11>Y14,Y14,U11)","v":0.75},{"$f":"IF(U11>Z14,Z14,U11)","v":0.25},{"$f":"IF((AE14-AF14)/AA14>0,(AE14-AF14)/AA14,0)+AG13","v":2.4272459596016285},null,0.80274060413907433,0.56610332652082573]
["Initial Media Layer Infiltration Rate (in/hr)",10,"Enter the initial infiltration rate of the media layer.Valid range = 1 to 150 in/hr.",null,null,null,"Loam (HSG B)",0.73,null,null,null,null,null,null,null,null,null,null,null,null,null,null,null,null,null,null,null,null,"Total",{"$f":"SUM(AD11:AD14)","v":1.9856304659488051}]
{"$rows_left_out":18}
{"sheet":"Results Summary Report","index":4,"n_rows":77,"n_cols":12,"rows_kept":77,"cut":false,"hidden":false,"merged":[[69,0,70,0],[22,2,22,4],[23,2,23,4],[24,2,24,4],[50,3,52,4],[69,1,69,3],[61,0,61,4],[62,3,63,4],[64,0,64,4],[65,2,66,2],[62,2,63,2],[65,3,65,4],[66,3,66,4],[0,5,0,6],[48,3,48,4],[54,3,57,4],[59,3,60,4],[53,0,53,4],[58,0,58,4],[49,1,49,2],[50,2,52,2],[21,2,21,4],[54,2,57,2],[59,2,60,2]]}
[{"$f":"'Project Location'!A1","v":"NCHRP 25-51 Roadside BMP Clogging Risk Assessment Tool"},null,null,null,null,"Key"]
["Project Title",{"$f":"'Project Location'!C2","v":"Example Run"},null,null,null,"User Steps","Default data; editing allowed with rationale"]
["Project Location",{"$f":"'Project Location'!C3","v":"Horton, KS"},null,null,null,"User Entered Data","Guidance"]
["Company",{"$f":"'Project Location'!C4","v":"ABC Engineering"},null,null,null,"Reference Data; do not edit cells","Reference Links"]
[]
["Results Summary Report"]
[]
["Summary of Modeled Scenario"]
[{"$f":"\"The modeled scenario consists of a roadway drainage area of \"&'BMP Design'!I26&\" acres at \"&'Tributary Area'!B17*100&\"% impervious, with an additional \"&'BMP Design'!I27&\" acres of pervious off-site drainage (\"&'BMP Design'!I28&\"-acre total drainage area).\"","v":"The modeled scenario consists of a roadway drainage area of 9.5 acres at 100% impervious, with an additional 2.5 acres of pervious off-site drainage (12-acre total drainage area)."}]
[{"$f":"IF('Project Location'!P21='Project Location'!P16,\"Analysis is based on an average annual precipitation depth of \"&ROUND('Project Location'!P16,1)&\" in for the \"&'Project Location'!P11&\" rain gauge in \"&'Project Location'!O11&\".\",\"Analysis is based on a user-specified average annual precipitation depth of \"&ROUND('Project Location'!P21,1)&\" in.\")","v":"Analysis is based on an average annual precipitation depth of 35.4 in for the [3] NORTHEAST - HORTON rain gauge in Kansas."}]
[{"$f":"\"Clogging is assessed for a \"&'BMP Design'!J28&\" sq. ft. \"&LOWER('BMP Design'!O9)&\" \"&LOWER('BMP Design'!N9)&\" \"&LOWER('BMP Design'!I9)&\" practice with an initial infiltration rate of \"&'BMP Design'!U11&\" in/hr and a minimum allowable infiltration rate of \"&'BMP Design'!U12&\" in/hr.\"","v":"Clogging is assessed for a 11000 sq. ft. vegetated surface infiltration practice with an initial infiltration rate of 10 in/hr and a minimum allowable infiltration rate of 0.5 in/hr."}]
[{"$f":"IF('BMP Design'!L9=\"Yes\",\"Pretreatment is included in the design with a sediment removal efficiency of \"&'BMP Design'!M8*100&\"%.\", \"Pretreatment is not included in the design.\")","v":"Pretreatment is included in the design with a sediment removal efficiency of 50%."}]
[]
["Design Warnings",null,null,null,null,null,null,null,"Display","Order",null,"Warning"]
[{"$f":"IF(J15=1,L15,IF(J16=1,L16,IF(J17=1,L17,IF(J18=1,L18,IF(J19=1,L19,\"No fatal design warnings have been identified, view results below.\")))))","v":"The surface storage drawdown time at the initial infiltration rate is greater than 24 hours (current design = 26.7 hours), consider revising practice configuration."},null,null,null,null,null,null,null,{"$f":"IF(AND('BMP Design'!B10=\"Infiltration\",'BMP Design'!J32<0.75),\"Yes\",\"No\")","v":"No"},{"$f":"IF(I15=\"No\",0,1)","v":0},null,{"$f":"\"An infiltration practice has been specified with an underlying soil infiltration rate less than 0.75 in/hr (current design = \"&ROUND('BMP Design'!J32,1)&\" in/hr), consider changing practice type to filtration.\"","v":"An infiltration practice has been specified with an underlying soil infiltration rate less than 0.75 in/hr (current design = 1.3 in/hr), consider changing practice type to filtration."}]
{"$rows_left_out":63}
{"sheet":"Graph Parameters","index":5,"n_rows":7,"n_cols":8,"rows_kept":7,"cut":false,"hidden":true,"merged":[]}
[]
["Time (yrs)","Applied Load (lbs/ft2)","Time to Maintenance (yrs)","Load to Clog (lbs/ft2)","Time (yrs)","System Infiltration Rate (in/hr)","Time to Maintenance (yrs)","Maintenance Infiltration Rate (in/hr)"]
[0,0,{"$f":"'BMP Design'!U28","v":17.890203577432299},{"$f":"'BMP Design'!T28","v":1.9856304659488051},0,{"$f":"'BMP Design'!U11","v":10},{"$f":"'BMP Design'!U28","v":17.890203577432299},{"$f":"'BMP Design'!U12","v":0.5}]
[{"$f":"ROUNDUP(E7,0)","v":22},{"$f":"'BMP Design'!$S$28*A4","v":2.4417760290877286},null,null,{"$f":"'BMP Design'!AG11/'BMP Design'!$S$28","v":0},{"$f":"'BMP Design'!AF11","v":10}]
[null,null,null,null,{"$f":"'BMP Design'!AG12/'BMP Design'!$S$28","v":6.9533767652052427},{"$f":"'BMP Design'!AF12","v":2.5}]
[null,null,null,null,{"$f":"'BMP Design'!AG13/'BMP Design'!$S$28","v":13.911320688655664},{"$f":"'BMP Design'!AF13","v":0.75}]
[null,null,null,null,{"$f":"'BMP Design'!AG14/'BMP Design'!$S$28","v":21.86908646620893},{"$f":"'BMP Design'!AF14","v":0.25}]

{"sheet":"Rain Gage Summary","index":6,"n_rows":348,"n_cols":15,"rows_kept":348,"cut":false,"hidden":true,"merged":[]}
[" Station ID","Climate Division - Rain Gage","State","County","Climate Division","Elevation","85th Percentile","95th Percentile","Average Annual"," Station ID","Climate Division - Rain Gage"]
[15550,"[6] PRAIRIE - MONTGOMERY AP ASOS","AL","MONTGOMERY",6,202,1.25,2.0099999999999998,50.958726554660103,15550,"[6] PRAIRIE - MONTGOMERY AP ASOS"]
[26481,"[6] SOUTH CENTRAL - PHOENIX AP","AZ","MARICOPA",6,1107,0.67,1.02,7.2056578406174303,26481,"[6] SOUTH CENTRAL - PHOENIX AP"]
[47769,"[4] CENTRAL COAST DRNG. - SAN FRANCISCO WSO AP","CA","SAN MATEO",4,8,0.89,1.39,20.1809709584711,47769,"[4] CENTRAL COAST DRNG. - SAN FRANCISCO WSO AP"]
[45114,"[6] SOUTH COAST DRNG. - LOS ANGELES INTL AP","CA","LOS ANGELES",6,97,1.02,1.6,12.3051502429536,45114,"[6] SOUTH COAST DRNG. - LOS ANGELES INTL AP"]
[47740,"[6] SOUTH COAST DRNG. - SAN DIEGO WSO AP","CA","SAN DIEGO",6,15,0.78,1.25,9.7954187791749394,47740,"[6] SOUTH COAST DRNG. - SAN DIEGO WSO AP"]
[85663,"[6] LOWER EAST COAST - MIAMI INTL AP","FL","MIAMI-DADE",6,29,1.28,2.2000000000000002,58.883741625309,85663,"[6] LOWER EAST COAST - MIAMI INTL AP"]
[90451,"[2] NORTH CENTRAL - ATLANTA/MUN., GA.","GA","FULTON",2,1010,1.1399999999999999,1.8,48.999608631629798,90451,"[2] NORTH CENTRAL - ATLANTA/MUN., GA."]
[101022,"[5] SOUTHWESTERN VALLEYS - BOISE AIR TERMINAL","ID","ADA",5,2814,0.42,0.61,11.5045419821974,101022,"[5] SOUTHWESTERN VALLEYS - BOISE AIR TERMINAL"]
[124259,"[5] CENTRAL - INDIANAPOLIS INTL AP","IN","MARION",5,790,0.91,1.47,40.427824877002699,124259,"[5] CENTRAL - INDIANAPOLIS INTL AP"]
[132203,"[5] CENTRAL - DES MOINES AP","IA","POLK",5,957,0.91,1.5,32.261402697125,132203,"[5] CENTRAL - DES MOINES AP"]
[160549,"[6] EAST CENTRAL - BATON ROUGE METRO AP","LA","EAST BATON ROUGE",6,64,1.36,2.2999999999999998,57.724417306923499,160549,"[6] EAST CENTRAL - BATON ROUGE METRO AP"]
[215435,"[6] EAST CENTRAL - MINNEAPOLIS/ST PAUL AP","MN","HENNEPIN",6,872,0.8,1.33,27.729709270311702,215435,"[6] EAST CENTRAL - MINNEAPOLIS/ST PAUL AP"]
[244055,"[4] CENTRAL - HELENA AP ASOS","MT","LEWIS AND CLARK",4,3828,0.45,0.73,11.0347127383643,244055,"[4] CENTRAL - HELENA AP ASOS"]
[305811,"[4] COASTAL - NEW YORK LA GUARDIA AP","NY","QUEENS",4,11,1,1.68,43.142663833732797,305811,"[4] COASTAL - NEW YORK LA GUARDIA AP"]
{"$rows_left_out":333}