{"text_format":"1","workbook":"xlsx","n_sheets":9,"sheets":["START","FTE CALC","STF ALLOC","STF STRTGS","FTE Factors","DOT INPUT","FTE FactorsRV","DOT INPUTRV","FTE Review"],"not_rendered":{"charts":0,"images":0,"macros":1,"external_links":0,"defined_names":0,"comments":0,"pivot_tables":0},"unopened":[],"bounds":{"document_bytes":16777216,"sheet_cells":100000,"rows_first":2000,"rows_last":500,"rows_between":2000,"halvings":0,"cell_chars":16384,"cell_head_chars":4096},"cells_cut":0,"cells_raw":0,"read":"whole","date_system":"1900"}

{"sheet":"START","index":0,"n_rows":0,"n_cols":0,"rows_kept":0,"cut":false,"hidden":false,"merged":[]}

{"sheet":"FTE CALC","index":1,"n_rows":27,"n_cols":27,"rows_kept":27,"cut":false,"hidden":false,"merged":[[3,1,3,6],[4,2,4,3],[4,4,4,5],[5,2,5,3],[5,4,5,5],[16,4,17,6],[7,2,7,3],[6,2,6,3],[6,4,6,5],[7,4,7,5],[14,4,15,6]]}
[]
[null,"Project Level FTE Calculator"]
[]
[null,"Project Description"]
[null,"Project Name","Anticipated Start Date",null,"Anticipated Completion Date"]
[null,null,null,null,null,null,null,null,null,null,null,null,1]
[null,"Project Type","Construction Estimate",null,"Complexity",null,"Use of CEI",null,null,null,null,null,{"$f":"IF($M$6=1, \"FTE Factors\", \"DOT INPUT\")","v":"FTE Factors"}]
[]
[]
[null,"Project Level FTE "," Engineer","Surveyor","Admin Staff","Inspectors","Total Insp. Staff & Eng.",null,null,null,null,null,null,null,"Project Level FTE ","Resident Engineer","Surveyor","Admin Staff","Inspectors","Total Insp. Staff & RE",null,"Project Level FTE ","Resident Engineer","Surveyor","Admin Staff","Inspectors","Total Insp. Staff & RE"]
{"$rows_left_out":18}
{"sheet":"STF ALLOC","index":2,"n_rows":107,"n_cols":77,"rows_kept":107,"cut":false,"hidden":false,"merged":[]}
["Program Level Staff Allocation",null,"","","","","","","","","","","",""]
["Program of Projects ",null,"","","","","Crew Available","","","","","","",{"$f":"$A$11+5","v":5},null,null,"Staff Allocation"]
[null,null,"","","","","Crew FTE Available",3,"Project # to Review","",1,"","Row",{"$f":"$K$3+5","v":6}]
[null,null,"","","","","","","","","","","","",null,null,"Eng FTE Req",{"$f":"SUM(R13,R19,R25,R31,R37,R43,R49,R55,R61,R67,R73,R79,R85,R91,R97,R103)","v":0},{"$f":"SUM(S13,S19,S25,S31,S37,S43,S49,S55,S61,S67,S73,S79,S85,S91,S97,S103)","v":0},0,0,0,0,0,0,0,0,0,0,0,0,0,0,0,0,0,0,0,0,0,0,0,0,0,0,0,0,0,0,0,0,0,0,0,0,0,0,0,0,0,0,0,0,0,0,0,0,0,0,0,0,0,0,0,0,0,0]
[null,"Prioritization","Project Name","Project Type","Engineer FTE","Inspector FTE","FTE Required1","Start","Completion","","Project #","Estimate","Complexity","CEI",null,null,"Insp FTE Req",{"$f":"SUM(R14,R20,R26,R32,R38,R44,R50,R56,R62,R68,R74,R80,R86,R92,R98,R104)","v":0},{"$f":"SUM(S14,S20,S26,S32,S38,S44,S50,S56,S62,S68,S74,S80,S86,S92,S98,S104)","v":0},0,0,0,0,0,0,0,0,0,0,0,0,0,0,0,0,0,0,0,0,0,0,0,0,0,0,0,0,0,0,0,0,0,0,0,0,0,0,0,0,0,0,0,0,0,0,0,0,0,0,0,0,0,0,0,0,0,0]
[null,null,null,null,null,null,null,null,null,null,1,null,null,null,null,null,"FTE Required",{"$f":"SUM(R4:R5)","v":0},{"$f":"SUM(S4:S5)","v":0},0,0,0,0,0,0,0,0,0,0,0,0,0,0,0,0,0,0,0,0,0,0,0,0,0,0,0,0,0,0,0,0,0,0,0,0,0,0,0,0,0,0,0,0,0,0,0,0,0,0,0,0,0,0,0,0,0,0]
[null,null,null,null,null,null,null,null,null,null,2,null,null,null,null,null,"FTE Available",{"$f":"$H$3","v":3},{"$f":"$H$3","v":3},{"$f":"$H$3","v":3},3,3,3,3,3,3,3,3,3,3,3,3,3,3,3,3,3,3,3,3,3,3,3,3,3,3,3,3,3,3,3,3,3,3,3,3,3,3,3,3,3,3,3,3,3,3,3,3,3,3,3,3,3,3,3,3,3]
[null,null,null,null,null,null,null,null,null,null,3,null,null,null,null,null,"FTE Needs",{"$f":"IF(R6-R7<0,0,R6-R7)","v":0},{"$f":"IF(S6-S7<0,0,S6-S7)","v":0},0,0,0,0,0,0,0,0,0,0,0,0,0,0,0,0,0,0,0,0,0,0,0,0,0,0,0,0,0,0,0,0,0,0,0,0,0,0,0,0,0,0,0,0,0,0,0,0,0,0,0,0,0,0,0,0,0,0]
[null,null,null,null,null,null,null,null,null,null,4,null,null,null,null,null,"Year",{"$f":"MIN((IF($H$6:$H$103<>0,YEAR($H$6:$H$103))))","v":0},null,null,null,null,null,null,null,null,null,null,null,{"$f":"R9+1","v":1},null,null,null,null,null,null,null,null,null,null,null,{"$f":"AD9+1","v":2},null,null,null,null,null,null,null,null,null,null,null,{"$f":"AP9+1","v":3},null,null,null,null,null,null,null,null,null,null,null,{"$f":"BB9+1","v":4}]
["Project # to Clear",null,null,null,null,null,null,null,null,null,5,null,null,null,null,null,"Month",1,2,3,4,5,6,7,8,9,10,11,12,1,2,3,4,5,6,7,8,9,10,11,12,1,2,3,4,5,6,7,8,9,10,11,12,1,2,3,4,5,6,7,8,9,10,11,12,1,2,3,4,5,6,7,8,9,10,11,12]
{"$rows_left_out":98}
{"sheet":"STF STRTGS","index":3,"n_rows":80,"n_cols":51,"rows_kept":80,"cut":false,"hidden":false,"merged":[[2,35,3,35],[1,9,1,10],[21,9,21,10],[2,13,3,13],[2,15,3,15],[2,17,3,17],[2,19,3,19],[2,23,3,23],[2,25,3,25],[2,27,3,27],[2,29,3,29],[2,31,3,31],[2,33,3,33],[2,21,3,21],[1,13,1,35],[22,37,23,37],[41,9,41,10],[21,13,21,37],[22,13,23,13],[22,15,23,15],[22,17,23,17],[22,19,23,19],[22,21,23,21],[22,23,23,23],[22,25,23,25],[22,27,23,27],[41,13,41,49],[42,25,43,25],[22,29,23,29],[22,31,23,31],[22,33,23,33],[22,35,23,35],[42,13,43,13],[42,15,43,15],[42,17,43,17],[42,19,43,19],[42,23,43,23],[42,21,43,21],[42,49,43,49],[42,27,43,27],[42,29,43,29],[42,31,43,31],[42,33,43,33],[42,35,43,35],[42,37,43,37],[42,39,43,39],[42,41,43,41],[42,43,43,43],[42,45,43,45],[42,47,43,47],[63,9,63,10],[63,13,63,27],[64,13,65,13],[64,15,65,15],[64,17,65,17],[64,19,65,19],[64,21,65,21],[64,23,65,23],[64,25,65,25],[64,27,65,27]]}
[]
[null,"Your maximum staffing deficit is:",{"$f":"MAX('STF ALLOC'!R8:BY8)","v":0},null,null,null,null,null,"Potential Tool Applicability","Construction Administration (A)",null,null,"Construction Staff Function","Construction Administration (A)"]
[null,null,null,null,null,null,null,null,{"$f":"SUMPRODUCT($G$5:$G$18,O5:O18)/SUM($D$5:$D$18)","v":0},"A-1","Accelerated Construction Methods",null,"                             Strategy (Tool)","A-1",null,"A-2",null,"A-2-1",null,"A-2-2",null,"A-2-3",null,"A-3",null,"A-3-1",null,"A-3-2",null,"A-3-3",null,"A-3-4",null,"A-4",null,"A-5"]
[null,"Work Type Survey ","Applicable?",null,"Risk Level",null,null,null,{"$f":"SUMPRODUCT($G$5:$G$18,Q5:Q18)/SUM($D$5:$D$18)","v":0},"A-2/I-2","Contract Requirements",null,"Work Type"]
[null,"Pavement Surface","Yes",{"$f":"IF(C5=\"Yes\", 1,0)","v":1},null,{"$f":"IF(E5=\"High\",3,IF(E5=\"Medium\",2,IF(E5=\"Low\",1,0)))","v":0},{"$f":"D5*F5","v":0},null,{"$f":"SUMPRODUCT($G$5:$G$18,S5:S18)/SUM($D$5:$D$18)","v":0},"A-2-1/I-2-1","     Operations & Maintenance (by Contractor)",null,"Pavement Surface","★",{"$f":"IF(N5=\"★\",2,IF(N5=\"☆\",1,0))","v":2},"☆",{"$f":"IF(P5=\"★\",2,IF(P5=\"☆\",1,0))","v":1},"☆",{"$f":"IF(R5=\"★\",2,IF(R5=\"☆\",1,0))","v":1},"☆",{"$f":"IF(T5=\"★\",2,IF(T5=\"☆\",1,0))","v":1},"☆",{"$f":"IF(V5=\"★\",2,IF(V5=\"☆\",1,0))","v":1},"☆",{"$f":"IF(X5=\"★\",2,IF(X5=\"☆\",1,0))","v":1},"☆",{"$f":"IF(Z5=\"★\",2,IF(Z5=\"☆\",1,0))","v":1},"☆",{"$f":"IF(AB5=\"★\",2,IF(AB5=\"☆\",1,0))","v":1},"☆",{"$f":"IF(AD5=\"★\",2,IF(AD5=\"☆\",1,0))","v":1},"☆",{"$f":"IF(AF5=\"★\",2,IF(AF5=\"☆\",1,0))","v":1},"★",{"$f":"IF(AH5=\"★\",2,IF(AH5=\"☆\",1,0))","v":2},"★",{"$f":"IF(AJ5=\"★\",2,IF(AJ5=\"☆\",1,0))","v":2}]
[null,"Superstructure",null,{"$f":"IF(C6=\"Yes\", 1,0)","v":0},null,{"$f":"IF(E6=\"High\",3,IF(E6=\"Medium\",2,IF(E6=\"Low\",1,0)))","v":0},{"$f":"D6*F6","v":0},null,{"$f":"SUMPRODUCT($G$5:$G$18,U5:U18)/SUM($D$5:$D$18)","v":0},"A-2-2/I-2-2","     Warranty",null,"Superstructure","★",{"$f":"IF(N6=\"★\",2,IF(N6=\"☆\",1,0))","v":2},"☆",1,"☆",{"$f":"IF(R6=\"★\",2,IF(R6=\"☆\",1,0))","v":1},"☆",{"$f":"IF(T6=\"★\",2,IF(T6=\"☆\",1,0))","v":1},"☆",{"$f":"IF(V6=\"★\",2,IF(V6=\"☆\",1,0))","v":1},"☆",{"$f":"IF(X6=\"★\",2,IF(X6=\"☆\",1,0))","v":1},"☆",{"$f":"IF(Z6=\"★\",2,IF(Z6=\"☆\",1,0))","v":1},"☆",{"$f":"IF(AB6=\"★\",2,IF(AB6=\"☆\",1,0))","v":1},"☆",{"$f":"IF(AD6=\"★\",2,IF(AD6=\"☆\",1,0))","v":1},"★",{"$f":"IF(AF6=\"★\",2,IF(AF6=\"☆\",1,0))","v":2},"★",{"$f":"IF(AH6=\"★\",2,IF(AH6=\"☆\",1,0))","v":2},"☆",{"$f":"IF(AJ6=\"★\",2,IF(AJ6=\"☆\",1,0))","v":1}]
[null,"Excavation / Embankment",null,0,null,0,0,null,{"$f":"SUMPRODUCT($G$5:$G$18,W5:W18)/SUM($D$5:$D$18)","v":0},"A-2-3/I-2-3","     Performance Based Specifications",null,"Excavation / Embankment","★",2,"☆",1,null,{"$f":"IF(R7=\"★\",2,IF(R7=\"☆\",1,0))","v":0},null,{"$f":"IF(T7=\"★\",2,IF(T7=\"☆\",1,0))","v":0},"☆",1,"☆",{"$f":"IF(X7=\"★\",2,IF(X7=\"☆\",1,0))","v":1},"☆",{"$f":"IF(Z7=\"★\",2,IF(Z7=\"☆\",1,0))","v":1},"☆",{"$f":"IF(AB7=\"★\",2,IF(AB7=\"☆\",1,0))","v":1},"☆",{"$f":"IF(AD7=\"★\",2,IF(AD7=\"☆\",1,0))","v":1},"☆",{"$f":"IF(AF7=\"★\",2,IF(AF7=\"☆\",1,0))","v":1},"★",{"$f":"IF(AH7=\"★\",2,IF(AH7=\"☆\",1,0))","v":2},"☆",{"$f":"IF(AJ7=\"★\",2,IF(AJ7=\"☆\",1,0))","v":1}]
[null,"Pipe / Drainage",null,0,null,0,0,null,{"$f":"SUMPRODUCT($G$5:$G$18,Y5:Y18)/SUM($D$5:$D$18)","v":0},"A-3","Electronic Business Processes",null,"Pipe / Drainage","☆",1,"★",2,"★",{"$f":"IF(R8=\"★\",2,IF(R8=\"☆\",1,0))","v":2},"★",{"$f":"IF(T8=\"★\",2,IF(T8=\"☆\",1,0))","v":2},"☆",1,"☆",{"$f":"IF(X8=\"★\",2,IF(X8=\"☆\",1,0))","v":1},"☆",{"$f":"IF(Z8=\"★\",2,IF(Z8=\"☆\",1,0))","v":1},"☆",{"$f":"IF(AB8=\"★\",2,IF(AB8=\"☆\",1,0))","v":1},"☆",{"$f":"IF(AD8=\"★\",2,IF(AD8=\"☆\",1,0))","v":1},"☆",{"$f":"IF(AF8=\"★\",2,IF(AF8=\"☆\",1,0))","v":1},"★",{"$f":"IF(AH8=\"★\",2,IF(AH8=\"☆\",1,0))","v":2},"☆",{"$f":"IF(AJ8=\"★\",2,IF(AJ8=\"☆\",1,0))","v":1}]
[null,"Roadway Base",null,0,null,0,0,null,{"$f":"SUMPRODUCT($G$5:$G$18,AA5:AA18)/SUM($D$5:$D$18)","v":0},"A-3-1","     Change Orders",null,"Roadway Base","★",2,"★",2,"★",{"$f":"IF(R9=\"★\",2,IF(R9=\"☆\",1,0))","v":2},"★",{"$f":"IF(T9=\"★\",2,IF(T9=\"☆\",1,0))","v":2},"☆",1,"☆",{"$f":"IF(X9=\"★\",2,IF(X9=\"☆\",1,0))","v":1},"☆",{"$f":"IF(Z9=\"★\",2,IF(Z9=\"☆\",1,0))","v":1},"☆",{"$f":"IF(AB9=\"★\",2,IF(AB9=\"☆\",1,0))","v":1},"☆",{"$f":"IF(AD9=\"★\",2,IF(AD9=\"☆\",1,0))","v":1},"☆",{"$f":"IF(AF9=\"★\",2,IF(AF9=\"☆\",1,0))","v":1},"★",{"$f":"IF(AH9=\"★\",2,IF(AH9=\"☆\",1,0))","v":2},"☆",{"$f":"IF(AJ9=\"★\",2,IF(AJ9=\"☆\",1,0))","v":1}]
[null,"Pavement Base",null,0,null,0,0,null,{"$f":"SUMPRODUCT($G$5:$G$18,AC5:AC18)/SUM($D$5:$D$18)","v":0},"A-3-2","     Document Storage/Management/Work Flow",null,"Pavement Base","★",2,"★",2,"★",{"$f":"IF(R10=\"★\",2,IF(R10=\"☆\",1,0))","v":2},"★",{"$f":"IF(T10=\"★\",2,IF(T10=\"☆\",1,0))","v":2},"☆",1,"☆",{"$f":"IF(X10=\"★\",2,IF(X10=\"☆\",1,0))","v":1},"☆",{"$f":"IF(Z10=\"★\",2,IF(Z10=\"☆\",1,0))","v":1},"☆",{"$f":"IF(AB10=\"★\",2,IF(AB10=\"☆\",1,0))","v":1},"☆",{"$f":"IF(AD10=\"★\",2,IF(AD10=\"☆\",1,0))","v":1},"☆",{"$f":"IF(AF10=\"★\",2,IF(AF10=\"☆\",1,0))","v":1},"★",{"$f":"IF(AH10=\"★\",2,IF(AH10=\"☆\",1,0))","v":2},"☆",{"$f":"IF(AJ10=\"★\",2,IF(AJ10=\"☆\",1,0))","v":1}]
{"$rows_left_out":71}
{"sheet":"FTE Factors","index":4,"n_rows":41,"n_cols":26,"rows_kept":41,"cut":false,"hidden":true,"merged":[[26,6,26,14],[3,2,3,19],[4,2,5,2],[4,6,5,6],[4,8,4,10],[4,11,4,13],[4,14,4,16],[4,17,4,19],[21,2,23,2],[6,2,8,2],[9,2,11,2],[12,2,14,2],[15,2,17,2],[18,2,20,2],[27,7,27,8],[27,9,27,10],[27,11,27,12],[27,13,27,14],[36,6,36,10]]}
[]
[]
[]
[null,null,"FTE by Project Type and Position",null,null,null,null,null,null,null,null,null,null,null,null,null,null,null,null,null,null,"Index Factor"]
[null,null,"Project Type",null,null,null,"Cost Range"," ","Resident Engineer",null,null,"Surveyor",null,null,"Admin Staff",null,null,"Inspectors",null,null,null,"Area",{"$f":"VLOOKUP('FTE CALC'!$B$8,'FTE Factors'!$C$7:$D$24,2,FALSE)","v":{"$error":"#N/A"}}]
[null,null,null,null,null,null,null,"N","Low 95%","Mean","High 95%","Low 95%","Mean","High 95%","Low 95%","Mean","High 95%","Low 95%","Mean","High 95%",null,"Row",{"$f":"IF('FTE CALC'!$C$8<'FTE Factors'!$W$10,'FTE Factors'!$X$10,IF('FTE CALC'!$C$8<'FTE Factors'!$W$11,'FTE Factors'!$X$11,'FTE Factors'!$X$12))","v":{"$error":"#N/A"}}]
[null,null,"Road - New Construction / Expansion",1,1,5000000,"$0-$5,000,000",11,0,0.96,2,0,0.03,0.25,0,0.55000000000000004,3,1,1.72,3]
[null,null,null,null,2,25000000,"$5,000,000 - $25,000,000",11,1,1.2,2,0,0.75,2,0,1.18,2,2,3.9,6]
[null,null,null,null,3,25000000,"$25,000,000 and up",8,0,1.4,2,0,1.2,4,1,2,4,4,8,20,null,"Index Cost Factors"]
[null,null,"Road - Rehabilitation / Resurfacing",2,1,1000000,"$0-$1,000,000",45,0,0.79,1,0,0.17,1,0,0.53,2,0.1,1.5670731707000001,3,null,"Low",{"$f":"VLOOKUP($W$5,$W$17:$Z$22,2,FALSE)","v":{"$error":"#N/A"}},1]
{"$rows_left_out":32}
{"sheet":"DOT INPUT","index":5,"n_rows":41,"n_cols":26,"rows_kept":41,"cut":false,"hidden":false,"merged":[[3,2,3,19],[4,2,5,2],[4,6,5,6],[4,8,4,10],[4,11,4,13],[4,14,4,16],[4,17,4,19],[36,6,36,10],[6,2,8,2],[9,2,11,2],[12,2,14,2],[15,2,17,2],[18,2,20,2],[21,2,23,2],[26,6,26,14],[27,7,27,8],[27,9,27,10],[27,11,27,12],[27,13,27,14]]}
[]
[]
[]
[null,null,"FTE by Project Type and Position",null,null,null,null,null,null,null,null,null,null,null,null,null,null,null,null,null,null,"Index Factor"]
[null,null,"Project Type",null,null,null,"Cost Range"," "," Engineer",null,null,"Surveyor",null,null,"Admin Staff",null,null,"Inspectors",null,null,null,"Area",{"$f":"VLOOKUP('FTE CALC'!$B$8,'DOT INPUT'!$C$7:$D$24,2,FALSE)","v":{"$error":"#N/A"}}]
[null,null,null,null,null,null,null,"N","Low","Avg","High","Low","Avg","High","Low","Avg","High","Low","Avg","High",null,"Row",{"$f":"IF('FTE CALC'!$C$8<'DOT INPUT'!$W$10,'DOT INPUT'!$X$10,IF('FTE CALC'!$C$8<'DOT INPUT'!$W$11,'DOT INPUT'!$X$11,'DOT INPUT'!$X$12))","v":{"$error":"#N/A"}}]
[null,null,"Road - New Construction / Expansion",1,1,5000000,"$0-$5,000,000",11]
[null,null,null,null,2,25000000,"$5,000,000 - $25,000,000",11]
[null,null,null,null,3,25000000,"$25,000,000 and up",8,null,null,null,null,null,null,null,null,null,null,null,null,null,"Index Cost Factors"]
[null,null,"Road - Rehabilitation / Resurfacing",2,1,1000000,"$0-$1,000,000",45,null,null,null,null,null,null,null,null,null,null,null,null,null,"Low",{"$f":"VLOOKUP($W$5,$W$17:$Z$22,2,FALSE)","v":{"$error":"#N/A"}},1]
{"$rows_left_out":32}
{"sheet":"FTE FactorsRV","index":6,"n_rows":41,"n_cols":26,"rows_kept":41,"cut":false,"hidden":true,"merged":[[3,2,3,19],[4,2,5,2],[4,6,5,6],[4,8,4,10],[4,11,4,13],[4,14,4,16],[4,17,4,19],[36,6,36,10],[6,2,8,2],[9,2,11,2],[12,2,14,2],[15,2,17,2],[18,2,20,2],[21,2,23,2],[26,6,26,14],[27,7,27,8],[27,9,27,10],[27,11,27,12],[27,13,27,14]]}
[]
[]
[]
[null,null,"FTE by Project Type and Position",null,null,null,null,null,null,null,null,null,null,null,null,null,null,null,null,null,null,"Index Factor"]
[null,null,"Project Type",null,null,null,"Cost Range"," ","Resident Engineer",null,null,"Surveyor",null,null,"Admin Staff",null,null,"Inspectors",null,null,null,"Area",{"$f":"VLOOKUP('FTE Review'!$B$8,'FTE FactorsRV'!$C$7:$D$24,2,FALSE)","v":{"$error":"#N/A"}}]
[null,null,null,null,null,null,null,"N","Low 95%","Mean","High 95%","Low 95%","Mean","High 95%","Low 95%","Mean","High 95%","Low 95%","Mean","High 95%",null,"Row",{"$f":"IF('FTE Review'!$C$8<'FTE FactorsRV'!$W$10,'FTE FactorsRV'!$X$10,IF('FTE Review'!$C$8<'FTE FactorsRV'!$W$11,'FTE FactorsRV'!$X$11,'FTE FactorsRV'!$X$12))","v":{"$error":"#N/A"}}]
[null,null,"Road - New Construction / Expansion",1,1,5000000,"$0-$5,000,000",11,0,0.96,2,0,0.03,0.25,0,0.55000000000000004,3,1,1.72,3]
[null,null,null,null,2,25000000,"$5,000,000 - $25,000,000",11,1,1.2,2,0,0.75,2,0,1.18,2,2,3.9,6]
[null,null,null,null,3,25000000,"$25,000,000 and up",8,0,1.4,2,0,1.2,4,1,2,4,4,8,20,null,"Index Cost Factors"]
[null,null,"Road - Rehabilitation / Resurfacing",2,1,1000000,"$0-$1,000,000",45,0,0.79,1,0,0.17,1,0,0.53,2,0.1,1.5670731707000001,3,null,"Low",{"$f":"VLOOKUP($W$5,$W$17:$Z$22,2,FALSE)","v":{"$error":"#N/A"}},1]
{"$rows_left_out":32}
{"sheet":"DOT INPUTRV","index":7,"n_rows":41,"n_cols":26,"rows_kept":41,"cut":false,"hidden":true,"merged":[[3,2,3,19],[4,2,5,2],[4,6,5,6],[4,8,4,10],[4,11,4,13],[4,14,4,16],[4,17,4,19],[36,6,36,10],[6,2,8,2],[9,2,11,2],[12,2,14,2],[15,2,17,2],[18,2,20,2],[21,2,23,2],[26,6,26,14],[27,7,27,8],[27,9,27,10],[27,11,27,12],[27,13,27,14]]}
[]
[]
[]
[null,null,"FTE by Project Type and Position",null,null,null,null,null,null,null,null,null,null,null,null,null,null,null,null,null,null,"Index Factor"]
[null,null,"Project Type",null,null,null,"Cost Range"," "," Engineer",null,null,"Surveyor",null,null,"Admin Staff",null,null,"Inspectors",null,null,null,"Area",{"$f":"VLOOKUP('FTE Review'!$B$8,'DOT INPUTRV'!$C$7:$D$24,2,FALSE)","v":{"$error":"#N/A"}}]
[null,null,null,null,null,null,null,"N","Low","Avg","High","Low","Avg","High","Low","Avg","High","Low","Avg","High",null,"Row",{"$f":"IF('FTE Review'!$C$8<'DOT INPUTRV'!$W$10,'DOT INPUTRV'!$X$10,IF('FTE Review'!$C$8<'DOT INPUTRV'!$W$11,'DOT INPUTRV'!$X$11,'DOT INPUTRV'!$X$12))","v":{"$error":"#N/A"}}]
[null,null,"Road - New Construction / Expansion",1,1,5000000,"$0-$5,000,000",11,{"$f":"'DOT INPUT'!I7","v":0},{"$f":"'DOT INPUT'!J7","v":0},{"$f":"'DOT INPUT'!K7","v":0},{"$f":"'DOT INPUT'!L7","v":0},{"$f":"'DOT INPUT'!M7","v":0},{"$f":"'DOT INPUT'!N7","v":0},{"$f":"'DOT INPUT'!O7","v":0},{"$f":"'DOT INPUT'!P7","v":0},{"$f":"'DOT INPUT'!Q7","v":0},{"$f":"'DOT INPUT'!R7","v":0},{"$f":"'DOT INPUT'!S7","v":0},{"$f":"'DOT INPUT'!T7","v":0}]
[null,null,null,null,2,25000000,"$5,000,000 - $25,000,000",11,{"$f":"'DOT INPUT'!I8","v":0},{"$f":"'DOT INPUT'!J8","v":0},{"$f":"'DOT INPUT'!K8","v":0},{"$f":"'DOT INPUT'!L8","v":0},{"$f":"'DOT INPUT'!M8","v":0},{"$f":"'DOT INPUT'!N8","v":0},{"$f":"'DOT INPUT'!O8","v":0},{"$f":"'DOT INPUT'!P8","v":0},{"$f":"'DOT INPUT'!Q8","v":0},{"$f":"'DOT INPUT'!R8","v":0},{"$f":"'DOT INPUT'!S8","v":0},{"$f":"'DOT INPUT'!T8","v":0}]
[null,null,null,null,3,25000000,"$25,000,000 and up",8,{"$f":"'DOT INPUT'!I9","v":0},{"$f":"'DOT INPUT'!J9","v":0},{"$f":"'DOT INPUT'!K9","v":0},{"$f":"'DOT INPUT'!L9","v":0},{"$f":"'DOT INPUT'!M9","v":0},{"$f":"'DOT INPUT'!N9","v":0},{"$f":"'DOT INPUT'!O9","v":0},{"$f":"'DOT INPUT'!P9","v":0},{"$f":"'DOT INPUT'!Q9","v":0},{"$f":"'DOT INPUT'!R9","v":0},{"$f":"'DOT INPUT'!S9","v":0},{"$f":"'DOT INPUT'!T9","v":0},null,"Index Cost Factors"]
[null,null,"Road - Rehabilitation / Resurfacing",2,1,1000000,"$0-$1,000,000",45,{"$f":"'DOT INPUT'!I10","v":0},{"$f":"'DOT INPUT'!J10","v":0},{"$f":"'DOT INPUT'!K10","v":0},{"$f":"'DOT INPUT'!L10","v":0},{"$f":"'DOT INPUT'!M10","v":0},{"$f":"'DOT INPUT'!N10","v":0},{"$f":"'DOT INPUT'!O10","v":0},{"$f":"'DOT INPUT'!P10","v":0},{"$f":"'DOT INPUT'!Q10","v":0},{"$f":"'DOT INPUT'!R10","v":0},{"$f":"'DOT INPUT'!S10","v":0},{"$f":"'DOT INPUT'!T10","v":0},null,"Low",{"$f":"VLOOKUP($W$5,$W$17:$Z$22,2,FALSE)","v":{"$error":"#N/A"}},1]
{"$rows_left_out":32}
{"sheet":"FTE Review","index":8,"n_rows":27,"n_cols":27,"rows_kept":27,"cut":false,"hidden":true,"merged":[[7,2,7,3],[7,4,7,5],[14,4,15,6],[16,4,17,6],[3,1,3,6],[4,2,4,3],[4,4,4,5],[5,2,5,3],[5,4,5,5],[6,2,6,3],[6,4,6,5]]}
[]
[null,"Project Level FTE Review "]
[]
[null,"Project Description"]
[null,"Project Name","Anticipated Start Date",null,"Anticipated Completion Date"]
[null,{"$f":"INDIRECT(\"'STF ALLOC'!C\"&'STF ALLOC'!$N$3)","v":0},{"$f":"INDIRECT(\"'STF ALLOC'!H\"&'STF ALLOC'!$N$3)","v":"00:00:00"},null,{"$f":"INDIRECT(\"'STF ALLOC'!I\"&'STF ALLOC'!$N$3)","v":"00:00:00"},null,null,null,null,null,null,null,1]
[null,"Project Type","Construction Estimate",null,"Complexity",null,"Use of CEI",null,null,null,null,null,{"$f":"IF($M$6=1, \"FTE Factors\", \"DOT INPUT\")","v":"FTE Factors"}]
[null,{"$f":"INDIRECT(\"'STF ALLOC'!D\"&'STF ALLOC'!$N$3)","v":0},{"$f":"INDIRECT(\"'STF ALLOC'!L\"&'STF ALLOC'!$N$3)","v":0},null,{"$f":"INDIRECT(\"'STF ALLOC'!M\"&'STF ALLOC'!$N$3)","v":0},null,{"$f":"INDIRECT(\"'STF ALLOC'!N\"&'STF ALLOC'!$N$3)","v":0}]
[]
[null,"Project Level FTE ","Resident Engineer","Surveyor","Admin Staff","Inspectors","Total Insp. Staff & RE",null,null,null,null,null,null,null,"Project Level FTE ","Resident Engineer","Surveyor","Admin Staff","Inspectors","Total Insp. Staff & RE",null,"Project Level FTE ","Resident Engineer","Surveyor","Admin Staff","Inspectors","Total Insp. Staff & RE"]
{"$rows_left_out":17}