{"text_format":"1","workbook":"xlsx","n_sheets":40,"sheets":["Welcome","Relevant Risks","Threat-Haz Vulnerability","Thresholds","Road Bridge","Road Tunnel","Station","Rail Bridge","Rail Tunnel","Facilities","Ferry","Fleet","Other","Critical Assets","PPI Info","CM Costs","Additional CMs","CM Filter","CM Opportunities","CM Dictionary","Asset Analyst","Results Summary","Road Bridge CM Summ","Road Tunnel CM Summ","Station CM Summ","Rail Bridge CM Summ","Rail Tunnel CM Summ","Facilities CM Summ","Ferry CM Summ","Fleet CM Summ","Other CM Summ","Road Bridge Hard Code","Road Tunnel Hard Code","Station Hard Code","Rail Bridge Hard Code","Rail Tunnels Hard Code","Facilities Hard Code","Ferries Hard Code","Fleet Hard Code","Sheet1"],"not_rendered":{"charts":2,"images":147,"macros":1,"external_links":0,"defined_names":4,"comments":1,"pivot_tables":0},"unopened":[],"bounds":{"document_bytes":16777216,"sheet_cells":100000,"rows_first":2000,"rows_last":500,"rows_between":2000,"halvings":0,"cell_chars":16384,"cell_head_chars":4096},"cells_cut":0,"cells_raw":0,"read":"whole","date_system":"1900"}

{"sheet":"Welcome","index":0,"n_rows":16,"n_cols":9,"rows_kept":16,"cut":false,"hidden":false,"merged":[]}
[]
[]
[]
[]
[]
[]
[]
[]
[]
[]
[]
[]
[]
[]
[]
[null,null,null,null,null,null,null,"Input cell","Input"]

{"sheet":"Relevant Risks","index":1,"n_rows":29,"n_cols":15,"rows_kept":29,"cut":false,"hidden":false,"merged":[[17,3,17,10],[12,3,12,10],[21,3,21,10],[26,3,26,10]]}
[null,null,null,null,null,null,null,null,null,null,null,"Y","Express",null,"Express"]
[null,null,null,null,null,null,null,null,null,null,null,"N"]
[]
[]
[]
[]
[]
[]
[]
[]
[]
[null,null,null,"Road Bridges","Road Tunnels","Transit/Rail Station","Transit/Rail Bridges","Transit/Rail Tunnels","Admin & Support Facilities","Ferry","Fleet"]
[null,null,"THREATS"]
[null,null,{"$f":"'CM Dictionary'!C22","v":"Small Explosives"},"Y","Y","Y","Y","Y","Y","Y","Y"]
[null,null,{"$f":"'CM Dictionary'!C23","v":"Large Explosives"},"Y","Y","Y","Y","Y","Y","Y","Y"]
[null,null,{"$f":"'CM Dictionary'!C24","v":"Chemical / Biological / Radiological "},"Y","Y","Y","Y","Y","Y","Y","Y"]
[null,null,{"$f":"'CM Dictionary'!C25","v":"Criminal Acts"},"Y","Y","Y","Y","Y","Y","Y","Y"]
[null,null,"UNINTENTIONAL HAZARDS"]
[null,null,{"$f":"'CM Dictionary'!C26","v":"Fire"},"Y","Y","Y","Y","Y","Y","Y","Y"]
[null,null,{"$f":"'CM Dictionary'!C27","v":"Impact Collision / Deterioration"},"Y","Y","Y","Y","Y","Y","Y","Y"]
[null,null,{"$f":"'CM Dictionary'!C28","v":"HAZMAT"},"Y","Y","Y","Y","Y","Y","Y","Y"]
[null,null,"NATURAL HAZARDS"]
[null,null,{"$f":"'CM Dictionary'!C29","v":"Flood"},"Y","Y","Y","Y","Y","Y","Y","Y"]
[null,null,{"$f":"'CM Dictionary'!C30","v":"Earthquake"},"Y","Y","Y","Y","Y","Y","Y","Y"]
[null,null,{"$f":"'CM Dictionary'!C31","v":"Extreme Weather"},"Y","Y","Y","Y","Y","Y","Y","Y"]
[null,null,{"$f":"'CM Dictionary'!C32","v":"Mud/Landslide"},"Y","Y","Y","Y","Y","Y","Y","Y"]
[null,null,"ADDITIONAL"]
[null,null,"New hazard 1","N","N","N","N","N","N","N","N"]
[null,null,"New hazard 2","N","N","N","N","N","N","N","N"]

{"sheet":"Threat-Haz Vulnerability","index":2,"n_rows":29,"n_cols":82,"rows_kept":29,"cut":false,"hidden":false,"merged":[[14,1,14,4],[14,9,14,12],[14,13,14,16],[14,21,14,24],[14,5,14,8],[14,17,14,20],[14,25,14,28],[14,29,14,32],[14,38,14,41],[14,42,14,45],[14,62,14,65],[14,66,14,69],[14,46,14,49],[14,50,14,53],[14,54,14,57],[14,58,14,61]]}
[]
[]
[]
[]
[null,null,null,null,null,null,null,null,null,null,null,null,null,null,null,null,null,null,null,null,null,null,null,null,null,null,null,null,null,null,null,null,null,null,null,null,null,null,null,null,null,null,null,null,null,null,null,null,null,null,null,null,null,null,null,null,null,null,null,null,null,null,null,null,null,null,null,null,null,null,null,null,null,null,"X"]
[]
[]
[]
[]
[]
[]
[]
[]
[]
[null,"Road Bridges",null,null,null,"Road Tunnels",null,null,null,"Transit/Rail Station",null,null,null,"Transit/Rail Bridges",null,null,null,"Transit/Rail Tunnels",null,null,null,"Admin & Support Facilities",null,null,null,"Ferry",null,null,null,"Fleet",null,null,null,null,null,null,null,null,"Road Bridges",null,null,null,"Road Tunnels",null,null,null,"Transit/Rail Station",null,null,null,"Transit/Rail Bridges",null,null,null,"Transit/Rail Tunnels",null,null,null,"Admin & Support Facilities",null,null,null,"Ferry",null,null,null,"Fleet",null,null,null,null,null,null,null,null,null,null,null,null,null,null,"X"]
[null,"Potentially Exposed Population","Property Loss","Mission Importance","Manual Override","Potentially Exposed Population","Property Loss","Mission Importance","Manual Override","Potentially Exposed Population","Property Loss","Mission Importance","Manual Override","Potentially Exposed Population","Property Loss","Mission Importance","Manual Override","Potentially Exposed Population","Property Loss","Mission Importance","Manual Override","Potentially Exposed Population","Property Loss","Mission Importance","Manual Override","Potentially Exposed Population","Property Loss","Mission Importance","Manual Override","Potentially Exposed Population","Property Loss","Mission Importance","Manual Override",null,null,null,null,null,"Exposure","Property","Mission","Manual Override","Exposure","Property","Mission","Manual Override","Exposure","Property","Mission","Manual Override","Exposure","Property","Mission","Manual Override","Exposure","Property","Mission","Manual Override","Exposure","Property","Mission","Manual Override","Exposure","Property","Mission","Manual Override","Exposure","Property","Mission","Manual Override"]
[{"$f":"'CM Dictionary'!C22","v":"Small Explosives"},"X",null,null,"X","X",null,null,"X","X",null,null,"X","X",null,null,"X","X",null,null,"X","X",null,null,"X","X",null,null,"X","X",null,null,"X",null,null,null,null,null,"X",null,null,"X","X",null,null,"X","X",null,null,"X","X",null,null,"X","X",null,null,"X","X",null,null,"X","X",null,null,"X","X",null,null,"X"]
[{"$f":"'CM Dictionary'!C23","v":"Large Explosives"},"X","X","X","X","X","X","X","X","X","X","X","X","X","X","X","X","X","X","X","X","X","X","X","X","X","X","X","X","X","X","X","X",null,null,null,null,null,"X","X","X","X","X","X","X","X","X","X","X","X","X","X","X","X","X","X","X","X","X","X","X","X","X","X","X","X","X","X","X","X"]
[{"$f":"'CM Dictionary'!C24","v":"Chemical / Biological / Radiological "},"X","X","X","X","X","X","X","X","X","X","X","X","X","X","X","X","X","X","X","X","X","X","X","X","X","X","X","X","X","X","X","X",null,null,null,null,null,"X","X","X","X","X","X","X","X","X","X","X","X","X","X","X","X","X","X","X","X","X","X","X","X","X","X","X","X","X","X","X","X"]
[{"$f":"'CM Dictionary'!C25","v":"Criminal Acts"},null,null,null,"X",null,null,null,"X",null,null,null,"X",null,null,null,"X",null,null,null,"X",null,null,null,"X",null,null,null,"X",null,null,null,"X",null,null,null,null,null,null,null,null,"X",null,null,null,"X",null,null,null,"X",null,null,null,"X",null,null,null,"X",null,null,null,"X",null,null,null,"X",null,null,null,"X"]
[{"$f":"'CM Dictionary'!C26","v":"Fire"},"X","X","X","X","X","X","X","X","X","X","X","X","X","X","X","X","X","X","X","X","X","X","X","X","X","X","X","X","X",null,"X","X",null,null,null,null,null,"X","X","X","X","X","X","X","X","X","X","X","X","X","X","X","X","X","X","X","X","X","X","X","X","X","X","X","X","X",null,"X","X"]
[{"$f":"'CM Dictionary'!C27","v":"Impact Collision / Deterioration"},"X","X","X","X","X","X","X","X","X","X","X","X","X","X","X","X","X","X","X","X","X","X","X","X","X","X","X","X",null,null,null,"X",null,null,null,null,null,"X","X","X","X","X","X","X","X","X","X","X","X","X","X","X","X","X","X","X","X","X","X","X","X","X","X","X","X",null,null,null,"X"]
[{"$f":"'CM Dictionary'!C28","v":"HAZMAT"},null,null,"X","X",null,null,"X","X",null,null,"X","X",null,null,"X","X",null,null,"X","X",null,null,"X","X","X","X",null,"X","X","X","X","X",null,null,null,null,null,null,null,"X","X",null,null,"X","X",null,null,"X","X",null,null,"X","X",null,null,"X","X",null,null,"X","X","X","X",null,"X","X","X","X","X"]
[{"$f":"'CM Dictionary'!C29","v":"Flood"},"X","X","X","X","X","X","X","X","X","X","X","X","X","X","X","X","X","X","X","X",null,null,null,"X",null,null,null,"X","X","X","X","X",null,null,null,null,null,"X","X","X","X","X","X","X","X","X","X","X","X","X","X","X","X","X","X","X","X",null,null,null,"X",null,null,null,"X","X","X","X","X"]
[{"$f":"'CM Dictionary'!C30","v":"Earthquake"},"X","X","X","X","X","X","X","X",null,null,null,"X",null,null,null,"X",null,null,null,"X",null,null,null,"X",null,null,null,"X","X","X","X","X",null,null,null,null,null,"X","X","X","X","X","X","X","X",null,null,null,"X",null,null,null,"X",null,null,null,"X",null,null,null,"X",null,null,null,"X","X","X","X","X"]
[{"$f":"'CM Dictionary'!C31","v":"Extreme Weather"},null,"X","X","X",null,"X","X","X",null,"X","X","X",null,"X","X","X",null,"X","X","X","X","X","X","X","X","X","X","X",null,"X","X","X",null,null,null,null,null,null,"X","X","X",null,"X","X","X",null,"X","X","X",null,"X","X","X",null,"X","X","X","X","X","X","X","X","X","X","X",null,"X","X","X"]
[{"$f":"'CM Dictionary'!C32","v":"Mud/Landslide"},null,"X","X","X",null,"X","X","X",null,null,null,"X",null,null,null,"X",null,null,null,"X",null,null,null,"X",null,null,null,"X","X","X","X","X",null,null,null,null,null,null,"X","X","X",null,"X","X","X",null,null,null,"X",null,null,null,"X",null,null,null,"X",null,null,null,"X",null,null,null,"X","X","X","X","X"]
[{"$f":"'Relevant Risks'!C28","v":"New hazard 1"},"X","X","X","X","X","X","X","X","X","X","X","X","X","X","X","X","X","X","X","X","X","X","X","X","X","X","X","X","X","X","X","X",null,null,null,null,null,"X","X","X","X","X","X","X","X","X","X","X","X","X","X","X","X","X","X","X","X","X","X","X","X","X","X","X","X","X","X","X","X"]
[{"$f":"'Relevant Risks'!C29","v":"New hazard 2"},"X","X","X","X","X","X","X","X","X","X","X","X","X","X","X","X","X","X","X","X","X","X","X","X","X","X","X","X","X","X","X","X",null,null,null,null,null,"X","X","X","X","X","X","X","X","X","X","X","X","X","X","X","X","X","X","X","X","X","X","X","X","X","X","X","X","X","X","X","X"]

{"sheet":"Thresholds","index":3,"n_rows":46,"n_cols":5,"rows_kept":46,"cut":false,"hidden":false,"merged":[[15,3,17,3],[15,4,17,4]]}
[]
[]
[]
[]
[]
[]
[]
[]
[]
[]
[null,"Category","Critical Threshold",null,"Explanation"]
["ROAD BRIDGE ","Potentially Exposed Population",302,null,"Potentially exposed population threshold"]
[null,"Property Loss",1007196726,null,"Replacement cost"]
[null,"Mission Importance","Level III",null,"Demand percentile for ADT * Detour Length"]
[]
[null,"          Level I",29000,null,"The default threshold values for ADT * detour length are taken from the 75th, 85th, and 95th percentiles for the U.S.  If these are inappropriate for your state, enter different values in the appropriate fields to the left."]
[null,"          Level II",68000]
[null,"          Level III",241000]
[]
["ROAD TUNNEL","Potentially Exposed Population",302,null,"Potentially exposed population threshold"]
[null,"Property Loss",1007196726,null,"Replacement cost"]
[null,"Mission Importance","Yes",null,"Do you consider all road tunnels to be mission critical?"]
[]
["TRANSIT/RAIL ","Potentially Exposed Population",302,null,"Potentially exposed population threshold"]
["STATION","Property Loss","Yes",null,"Do you consider below-ground stations to be property critical?"]
[null,"Mission Importance","Yes",null,"Do you consider all transfer stations to be mission critical?"]
[]
["TRANSIT/RAIL ","Potentially Exposed Population",302,null,"Potentially exposed population threshold"]
["BRIDGE","Property Loss",503600863,null,"Replacement cost"]
[null,"Mission Importance",50,null,"What % of ridership does a bridge need to serve in order to be mission critical?"]
[]
["TRANSIT/RAIL ","Potentially Exposed Population",302,null,"Potentially exposed population threshold"]
["TUNNEL","Property Loss",503600863,null,"Replacement cost"]
[null,"Mission Importance",50,null,"What % of ridership does a tunnel need to serve in order to be mission critical?"]
[]
["ADMIN & SUPPORT","Potentially Exposed Population",303,null,"Potentially exposed population threshold"]
["FACILITIES","Property Loss",111111111,null,"Replacement cost"]
[null,"Mission Importance","No",null,"Do you consider all administrative and support facilities to be mission critical?"]
[]
["FERRY BOATS","Potentially Exposed Population",302,null,"Potentially exposed population threshold"]
[null,"Property Loss",100724172,null,"Replacement cost"]
[null,"Mission Importance","No",null,"Do you consider all ferry boats to be mission critical?"]
[]
["TRANSIT FLEETS","Potentially Exposed Population",302,null,"Potentially exposed population threshold"]
[null,"Property Loss",100724172,null,"Replacement cost"]
[null,"Mission Importance","No",null,"Do you consider all transit fleets to be mission critical?"]

{"sheet":"Road Bridge","index":4,"n_rows":1300,"n_cols":19,"rows_kept":1300,"cut":false,"hidden":false,"merged":[[18,0,18,8],[18,11,18,14],[0,11,0,15],[1,11,1,14],[2,11,2,14],[3,11,3,14],[4,10,4,13],[5,10,5,13]]}
[null,null,null,null,null,null,null,null,null,null,null,"Specified Thresholds",null,null,null,null,null,null,"Yes"]
[null,null,null,null,null,null,null,null,null,null,null,"Potentially Exposed Population",null,null,null,{"$f":"Thresholds!C12","v":302},null,null,"No"]
[null,null,null,null,null,null,null,null,null,null,null,"Property Loss",null,null,null,{"$f":"Thresholds!C13","v":1007196726}]
[null,null,null,null,null,null,null,null,null,null,null,"Mission Importance",null,null,"Mission",{"$f":"Thresholds!C14","v":"Level III"},null,null,"Steel"]
[null,null,null,null,null,null,null,null,null,null,null,null,null,null,null,null,null,null,"Concrete"]
[null,null,null,null,null,null,null,null,null,null,null,null,null,null,null,null,null,null,"Other"]
[]
[]
[]
[]
[]
[]
[]
[]
[]
[]
[]
[]
["ROAD BRIDGES",null,null,null,null,null,null,null,null,null,null,"CRITICALITY"]
["Asset ID","Quantity","ADT","Length (ft)","Lanes","Detour (mi)",null,"Replacement Cost Per Asset (Optional)","Comments","Manually mark as critical?",null,"Potentially Exposed Population","Property Loss","Mission Importance","Manual Override"]
["George's Island",1,2600,732,2,100,null,null,null,"No",null,null,null,"Y"]
["High Rise",null,71000,4825,4,10,null,null,null,"No",null,null,null,"Y"]
["Blue River Bridge",null,30000,23200,4,19,null,null,null,"No",null,"Y",null,"Y"]
["State Line Bridge",null,37000,4680,6,18,null,50000000,null,"No",null,"Y",null,"Y"]
["Veteran's Bridge",null,15000,4767,8,16,null,null,null,"No",null,"Y"]
["Interstate Bridge",null,109000,4185,6,10,null,null,null,"No",null,null,null,"Y"]
["Morris Bridge",null,7600,9989,2,80,null,null,null,"No",null,null,null,"Y"]
["Route 500 River Bridge",null,13000,1483,2,74,null,null,null,"No",null,null,null,"Y"]
["Metropolitan Bridge",null,14000,3545,4,52,null,null,null,"No",null,null,null,"Y"]
["Point Park Bridge",null,34000,2187,4,10,null,null,null,"No",null,null,null,"Y"]
["Rt 17  Bridge",null,31000,2035,4,10,null,null,null,"No",null,null,null,"Y"]
["Military Highway Bridge",null,32000,882,4,10,null,null,null,"No",null,null,null,"Y"]
["Rt 71 Bridge",null,19000,4102,2,20,null,null,null,"No",null,null,null,"Y"]
["Boulavard Bridge",null,35000,1755,6,10,null,null,null,"No",null,null,null,"Y"]
["Business Route Bridge",null,30000,132,2,10,null,null,null,"No",null,null,null,"Y"]
["Kings Point Bridge",null,6700,2050,2,10,null,null,null,"No"]
["Memorial Bridge",null,20000,1000,2,129,null,null,null,"No",null,null,null,"Y"]
["New River Bridge",null,26550,1800,4,186,null,null,null,"No",null,null,null,"Y"]
["Old River Bridge",null,41826,1658,4,12,null,null,null,"No",null,null,null,"Y"]
["Lazy River Bridge",null,117600,1298,6,10,null,null,null,"No",null,null,null,"Y"]
["Muddy River Bridge",null,43100,1416,4,10,null,null,null,"No",null,null,null,"Y"]
["Crooked River Bridge",null,78800,678,4,10,null,null,null,"No",null,null,null,"Y"]
["Beltway Interstate Bridge",null,207290,185,12,10,null,null,null,"No",null,null,null,"Y"]
["Big River InterstateBridge",null,139800,1000,12,10,null,null,null,"No",null,null,null,"Y"]
["Big River InterstateBridge",null,139800,1000,12,10,null,null,null,"No",null,null,null,"Y"]
["Interstate Highway Ramp",null,210000,1000,4,10,null,null,null,"No",null,null,null,"Y"]
[null,null,null,null,null,null,null,null,null,"No"]
[null,null,null,null,null,null,null,null,null,"No"]
[null,null,null,null,null,null,null,null,null,"No"]
[null,null,null,null,null,null,null,null,null,"No"]
[null,null,null,null,null,null,null,null,null,"No"]
[null,null,null,null,null,null,null,null,null,"No"]
[null,null,null,null,null,null,null,null,null,"No"]
[null,null,null,null,null,null,null,null,null,"No"]
[null,null,null,null,null,null,null,null,null,"No"]
[null,null,null,null,null,null,null,null,null,"No"]
[null,null,null,null,null,null,null,null,null,"No"]
[null,null,null,null,null,null,null,null,null,"No"]
[null,null,null,null,null,null,null,null,null,"No"]
[null,null,null,null,null,null,null,null,null,"No"]
[null,null,null,null,null,null,null,null,null,"No"]
[null,null,null,null,null,null,null,null,null,"No"]
[null,null,null,null,null,null,null,null,null,"No"]
[null,null,null,null,null,null,null,null,null,"No"]
[null,null,null,null,null,null,null,null,null,"No"]
[null,null,null,null,null,null,null,null,null,"No"]
[null,null,null,null,null,null,null,null,null,"No"]
[null,null,null,null,null,null,null,null,null,"No"]
[null,null,null,null,null,null,null,null,null,"No"]
[null,null,null,null,null,null,null,null,null,"No"]
[null,null,null,null,null,null,null,null,null,"No"]
[null,null,null,null,null,null,null,null,null,"No"]
[null,null,null,null,null,null,null,null,null,"No"]
[null,null,null,null,null,null,null,null,null,"No"]
[null,null,null,null,null,null,null,null,null,"No"]
[null,null,null,null,null,null,null,null,null,"No"]
[null,null,null,null,null,null,null,null,null,"No"]
[null,null,null,null,null,null,null,null,null,"No"]
[null,null,null,null,null,null,null,null,null,"No"]
[null,null,null,null,null,null,null,null,null,"No"]
[null,null,null,null,null,null,null,null,null,"No"]
[null,null,null,null,null,null,null,null,null,"No"]
[null,null,null,null,null,null,null,null,null,"No"]
[null,null,null,null,null,null,null,null,null,"No"]
[null,null,null,null,null,null,null,null,null,"No"]
[null,null,null,null,null,null,null,null,null,"No"]
[null,null,null,null,null,null,null,null,null,"No"]
[null,null,null,null,null,null,null,null,null,"No"]
[null,null,null,null,null,null,null,null,null,"No"]
[null,null,null,null,null,null,null,null,null,"No"]
[null,null,null,null,null,null,null,null,null,"No"]
[null,null,null,null,null,null,null,null,null,"No"]
[null,null,null,null,null,null,null,null,null,"No"]
[null,null,null,null,null,null,null,null,null,"No"]
[null,null,null,null,null,null,null,null,null,"No"]
[null,null,null,null,null,null,null,null,null,"No"]
[null,null,null,null,null,null,null,null,null,"No"]
[null,null,null,null,null,null,null,null,null,"No"]
[null,null,null,null,null,null,null,null,null,"No"]
[null,null,null,null,null,null,null,null,null,"No"]
[null,null,null,null,null,null,null,null,null,"No"]
[null,null,null,null,null,null,null,null,null,"No"]
[null,null,null,null,null,null,null,null,null,"No"]
[null,null,null,null,null,null,null,null,null,"No"]
[null,null,null,null,null,null,null,null,null,"No"]
[null,null,null,null,null,null,null,null,null,"No"]
[null,null,null,null,null,null,null,null,null,"No"]
[null,null,null,null,null,null,null,null,null,"No"]
[null,null,null,null,null,null,null,null,null,"No"]
[null,null,null,null,null,null,null,null,null,"No"]
[null,null,null,null,null,null,null,null,null,"No"]
[null,null,null,null,null,null,null,null,null,"No"]
[null,null,null,null,null,null,null,null,null,"No"]
[null,null,null,null,null,null,null,null,null,"No"]
[null,null,null,null,null,null,null,null,null,"No"]
[null,null,null,null,null,null,null,null,null,"No"]
[null,null,null,null,null,null,null,null,null,"No"]
[null,null,null,null,null,null,null,null,null,"No"]
[null,null,null,null,null,null,null,null,null,"No"]
[null,null,null,null,null,null,null,null,null,"No"]
[null,null,null,null,null,null,null,null,null,"No"]
[null,null,null,null,null,null,null,null,null,"No"]
[null,null,null,null,null,null,null,null,null,"No"]
[null,null,null,null,null,null,null,null,null,"No"]
[null,null,null,null,null,null,null,null,null,"No"]
[null,null,null,null,null,null,null,null,null,"No"]
[null,null,null,null,null,null,null,null,null,"No"]
[null,null,null,null,null,null,null,null,null,"No"]
[null,null,null,null,null,null,null,null,null,"No"]
[null,null,null,null,null,null,null,null,null,"No"]
[null,null,null,null,null,null,null,null,null,"No"]
[null,null,null,null,null,null,null,null,null,"No"]
[null,null,null,null,null,null,null,null,null,"No"]
[null,null,null,null,null,null,null,null,null,"No"]
[null,null,null,null,null,null,null,null,null,"No"]
[null,null,null,null,null,null,null,null,null,"No"]
[null,null,null,null,null,null,null,null,null,"No"]
[null,null,null,null,null,null,null,null,null,"No"]
[null,null,null,null,null,null,null,null,null,"No"]
[null,null,null,null,null,null,null,null,null,"No"]
[null,null,null,null,null,null,null,null,null,"No"]
[null,null,null,null,null,null,null,null,null,"No"]
[null,null,null,null,null,null,null,null,null,"No"]
[null,null,null,null,null,null,null,null,null,"No"]
[null,null,null,null,null,null,null,null,null,"No"]
[null,null,null,null,null,null,null,null,null,"No"]
[null,null,null,null,null,null,null,null,null,"No"]
[null,null,null,null,null,null,null,null,null,"No"]
[null,null,null,null,null,null,null,null,null,"No"]
[null,null,null,null,null,null,null,null,null,"No"]
[null,null,null,null,null,null,null,null,null,"No"]
[null,null,null,null,null,null,null,null,null,"No"]
[null,null,null,null,null,null,null,null,null,"No"]
[null,null,null,null,null,null,null,null,null,"No"]
[null,null,null,null,null,null,null,null,null,"No"]
[null,null,null,null,null,null,null,null,null,"No"]
[null,null,null,null,null,null,null,null,null,"No"]
[null,null,null,null,null,null,null,null,null,"No"]
[null,null,null,null,null,null,null,null,null,"No"]
[null,null,null,null,null,null,null,null,null,"No"]
[null,null,null,null,null,null,null,null,null,"No"]
[null,null,null,null,null,null,null,null,null,"No"]
[null,null,null,null,null,null,null,null,null,"No"]
[null,null,null,null,null,null,null,null,null,"No"]
[null,null,null,null,null,null,null,null,null,"No"]
[null,null,null,null,null,null,null,null,null,"No"]
[null,null,null,null,null,null,null,null,null,"No"]
[null,null,null,null,null,null,null,null,null,"No"]
[null,null,null,null,null,null,null,null,null,"No"]
[null,null,null,null,null,null,null,null,null,"No"]
[null,null,null,null,null,null,null,null,null,"No"]
[null,null,null,null,null,null,null,null,null,"No"]
[null,null,null,null,null,null,null,null,null,"No"]
[null,null,null,null,null,null,null,null,null,"No"]
[null,null,null,null,null,null,null,null,null,"No"]
[null,null,null,null,null,null,null,null,null,"No"]
[null,null,null,null,null,null,null,null,null,"No"]
[null,null,null,null,null,null,null,null,null,"No"]
[null,null,null,null,null,null,null,null,null,"No"]
[null,null,null,null,null,null,null,null,null,"No"]
[null,null,null,null,null,null,null,null,null,"No"]
[null,null,null,null,null,null,null,null,null,"No"]
[null,null,null,null,null,null,null,null,null,"No"]
[null,null,null,null,null,null,null,null,null,"No"]
[null,null,null,null,null,null,null,null,null,"No"]
[null,null,null,null,null,null,null,null,null,"No"]
[null,null,null,null,null,null,null,null,null,"No"]
[null,null,null,null,null,null,null,null,null,"No"]
[null,null,null,null,null,null,null,null,null,"No"]
[null,null,null,null,null,null,null,null,null,"No"]
[null,null,null,null,null,null,null,null,null,"No"]
[null,null,null,null,null,null,null,null,null,"No"]
[null,null,null,null,null,null,null,null,null,"No"]
[null,null,null,null,null,null,null,null,null,"No"]
[null,null,null,null,null,null,null,null,null,"No"]
[null,null,null,null,null,null,null,null,null,"No"]
[null,null,null,null,null,null,null,null,null,"No"]
[null,null,null,null,null,null,null,null,null,"No"]
[null,null,null,null,null,null,null,null,null,"No"]
[null,null,null,null,null,null,null,null,null,"No"]
[null,null,null,null,null,null,null,null,null,"No"]
[null,null,null,null,null,null,null,null,null,"No"]
[null,null,null,null,null,null,null,null,null,"No"]
[null,null,null,null,null,null,null,null,null,"No"]
[null,null,null,null,null,null,null,null,null,"No"]
[null,null,null,null,null,null,null,null,null,"No"]
[null,null,null,null,null,null,null,null,null,"No"]
[null,null,null,null,null,null,null,null,null,"No"]
[null,null,null,null,null,null,null,null,null,"No"]
[null,null,null,null,null,null,null,null,null,"No"]
[null,null,null,null,null,null,null,null,null,"No"]
[null,null,null,null,null,null,null,null,null,"No"]
[null,null,null,null,null,null,null,null,null,"No"]
[null,null,null,null,null,null,null,null,null,"No"]
[null,null,null,null,null,null,null,null,null,"No"]
[null,null,null,null,null,null,null,null,null,"No"]
[null,null,null,null,null,null,null,null,null,"No"]
[null,null,null,null,null,null,null,null,null,"No"]
[null,null,null,null,null,null,null,null,null,"No"]
[null,null,null,null,null,null,null,null,null,"No"]
[null,null,null,null,null,null,null,null,null,"No"]
[null,null,null,null,null,null,null,null,null,"No"]
[null,null,null,null,null,null,null,null,null,"No"]
[null,null,null,null,null,null,null,null,null,"No"]
[null,null,null,null,null,null,null,null,null,"No"]
[null,null,null,null,null,null,null,null,null,"No"]
[null,null,null,null,null,null,null,null,null,"No"]
[null,null,null,null,null,null,null,null,null,"No"]
[null,null,null,null,null,null,null,null,null,"No"]
[null,null,null,null,null,null,null,null,null,"No"]
[null,null,null,null,null,null,null,null,null,"No"]
[null,null,null,null,null,null,null,null,null,"No"]
[null,null,null,null,null,null,null,null,null,"No"]
[null,null,null,null,null,null,null,null,null,"No"]
[null,null,null,null,null,null,null,null,null,"No"]
[null,null,null,null,null,null,null,null,null,"No"]
[null,null,null,null,null,null,null,null,null,"No"]
[null,null,null,null,null,null,null,null,null,"No"]
[null,null,null,null,null,null,null,null,null,"No"]
[null,null,null,null,null,null,null,null,null,"No"]
[null,null,null,null,null,null,null,null,null,"No"]
[null,null,null,null,null,null,null,null,null,"No"]
[null,null,null,null,null,null,null,null,null,"No"]
[null,null,null,null,null,null,null,null,null,"No"]
[null,null,null,null,null,null,null,null,null,"No"]
[null,null,null,null,null,null,null,null,null,"No"]
[null,null,null,null,null,null,null,null,null,"No"]
[null,null,null,null,null,null,null,null,null,"No"]
[null,null,null,null,null,null,null,null,null,"No"]
[null,null,null,null,null,null,null,null,null,"No"]
[null,null,null,null,null,null,null,null,null,"No"]
[null,null,null,null,null,null,null,null,null,"No"]
[null,null,null,null,null,null,null,null,null,"No"]
[null,null,null,null,null,null,null,null,null,"No"]
[null,null,null,null,null,null,null,null,null,"No"]
[null,null,null,null,null,null,null,null,null,"No"]
[null,null,null,null,null,null,null,null,null,"No"]
[null,null,null,null,null,null,null,null,null,"No"]
[null,null,null,null,null,null,null,null,null,"No"]
[null,null,null,null,null,null,null,null,null,"No"]
[null,null,null,null,null,null,null,null,null,"No"]
[null,null,null,null,null,null,null,null,null,"No"]
[null,null,null,null,null,null,null,null,null,"No"]
[null,null,null,null,null,null,null,null,null,"No"]
[null,null,null,null,null,null,null,null,null,"No"]
[null,null,null,null,null,null,null,null,null,"No"]
[null,null,null,null,null,null,null,null,null,"No"]
[null,null,null,null,null,null,null,null,null,"No"]
[null,null,null,null,null,null,null,null,null,"No"]
[null,null,null,null,null,null,null,null,null,"No"]
[null,null,null,null,null,null,null,null,null,"No"]
[null,null,null,null,null,null,null,null,null,"No"]
[null,null,null,null,null,null,null,null,null,"No"]
[null,null,null,null,null,null,null,null,null,"No"]
[null,null,null,null,null,null,null,null,null,"No"]
[null,null,null,null,null,null,null,null,null,"No"]
[null,null,null,null,null,null,null,null,null,"No"]
[null,null,null,null,null,null,null,null,null,"No"]
[null,null,null,null,null,null,null,null,null,"No"]
[null,null,null,null,null,null,null,null,null,"No"]
[null,null,null,null,null,null,null,null,null,"No"]
[null,null,null,null,null,null,null,null,null,"No"]
[null,null,null,null,null,null,null,null,null,"No"]
[null,null,null,null,null,null,null,null,null,"No"]
[null,null,null,null,null,null,null,null,null,"No"]
[null,null,null,null,null,null,null,null,null,"No"]
[null,null,null,null,null,null,null,null,null,"No"]
[null,null,null,null,null,null,null,null,null,"No"]
[null,null,null,null,null,null,null,null,null,"No"]
[null,null,null,null,null,null,null,null,null,"No"]
[null,null,null,null,null,null,null,null,null,"No"]
[null,null,null,null,null,null,null,null,null,"No"]
[null,null,null,null,null,null,null,null,null,"No"]
[null,null,null,null,null,null,null,null,null,"No"]
[null,null,null,null,null,null,null,null,null,"No"]
[null,null,null,null,null,null,null,null,null,"No"]
[null,null,null,null,null,null,null,null,null,"No"]
[null,null,null,null,null,null,null,null,null,"No"]
[null,null,null,null,null,null,null,null,null,"No"]
[null,null,null,null,null,null,null,null,null,"No"]
[null,null,null,null,null,null,null,null,null,"No"]
[null,null,null,null,null,null,null,null,null,"No"]
[null,null,null,null,null,null,null,null,null,"No"]
[null,null,null,null,null,null,null,null,null,"No"]
[null,null,null,null,null,null,null,null,null,"No"]
[null,null,null,null,null,null,null,null,null,"No"]
[null,null,null,null,null,null,null,null,null,"No"]
[null,null,null,null,null,null,null,null,null,"No"]
[null,null,null,null,null,null,null,null,null,"No"]
[null,null,null,null,null,null,null,null,null,"No"]
[null,null,null,null,null,null,null,null,null,"No"]
[null,null,null,null,null,null,null,null,null,"No"]
[null,null,null,null,null,null,null,null,null,"No"]
[null,null,null,null,null,null,null,null,null,"No"]
[null,null,null,null,null,null,null,null,null,"No"]
[null,null,null,null,null,null,null,null,null,"No"]
[null,null,null,null,null,null,null,null,null,"No"]
[null,null,null,null,null,null,null,null,null,"No"]
[null,null,null,null,null,null,null,null,null,"No"]
[null,null,null,null,null,null,null,null,null,"No"]
[null,null,null,null,null,null,null,null,null,"No"]
[null,null,null,null,null,null,null,null,null,"No"]
[null,null,null,null,null,null,null,null,null,"No"]
[null,null,null,null,null,null,null,null,null,"No"]
[null,null,null,null,null,null,null,null,null,"No"]
[null,null,null,null,null,null,null,null,null,"No"]
[null,null,null,null,null,null,null,null,null,"No"]
[null,null,null,null,null,null,null,null,null,"No"]
[null,null,null,null,null,null,null,null,null,"No"]
[null,null,null,null,null,null,null,null,null,"No"]
[null,null,null,null,null,null,null,null,null,"No"]
[null,null,null,null,null,null,null,null,null,"No"]
[null,null,null,null,null,null,null,null,null,"No"]
[null,null,null,null,null,null,null,null,null,"No"]
[null,null,null,null,null,null,null,null,null,"No"]
[null,null,null,null,null,null,null,null,null,"No"]
[null,null,null,null,null,null,null,null,null,"No"]
[null,null,null,null,null,null,null,null,null,"No"]
[null,null,null,null,null,null,null,null,null,"No"]
[null,null,null,null,null,null,null,null,null,"No"]
[null,null,null,null,null,null,null,null,null,"No"]
[null,null,null,null,null,null,null,null,null,"No"]
[null,null,null,null,null,null,null,null,null,"No"]
[null,null,null,null,null,null,null,null,null,"No"]
[null,null,null,null,null,null,null,null,null,"No"]
[null,null,null,null,null,null,null,null,null,"No"]
[null,null,null,null,null,null,null,null,null,"No"]
[null,null,null,null,null,null,null,null,null,"No"]
[null,null,null,null,null,null,null,null,null,"No"]
[null,null,null,null,null,null,null,null,null,"No"]
[null,null,null,null,null,null,null,null,null,"No"]
[null,null,null,null,null,null,null,null,null,"No"]
[null,null,null,null,null,null,null,null,null,"No"]
[null,null,null,null,null,null,null,null,null,"No"]
[null,null,null,null,null,null,null,null,null,"No"]
[null,null,null,null,null,null,null,null,null,"No"]
[null,null,null,null,null,null,null,null,null,"No"]
[null,null,null,null,null,null,null,null,null,"No"]
[null,null,null,null,null,null,null,null,null,"No"]
[null,null,null,null,null,null,null,null,null,"No"]
[null,null,null,null,null,null,null,null,null,"No"]
[null,null,null,null,null,null,null,null,null,"No"]
[null,null,null,null,null,null,null,null,null,"No"]
[null,null,null,null,null,null,null,null,null,"No"]
[null,null,null,null,null,null,null,null,null,"No"]
[null,null,null,null,null,null,null,null,null,"No"]
[null,null,null,null,null,null,null,null,null,"No"]
[null,null,null,null,null,null,null,null,null,"No"]
[null,null,null,null,null,null,null,null,null,"No"]
[null,null,null,null,null,null,null,null,null,"No"]
[null,null,null,null,null,null,null,null,null,"No"]
[null,null,null,null,null,null,null,null,null,"No"]
[null,null,null,null,null,null,null,null,null,"No"]
[null,null,null,null,null,null,null,null,null,"No"]
[null,null,null,null,null,null,null,null,null,"No"]
[null,null,null,null,null,null,null,null,null,"No"]
[null,null,null,null,null,null,null,null,null,"No"]
[null,null,null,null,null,null,null,null,null,"No"]
[null,null,null,null,null,null,null,null,null,"No"]
[null,null,null,null,null,null,null,null,null,"No"]
[null,null,null,null,null,null,null,null,null,"No"]
[null,null,null,null,null,null,null,null,null,"No"]
[null,null,null,null,null,null,null,null,null,"No"]
[null,null,null,null,null,null,null,null,null,"No"]
[null,null,null,null,null,null,null,null,null,"No"]
[null,null,null,null,null,null,null,null,null,"No"]
[null,null,null,null,null,null,null,null,null,"No"]
[null,null,null,null,null,null,null,null,null,"No"]
[null,null,null,null,null,null,null,null,null,"No"]
[null,null,null,null,null,null,null,null,null,"No"]
[null,null,null,null,null,null,null,null,null,"No"]
[null,null,null,null,null,null,null,null,null,"No"]
[null,null,null,null,null,null,null,null,null,"No"]
[null,null,null,null,null,null,null,null,null,"No"]
[null,null,null,null,null,null,null,null,null,"No"]
[null,null,null,null,null,null,null,null,null,"No"]
[null,null,null,null,null,null,null,null,null,"No"]
[null,null,null,null,null,null,null,null,null,"No"]
[null,null,null,null,null,null,null,null,null,"No"]
[null,null,null,null,null,null,null,null,null,"No"]
[null,null,null,null,null,null,null,null,null,"No"]
[null,null,null,null,null,null,null,null,null,"No"]
[null,null,null,null,null,null,null,null,null,"No"]
[null,null,null,null,null,null,null,null,null,"No"]
[null,null,null,null,null,null,null,null,null,"No"]
[null,null,null,null,null,null,null,null,null,"No"]
[null,null,null,null,null,null,null,null,null,"No"]
[null,null,null,null,null,null,null,null,null,"No"]
[null,null,null,null,null,null,null,null,null,"No"]
[null,null,null,null,null,null,null,null,null,"No"]
[null,null,null,null,null,null,null,null,null,"No"]
[null,null,null,null,null,null,null,null,null,"No"]
[null,null,null,null,null,null,null,null,null,"No"]
[null,null,null,null,null,null,null,null,null,"No"]
[null,null,null,null,null,null,null,null,null,"No"]
[null,null,null,null,null,null,null,null,null,"No"]
[null,null,null,null,null,null,null,null,null,"No"]
[null,null,null,null,null,null,null,null,null,"No"]
[null,null,null,null,null,null,null,null,null,"No"]
[null,null,null,null,null,null,null,null,null,"No"]
[null,null,null,null,null,null,null,null,null,"No"]
[null,null,null,null,null,null,null,null,null,"No"]
[null,null,null,null,null,null,null,null,null,"No"]
[null,null,null,null,null,null,null,null,null,"No"]
[null,null,null,null,null,null,null,null,null,"No"]
[null,null,null,null,null,null,null,null,null,"No"]
[null,null,null,null,null,null,null,null,null,"No"]
[null,null,null,null,null,null,null,null,null,"No"]
[null,null,null,null,null,null,null,null,null,"No"]
[null,null,null,null,null,null,null,null,null,"No"]
[null,null,null,null,null,null,null,null,null,"No"]
[null,null,null,null,null,null,null,null,null,"No"]
[null,null,null,null,null,null,null,null,null,"No"]
[null,null,null,null,null,null,null,null,null,"No"]
[null,null,null,null,null,null,null,null,null,"No"]
[null,null,null,null,null,null,null,null,null,"No"]
[null,null,null,null,null,null,null,null,null,"No"]
[null,null,null,null,null,null,null,null,null,"No"]
[null,null,null,null,null,null,null,null,null,"No"]
[null,null,null,null,null,null,null,null,null,"No"]
[null,null,null,null,null,null,null,null,null,"No"]
[null,null,null,null,null,null,null,null,null,"No"]
[null,null,null,null,null,null,null,null,null,"No"]
[null,null,null,null,null,null,null,null,null,"No"]
[null,null,null,null,null,null,null,null,null,"No"]
[null,null,null,null,null,null,null,null,null,"No"]
[null,null,null,null,null,null,null,null,null,"No"]
[null,null,null,null,null,null,null,null,null,"No"]
[null,null,null,null,null,null,null,null,null,"No"]
[null,null,null,null,null,null,null,null,null,"No"]
[null,null,null,null,null,null,null,null,null,"No"]
[null,null,null,null,null,null,null,null,null,"No"]
[null,null,null,null,null,null,null,null,null,"No"]
[null,null,null,null,null,null,null,null,null,"No"]
[null,null,null,null,null,null,null,null,null,"No"]
[null,null,null,null,null,null,null,null,null,"No"]
[null,null,null,null,null,null,null,null,null,"No"]
[null,null,null,null,null,null,null,null,null,"No"]
[null,null,null,null,null,null,null,null,null,"No"]
[null,null,null,null,null,null,null,null,null,"No"]
[null,null,null,null,null,null,null,null,null,"No"]
[null,null,null,null,null,null,null,null,null,"No"]
[null,null,null,null,null,null,null,null,null,"No"]
[null,null,null,null,null,null,null,null,null,"No"]
[null,null,null,null,null,null,null,null,null,"No"]
[null,null,null,null,null,null,null,null,null,"No"]
[null,null,null,null,null,null,null,null,null,"No"]
[null,null,null,null,null,null,null,null,null,"No"]
[null,null,null,null,null,null,null,null,null,"No"]
[null,null,null,null,null,null,null,null,null,"No"]
[null,null,null,null,null,null,null,null,null,"No"]
[null,null,null,null,null,null,null,null,null,"No"]
[null,null,null,null,null,null,null,null,null,"No"]
[null,null,null,null,null,null,null,null,null,"No"]
[null,null,null,null,null,null,null,null,null,"No"]
[null,null,null,null,null,null,null,null,null,"No"]
[null,null,null,null,null,null,null,null,null,"No"]
[null,null,null,null,null,null,null,null,null,"No"]
[null,null,null,null,null,null,null,null,null,"No"]
[null,null,null,null,null,null,null,null,null,"No"]
[null,null,null,null,null,null,null,null,null,"No"]
[null,null,null,null,null,null,null,null,null,"No"]
[null,null,null,null,null,null,null,null,null,"No"]
[null,null,null,null,null,null,null,null,null,"No"]
[null,null,null,null,null,null,null,null,null,"No"]
[null,null,null,null,null,null,null,null,null,"No"]
[null,null,null,null,null,null,null,null,null,"No"]
[null,null,null,null,null,null,null,null,null,"No"]
[null,null,null,null,null,null,null,null,null,"No"]
[null,null,null,null,null,null,null,null,null,"No"]
[null,null,null,null,null,null,null,null,null,"No"]
[null,null,null,null,null,null,null,null,null,"No"]
[null,null,null,null,null,null,null,null,null,"No"]
[null,null,null,null,null,null,null,null,null,"No"]
[null,null,null,null,null,null,null,null,null,"No"]
[null,null,null,null,null,null,null,null,null,"No"]
[null,null,null,null,null,null,null,null,null,"No"]
[null,null,null,null,null,null,null,null,null,"No"]
[null,null,null,null,null,null,null,null,null,"No"]
[null,null,null,null,null,null,null,null,null,"No"]
[null,null,null,null,null,null,null,null,null,"No"]
[null,null,null,null,null,null,null,null,null,"No"]
[null,null,null,null,null,null,null,null,null,"No"]
[null,null,null,null,null,null,null,null,null,"No"]
[null,null,null,null,null,null,null,null,null,"No"]
[null,null,null,null,null,null,null,null,null,"No"]
[null,null,null,null,null,null,null,null,null,"No"]
[null,null,null,null,null,null,null,null,null,"No"]
[null,null,null,null,null,null,null,null,null,"No"]
[null,null,null,null,null,null,null,null,null,"No"]
[null,null,null,null,null,null,null,null,null,"No"]
[null,null,null,null,null,null,null,null,null,"No"]
[null,null,null,null,null,null,null,null,null,"No"]
[null,null,null,null,null,null,null,null,null,"No"]
[null,null,null,null,null,null,null,null,null,"No"]
[null,null,null,null,null,null,null,null,null,"No"]
[null,null,null,null,null,null,null,null,null,"No"]
[null,null,null,null,null,null,null,null,null,"No"]
[null,null,null,null,null,null,null,null,null,"No"]
[null,null,null,null,null,null,null,null,null,"No"]
[null,null,null,null,null,null,null,null,null,"No"]
[null,null,null,null,null,null,null,null,null,"No"]
[null,null,null,null,null,null,null,null,null,"No"]
[null,null,null,null,null,null,null,null,null,"No"]
[null,null,null,null,null,null,null,null,null,"No"]
[null,null,null,null,null,null,null,null,null,"No"]
[null,null,null,null,null,null,null,null,null,"No"]
[null,null,null,null,null,null,null,null,null,"No"]
[null,null,null,null,null,null,null,null,null,"No"]
[null,null,null,null,null,null,null,null,null,"No"]
[null,null,null,null,null,null,null,null,null,"No"]
[null,null,null,null,null,null,null,null,null,"No"]
[null,null,null,null,null,null,null,null,null,"No"]
[null,null,null,null,null,null,null,null,null,"No"]
[null,null,null,null,null,null,null,null,null,"No"]
[null,null,null,null,null,null,null,null,null,"No"]
[null,null,null,null,null,null,null,null,null,"No"]
[null,null,null,null,null,null,null,null,null,"No"]
[null,null,null,null,null,null,null,null,null,"No"]
[null,null,null,null,null,null,null,null,null,"No"]
[null,null,null,null,null,null,null,null,null,"No"]
[null,null,null,null,null,null,null,null,null,"No"]
[null,null,null,null,null,null,null,null,null,"No"]
[null,null,null,null,null,null,null,null,null,"No"]
[null,null,null,null,null,null,null,null,null,"No"]
[null,null,null,null,null,null,null,null,null,"No"]
[null,null,null,null,null,null,null,null,null,"No"]
[null,null,null,null,null,null,null,null,null,"No"]
[null,null,null,null,null,null,null,null,null,"No"]
[null,null,null,null,null,null,null,null,null,"No"]
[null,null,null,null,null,null,null,null,null,"No"]
[null,null,null,null,null,null,null,null,null,"No"]
[null,null,null,null,null,null,null,null,null,"No"]
[null,null,null,null,null,null,null,null,null,"No"]
[null,null,null,null,null,null,null,null,null,"No"]
[null,null,null,null,null,null,null,null,null,"No"]
[null,null,null,null,null,null,null,null,null,"No"]
[null,null,null,null,null,null,null,null,null,"No"]
[null,null,null,null,null,null,null,null,null,"No"]
[null,null,null,null,null,null,null,null,null,"No"]
[null,null,null,null,null,null,null,null,null,"No"]
[null,null,null,null,null,null,null,null,null,"No"]
[null,null,null,null,null,null,null,null,null,"No"]
[null,null,null,null,null,null,null,null,null,"No"]
[null,null,null,null,null,null,null,null,null,"No"]
[null,null,null,null,null,null,null,null,null,"No"]
[null,null,null,null,null,null,null,null,null,"No"]
[null,null,null,null,null,null,null,null,null,"No"]
[null,null,null,null,null,null,null,null,null,"No"]
[null,null,null,null,null,null,null,null,null,"No"]
[null,null,null,null,null,null,null,null,null,"No"]
[null,null,null,null,null,null,null,null,null,"No"]
[null,null,null,null,null,null,null,null,null,"No"]
[null,null,null,null,null,null,null,null,null,"No"]
[null,null,null,null,null,null,null,null,null,"No"]
[null,null,null,null,null,null,null,null,null,"No"]
[null,null,null,null,null,null,null,null,null,"No"]
[null,null,null,null,null,null,null,null,null,"No"]
[null,null,null,null,null,null,null,null,null,"No"]
[null,null,null,null,null,null,null,null,null,"No"]
[null,null,null,null,null,null,null,null,null,"No"]
[null,null,null,null,null,null,null,null,null,"No"]
[null,null,null,null,null,null,null,null,null,"No"]
[null,null,null,null,null,null,null,null,null,"No"]
[null,null,null,null,null,null,null,null,null,"No"]
[null,null,null,null,null,null,null,null,null,"No"]
[null,null,null,null,null,null,null,null,null,"No"]
[null,null,null,null,null,null,null,null,null,"No"]
[null,null,null,null,null,null,null,null,null,"No"]
[null,null,null,null,null,null,null,null,null,"No"]
[null,null,null,null,null,null,null,null,null,"No"]
[null,null,null,null,null,null,null,null,null,"No"]
[null,null,null,null,null,null,null,null,null,"No"]
[null,null,null,null,null,null,null,null,null,"No"]
[null,null,null,null,null,null,null,null,null,"No"]
[null,null,null,null,null,null,null,null,null,"No"]
[null,null,null,null,null,null,null,null,null,"No"]
[null,null,null,null,null,null,null,null,null,"No"]
[null,null,null,null,null,null,null,null,null,"No"]
[null,null,null,null,null,null,null,null,null,"No"]
[null,null,null,null,null,null,null,null,null,"No"]
[null,null,null,null,null,null,null,null,null,"No"]
[null,null,null,null,null,null,null,null,null,"No"]
[null,null,null,null,null,null,null,null,null,"No"]
[null,null,null,null,null,null,null,null,null,"No"]
[null,null,null,null,null,null,null,null,null,"No"]
[null,null,null,null,null,null,null,null,null,"No"]
[null,null,null,null,null,null,null,null,null,"No"]
[null,null,null,null,null,null,null,null,null,"No"]
[null,null,null,null,null,null,null,null,null,"No"]
[null,null,null,null,null,null,null,null,null,"No"]
[null,null,null,null,null,null,null,null,null,"No"]
[null,null,null,null,null,null,null,null,null,"No"]
[null,null,null,null,null,null,null,null,null,"No"]
[null,null,null,null,null,null,null,null,null,"No"]
[null,null,null,null,null,null,null,null,null,"No"]
[null,null,null,null,null,null,null,null,null,"No"]
[null,null,null,null,null,null,null,null,null,"No"]
[null,null,null,null,null,null,null,null,null,"No"]
[null,null,null,null,null,null,null,null,null,"No"]
[null,null,null,null,null,null,null,null,null,"No"]
[null,null,null,null,null,null,null,null,null,"No"]
[null,null,null,null,null,null,null,null,null,"No"]
[null,null,null,null,null,null,null,null,null,"No"]
[null,null,null,null,null,null,null,null,null,"No"]
[null,null,null,null,null,null,null,null,null,"No"]
[null,null,null,null,null,null,null,null,null,"No"]
[null,null,null,null,null,null,null,null,null,"No"]
[null,null,null,null,null,null,null,null,null,"No"]
[null,null,null,null,null,null,null,null,null,"No"]
[null,null,null,null,null,null,null,null,null,"No"]
[null,null,null,null,null,null,null,null,null,"No"]
[null,null,null,null,null,null,null,null,null,"No"]
[null,null,null,null,null,null,null,null,null,"No"]
[null,null,null,null,null,null,null,null,null,"No"]
[null,null,null,null,null,null,null,null,null,"No"]
[null,null,null,null,null,null,null,null,null,"No"]
[null,null,null,null,null,null,null,null,null,"No"]
[null,null,null,null,null,null,null,null,null,"No"]
[null,null,null,null,null,null,null,null,null,"No"]
[null,null,null,null,null,null,null,null,null,"No"]
[null,null,null,null,null,null,null,null,null,"No"]
[null,null,null,null,null,null,null,null,null,"No"]
[null,null,null,null,null,null,null,null,null,"No"]
[null,null,null,null,null,null,null,null,null,"No"]
[null,null,null,null,null,null,null,null,null,"No"]
[null,null,null,null,null,null,null,null,null,"No"]
[null,null,null,null,null,null,null,null,null,"No"]
[null,null,null,null,null,null,null,null,null,"No"]
[null,null,null,null,null,null,null,null,null,"No"]
[null,null,null,null,null,null,null,null,null,"No"]
[null,null,null,null,null,null,null,null,null,"No"]
[null,null,null,null,null,null,null,null,null,"No"]
[null,null,null,null,null,null,null,null,null,"No"]
[null,null,null,null,null,null,null,null,null,"No"]
[null,null,null,null,null,null,null,null,null,"No"]
[null,null,null,null,null,null,null,null,null,"No"]
[null,null,null,null,null,null,null,null,null,"No"]
[null,null,null,null,null,null,null,null,null,"No"]
[null,null,null,null,null,null,null,null,null,"No"]
[null,null,null,null,null,null,null,null,null,"No"]
[null,null,null,null,null,null,null,null,null,"No"]
[null,null,null,null,null,null,null,null,null,"No"]
[null,null,null,null,null,null,null,null,null,"No"]
[null,null,null,null,null,null,null,null,null,"No"]
[null,null,null,null,null,null,null,null,null,"No"]
[null,null,null,null,null,null,null,null,null,"No"]
[null,null,null,null,null,null,null,null,null,"No"]
[null,null,null,null,null,null,null,null,null,"No"]
[null,null,null,null,null,null,null,null,null,"No"]
[null,null,null,null,null,null,null,null,null,"No"]
[null,null,null,null,null,null,null,null,null,"No"]
[null,null,null,null,null,null,null,null,null,"No"]
[null,null,null,null,null,null,null,null,null,"No"]
[null,null,null,null,null,null,null,null,null,"No"]
[null,null,null,null,null,null,null,null,null,"No"]
[null,null,null,null,null,null,null,null,null,"No"]
[null,null,null,null,null,null,null,null,null,"No"]
[null,null,null,null,null,null,null,null,null,"No"]
[null,null,null,null,null,null,null,null,null,"No"]
[null,null,null,null,null,null,null,null,null,"No"]
[null,null,null,null,null,null,null,null,null,"No"]
[null,null,null,null,null,null,null,null,null,"No"]
[null,null,null,null,null,null,null,null,null,"No"]
[null,null,null,null,null,null,null,null,null,"No"]
[null,null,null,null,null,null,null,null,null,"No"]
[null,null,null,null,null,null,null,null,null,"No"]
[null,null,null,null,null,null,null,null,null,"No"]
[null,null,null,null,null,null,null,null,null,"No"]
[null,null,null,null,null,null,null,null,null,"No"]
[null,null,null,null,null,null,null,null,null,"No"]
[null,null,null,null,null,null,null,null,null,"No"]
[null,null,null,null,null,null,null,null,null,"No"]
[null,null,null,null,null,null,null,null,null,"No"]
[null,null,null,null,null,null,null,null,null,"No"]
[null,null,null,null,null,null,null,null,null,"No"]
[null,null,null,null,null,null,null,null,null,"No"]
[null,null,null,null,null,null,null,null,null,"No"]
[null,null,null,null,null,null,null,null,null,"No"]
[null,null,null,null,null,null,null,null,null,"No"]
[null,null,null,null,null,null,null,null,null,"No"]
[null,null,null,null,null,null,null,null,null,"No"]
[null,null,null,null,null,null,null,null,null,"No"]
[null,null,null,null,null,null,null,null,null,"No"]
[null,null,null,null,null,null,null,null,null,"No"]
[null,null,null,null,null,null,null,null,null,"No"]
[null,null,null,null,null,null,null,null,null,"No"]
[null,null,null,null,null,null,null,null,null,"No"]
[null,null,null,null,null,null,null,null,null,"No"]
[null,null,null,null,null,null,null,null,null,"No"]
[null,null,null,null,null,null,null,null,null,"No"]
[null,null,null,null,null,null,null,null,null,"No"]
[null,null,null,null,null,null,null,null,null,"No"]
[null,null,null,null,null,null,null,null,null,"No"]
[null,null,null,null,null,null,null,null,null,"No"]
[null,null,null,null,null,null,null,null,null,"No"]
[null,null,null,null,null,null,null,null,null,"No"]
[null,null,null,null,null,null,null,null,null,"No"]
[null,null,null,null,null,null,null,null,null,"No"]
[null,null,null,null,null,null,null,null,null,"No"]
[null,null,null,null,null,null,null,null,null,"No"]
[null,null,null,null,null,null,null,null,null,"No"]
[null,null,null,null,null,null,null,null,null,"No"]
[null,null,null,null,null,null,null,null,null,"No"]
[null,null,null,null,null,null,null,null,null,"No"]
[null,null,null,null,null,null,null,null,null,"No"]
[null,null,null,null,null,null,null,null,null,"No"]
[null,null,null,null,null,null,null,null,null,"No"]
[null,null,null,null,null,null,null,null,null,"No"]
[null,null,null,null,null,null,null,null,null,"No"]
[null,null,null,null,null,null,null,null,null,"No"]
[null,null,null,null,null,null,null,null,null,"No"]
[null,null,null,null,null,null,null,null,null,"No"]
[null,null,null,null,null,null,null,null,null,"No"]
[null,null,null,null,null,null,null,null,null,"No"]
[null,null,null,null,null,null,null,null,null,"No"]
[null,null,null,null,null,null,null,null,null,"No"]
[null,null,null,null,null,null,null,null,null,"No"]
[null,null,null,null,null,null,null,null,null,"No"]
[null,null,null,null,null,null,null,null,null,"No"]
[null,null,null,null,null,null,null,null,null,"No"]
[null,null,null,null,null,null,null,null,null,"No"]
[null,null,null,null,null,null,null,null,null,"No"]
[null,null,null,null,null,null,null,null,null,"No"]
[null,null,null,null,null,null,null,null,null,"No"]
[null,null,null,null,null,null,null,null,null,"No"]
[null,null,null,null,null,null,null,null,null,"No"]
[null,null,null,null,null,null,null,null,null,"No"]
[null,null,null,null,null,null,null,null,null,"No"]
[null,null,null,null,null,null,null,null,null,"No"]
[null,null,null,null,null,null,null,null,null,"No"]
[null,null,null,null,null,null,null,null,null,"No"]
[null,null,null,null,null,null,null,null,null,"No"]
[null,null,null,null,null,null,null,null,null,"No"]
[null,null,null,null,null,null,null,null,null,"No"]
[null,null,null,null,null,null,null,null,null,"No"]
[null,null,null,null,null,null,null,null,null,"No"]
[null,null,null,null,null,null,null,null,null,"No"]
[null,null,null,null,null,null,null,null,null,"No"]
[null,null,null,null,null,null,null,null,null,"No"]
[null,null,null,null,null,null,null,null,null,"No"]
[null,null,null,null,null,null,null,null,null,"No"]
[null,null,null,null,null,null,null,null,null,"No"]
[null,null,null,null,null,null,null,null,null,"No"]
[null,null,null,null,null,null,null,null,null,"No"]
[null,null,null,null,null,null,null,null,null,"No"]
[null,null,null,null,null,null,null,null,null,"No"]
[null,null,null,null,null,null,null,null,null,"No"]
[null,null,null,null,null,null,null,null,null,"No"]
[null,null,null,null,null,null,null,null,null,"No"]
[null,null,null,null,null,null,null,null,null,"No"]
[null,null,null,null,null,null,null,null,null,"No"]
[null,null,null,null,null,null,null,null,null,"No"]
[null,null,null,null,null,null,null,null,null,"No"]
[null,null,null,null,null,null,null,null,null,"No"]
[null,null,null,null,null,null,null,null,null,"No"]
[null,null,null,null,null,null,null,null,null,"No"]
[null,null,null,null,null,null,null,null,null,"No"]
[null,null,null,null,null,null,null,null,null,"No"]
[null,null,null,null,null,null,null,null,null,"No"]
[null,null,null,null,null,null,null,null,null,"No"]
[null,null,null,null,null,null,null,null,null,"No"]
[null,null,null,null,null,null,null,null,null,"No"]
[null,null,null,null,null,null,null,null,null,"No"]
[null,null,null,null,null,null,null,null,null,"No"]
[null,null,null,null,null,null,null,null,null,"No"]
[null,null,null,null,null,null,null,null,null,"No"]
[null,null,null,null,null,null,null,null,null,"No"]
[null,null,null,null,null,null,null,null,null,"No"]
[null,null,null,null,null,null,null,null,null,"No"]
[null,null,null,null,null,null,null,null,null,"No"]
[null,null,null,null,null,null,null,null,null,"No"]
[null,null,null,null,null,null,null,null,null,"No"]
[null,null,null,null,null,null,null,null,null,"No"]
[null,null,null,null,null,null,null,null,null,"No"]
[null,null,null,null,null,null,null,null,null,"No"]
[null,null,null,null,null,null,null,null,null,"No"]
[null,null,null,null,null,null,null,null,null,"No"]
[null,null,null,null,null,null,null,null,null,"No"]
[null,null,null,null,null,null,null,null,null,"No"]
[null,null,null,null,null,null,null,null,null,"No"]
[null,null,null,null,null,null,null,null,null,"No"]
[null,null,null,null,null,null,null,null,null,"No"]
[null,null,null,null,null,null,null,null,null,"No"]
[null,null,null,null,null,null,null,null,null,"No"]
[null,null,null,null,null,null,null,null,null,"No"]
[null,null,null,null,null,null,null,null,null,"No"]
[null,null,null,null,null,null,null,null,null,"No"]
[null,null,null,null,null,null,null,null,null,"No"]
[null,null,null,null,null,null,null,null,null,"No"]
[null,null,null,null,null,null,null,null,null,"No"]
[null,null,null,null,null,null,null,null,null,"No"]
[null,null,null,null,null,null,null,null,null,"No"]
[null,null,null,null,null,null,null,null,null,"No"]
[null,null,null,null,null,null,null,null,null,"No"]
[null,null,null,null,null,null,null,null,null,"No"]
[null,null,null,null,null,null,null,null,null,"No"]
[null,null,null,null,null,null,null,null,null,"No"]
[null,null,null,null,null,null,null,null,null,"No"]
[null,null,null,null,null,null,null,null,null,"No"]
[null,null,null,null,null,null,null,null,null,"No"]
[null,null,null,null,null,null,null,null,null,"No"]
[null,null,null,null,null,null,null,null,null,"No"]
[null,null,null,null,null,null,null,null,null,"No"]
[null,null,null,null,null,null,null,null,null,"No"]
[null,null,null,null,null,null,null,null,null,"No"]
[null,null,null,null,null,null,null,null,null,"No"]
[null,null,null,null,null,null,null,null,null,"No"]
[null,null,null,null,null,null,null,null,null,"No"]
[null,null,null,null,null,null,null,null,null,"No"]
[null,null,null,null,null,null,null,null,null,"No"]
[null,null,null,null,null,null,null,null,null,"No"]
[null,null,null,null,null,null,null,null,null,"No"]
[null,null,null,null,null,null,null,null,null,"No"]
[null,null,null,null,null,null,null,null,null,"No"]
[null,null,null,null,null,null,null,null,null,"No"]
[null,null,null,null,null,null,null,null,null,"No"]
[null,null,null,null,null,null,null,null,null,"No"]
[null,null,null,null,null,null,null,null,null,"No"]
[null,null,null,null,null,null,null,null,null,"No"]
[null,null,null,null,null,null,null,null,null,"No"]
[null,null,null,null,null,null,null,null,null,"No"]
[null,null,null,null,null,null,null,null,null,"No"]
[null,null,null,null,null,null,null,null,null,"No"]
[null,null,null,null,null,null,null,null,null,"No"]
[null,null,null,null,null,null,null,null,null,"No"]
[null,null,null,null,null,null,null,null,null,"No"]
[null,null,null,null,null,null,null,null,null,"No"]
[null,null,null,null,null,null,null,null,null,"No"]
[null,null,null,null,null,null,null,null,null,"No"]
[null,null,null,null,null,null,null,null,null,"No"]
[null,null,null,null,null,null,null,null,null,"No"]
[null,null,null,null,null,null,null,null,null,"No"]
[null,null,null,null,null,null,null,null,null,"No"]
[null,null,null,null,null,null,null,null,null,"No"]
[null,null,null,null,null,null,null,null,null,"No"]
[null,null,null,null,null,null,null,null,null,"No"]
[null,null,null,null,null,null,null,null,null,"No"]
[null,null,null,null,null,null,null,null,null,"No"]
[null,null,null,null,null,null,null,null,null,"No"]
[null,null,null,null,null,null,null,null,null,"No"]
[null,null,null,null,null,null,null,null,null,"No"]
[null,null,null,null,null,null,null,null,null,"No"]
[null,null,null,null,null,null,null,null,null,"No"]
[null,null,null,null,null,null,null,null,null,"No"]
[null,null,null,null,null,null,null,null,null,"No"]
[null,null,null,null,null,null,null,null,null,"No"]
[null,null,null,null,null,null,null,null,null,"No"]
[null,null,null,null,null,null,null,null,null,"No"]
[null,null,null,null,null,null,null,null,null,"No"]
[null,null,null,null,null,null,null,null,null,"No"]
[null,null,null,null,null,null,null,null,null,"No"]
[null,null,null,null,null,null,null,null,null,"No"]
[null,null,null,null,null,null,null,null,null,"No"]
[null,null,null,null,null,null,null,null,null,"No"]
[null,null,null,null,null,null,null,null,null,"No"]
[null,null,null,null,null,null,null,null,null,"No"]
[null,null,null,null,null,null,null,null,null,"No"]
[null,null,null,null,null,null,null,null,null,"No"]
[null,null,null,null,null,null,null,null,null,"No"]
[null,null,null,null,null,null,null,null,null,"No"]
[null,null,null,null,null,null,null,null,null,"No"]
[null,null,null,null,null,null,null,null,null,"No"]
[null,null,null,null,null,null,null,null,null,"No"]
[null,null,null,null,null,null,null,null,null,"No"]
[null,null,null,null,null,null,null,null,null,"No"]
[null,null,null,null,null,null,null,null,null,"No"]
[null,null,null,null,null,null,null,null,null,"No"]
[null,null,null,null,null,null,null,null,null,"No"]
[null,null,null,null,null,null,null,null,null,"No"]
[null,null,null,null,null,null,null,null,null,"No"]
[null,null,null,null,null,null,null,null,null,"No"]
[null,null,null,null,null,null,null,null,null,"No"]
[null,null,null,null,null,null,null,null,null,"No"]
[null,null,null,null,null,null,null,null,null,"No"]
[null,null,null,null,null,null,null,null,null,"No"]
[null,null,null,null,null,null,null,null,null,"No"]
[null,null,null,null,null,null,null,null,null,"No"]
[null,null,null,null,null,null,null,null,null,"No"]
[null,null,null,null,null,null,null,null,null,"No"]
[null,null,null,null,null,null,null,null,null,"No"]
[null,null,null,null,null,null,null,null,null,"No"]
[null,null,null,null,null,null,null,null,null,"No"]
[null,null,null,null,null,null,null,null,null,"No"]
[null,null,null,null,null,null,null,null,null,"No"]
[null,null,null,null,null,null,null,null,null,"No"]
[null,null,null,null,null,null,null,null,null,"No"]
[null,null,null,null,null,null,null,null,null,"No"]
[null,null,null,null,null,null,null,null,null,"No"]
[null,null,null,null,null,null,null,null,null,"No"]
[null,null,null,null,null,null,null,null,null,"No"]
[null,null,null,null,null,null,null,null,null,"No"]
[null,null,null,null,null,null,null,null,null,"No"]
[null,null,null,null,null,null,null,null,null,"No"]
[null,null,null,null,null,null,null,null,null,"No"]
[null,null,null,null,null,null,null,null,null,"No"]
[null,null,null,null,null,null,null,null,null,"No"]
[null,null,null,null,null,null,null,null,null,"No"]
[null,null,null,null,null,null,null,null,null,"No"]
[null,null,null,null,null,null,null,null,null,"No"]
[null,null,null,null,null,null,null,null,null,"No"]
[null,null,null,null,null,null,null,null,null,"No"]
[null,null,null,null,null,null,null,null,null,"No"]
[null,null,null,null,null,null,null,null,null,"No"]
[null,null,null,null,null,null,null,null,null,"No"]
[null,null,null,null,null,null,null,null,null,"No"]
[null,null,null,null,null,null,null,null,null,"No"]
[null,null,null,null,null,null,null,null,null,"No"]
[null,null,null,null,null,null,null,null,null,"No"]
[null,null,null,null,null,null,null,null,null,"No"]
[null,null,null,null,null,null,null,null,null,"No"]
[null,null,null,null,null,null,null,null,null,"No"]
[null,null,null,null,null,null,null,null,null,"No"]
[null,null,null,null,null,null,null,null,null,"No"]
[null,null,null,null,null,null,null,null,null,"No"]
[null,null,null,null,null,null,null,null,null,"No"]
[null,null,null,null,null,null,null,null,null,"No"]
[null,null,null,null,null,null,null,null,null,"No"]
[null,null,null,null,null,null,null,null,null,"No"]
[null,null,null,null,null,null,null,null,null,"No"]
[null,null,null,null,null,null,null,null,null,"No"]
[null,null,null,null,null,null,null,null,null,"No"]
[null,null,null,null,null,null,null,null,null,"No"]
[null,null,null,null,null,null,null,null,null,"No"]
[null,null,null,null,null,null,null,null,null,"No"]
[null,null,null,null,null,null,null,null,null,"No"]
[null,null,null,null,null,null,null,null,null,"No"]
[null,null,null,null,null,null,null,null,null,"No"]
[null,null,null,null,null,null,null,null,null,"No"]
[null,null,null,null,null,null,null,null,null,"No"]
[null,null,null,null,null,null,null,null,null,"No"]
[null,null,null,null,null,null,null,null,null,"No"]
[null,null,null,null,null,null,null,null,null,"No"]
[null,null,null,null,null,null,null,null,null,"No"]
[null,null,null,null,null,null,null,null,null,"No"]
[null,null,null,null,null,null,null,null,null,"No"]
[null,null,null,null,null,null,null,null,null,"No"]
[null,null,null,null,null,null,null,null,null,"No"]
[null,null,null,null,null,null,null,null,null,"No"]
[null,null,null,null,null,null,null,null,null,"No"]
[null,null,null,null,null,null,null,null,null,"No"]
[null,null,null,null,null,null,null,null,null,"No"]
[null,null,null,null,null,null,null,null,null,"No"]
[null,null,null,null,null,null,null,null,null,"No"]
[null,null,null,null,null,null,null,null,null,"No"]
[null,null,null,null,null,null,null,null,null,"No"]
[null,null,null,null,null,null,null,null,null,"No"]
[null,null,null,null,null,null,null,null,null,"No"]
[null,null,null,null,null,null,null,null,null,"No"]
[null,null,null,null,null,null,null,null,null,"No"]
[null,null,null,null,null,null,null,null,null,"No"]
[null,null,null,null,null,null,null,null,null,"No"]
[null,null,null,null,null,null,null,null,null,"No"]
[null,null,null,null,null,null,null,null,null,"No"]
[null,null,null,null,null,null,null,null,null,"No"]
[null,null,null,null,null,null,null,null,null,"No"]
[null,null,null,null,null,null,null,null,null,"No"]
[null,null,null,null,null,null,null,null,null,"No"]
[null,null,null,null,null,null,null,null,null,"No"]
[null,null,null,null,null,null,null,null,null,"No"]
[null,null,null,null,null,null,null,null,null,"No"]
[null,null,null,null,null,null,null,null,null,"No"]
[null,null,null,null,null,null,null,null,null,"No"]
[null,null,null,null,null,null,null,null,null,"No"]
[null,null,null,null,null,null,null,null,null,"No"]
[null,null,null,null,null,null,null,null,null,"No"]
[null,null,null,null,null,null,null,null,null,"No"]
[null,null,null,null,null,null,null,null,null,"No"]
[null,null,null,null,null,null,null,null,null,"No"]
[null,null,null,null,null,null,null,null,null,"No"]
[null,null,null,null,null,null,null,null,null,"No"]
[null,null,null,null,null,null,null,null,null,"No"]
[null,null,null,null,null,null,null,null,null,"No"]
[null,null,null,null,null,null,null,null,null,"No"]
[null,null,null,null,null,null,null,null,null,"No"]
[null,null,null,null,null,null,null,null,null,"No"]
[null,null,null,null,null,null,null,null,null,"No"]
[null,null,null,null,null,null,null,null,null,"No"]
[null,null,null,null,null,null,null,null,null,"No"]
[null,null,null,null,null,null,null,null,null,"No"]
[null,null,null,null,null,null,null,null,null,"No"]
[null,null,null,null,null,null,null,null,null,"No"]
[null,null,null,null,null,null,null,null,null,"No"]
[null,null,null,null,null,null,null,null,null,"No"]
[null,null,null,null,null,null,null,null,null,"No"]
[null,null,null,null,null,null,null,null,null,"No"]
[null,null,null,null,null,null,null,null,null,"No"]
[null,null,null,null,null,null,null,null,null,"No"]
[null,null,null,null,null,null,null,null,null,"No"]
[null,null,null,null,null,null,null,null,null,"No"]
[null,null,null,null,null,null,null,null,null,"No"]
[null,null,null,null,null,null,null,null,null,"No"]
[null,null,null,null,null,null,null,null,null,"No"]
[null,null,null,null,null,null,null,null,null,"No"]
[null,null,null,null,null,null,null,null,null,"No"]
[null,null,null,null,null,null,null,null,null,"No"]
[null,null,null,null,null,null,null,null,null,"No"]
[null,null,null,null,null,null,null,null,null,"No"]
[null,null,null,null,null,null,null,null,null,"No"]
[null,null,null,null,null,null,null,null,null,"No"]
[null,null,null,null,null,null,null,null,null,"No"]
[null,null,null,null,null,null,null,null,null,"No"]
[null,null,null,null,null,null,null,null,null,"No"]
[null,null,null,null,null,null,null,null,null,"No"]
[null,null,null,null,null,null,null,null,null,"No"]
[null,null,null,null,null,null,null,null,null,"No"]
[null,null,null,null,null,null,null,null,null,"No"]
[null,null,null,null,null,null,null,null,null,"No"]
[null,null,null,null,null,null,null,null,null,"No"]
[null,null,null,null,null,null,null,null,null,"No"]
[null,null,null,null,null,null,null,null,null,"No"]
[null,null,null,null,null,null,null,null,null,"No"]
[null,null,null,null,null,null,null,null,null,"No"]
[null,null,null,null,null,null,null,null,null,"No"]
[null,null,null,null,null,null,null,null,null,"No"]
[null,null,null,null,null,null,null,null,null,"No"]
[null,null,null,null,null,null,null,null,null,"No"]
[null,null,null,null,null,null,null,null,null,"No"]
[null,null,null,null,null,null,null,null,null,"No"]
[null,null,null,null,null,null,null,null,null,"No"]
[null,null,null,null,null,null,null,null,null,"No"]
[null,null,null,null,null,null,null,null,null,"No"]
[null,null,null,null,null,null,null,null,null,"No"]
[null,null,null,null,null,null,null,null,null,"No"]
[null,null,null,null,null,null,null,null,null,"No"]
[null,null,null,null,null,null,null,null,null,"No"]
[null,null,null,null,null,null,null,null,null,"No"]
[null,null,null,null,null,null,null,null,null,"No"]
[null,null,null,null,null,null,null,null,null,"No"]
[null,null,null,null,null,null,null,null,null,"No"]
[null,null,null,null,null,null,null,null,null,"No"]
[null,null,null,null,null,null,null,null,null,"No"]
[null,null,null,null,null,null,null,null,null,"No"]
[null,null,null,null,null,null,null,null,null,"No"]
[null,null,null,null,null,null,null,null,null,"No"]
[null,null,null,null,null,null,null,null,null,"No"]
[null,null,null,null,null,null,null,null,null,"No"]
[null,null,null,null,null,null,null,null,null,"No"]
[null,null,null,null,null,null,null,null,null,"No"]
[null,null,null,null,null,null,null,null,null,"No"]
[null,null,null,null,null,null,null,null,null,"No"]
[null,null,null,null,null,null,null,null,null,"No"]
[null,null,null,null,null,null,null,null,null,"No"]
[null,null,null,null,null,null,null,null,null,"No"]
[null,null,null,null,null,null,null,null,null,"No"]
[null,null,null,null,null,null,null,null,null,"No"]
[null,null,null,null,null,null,null,null,null,"No"]
[null,null,null,null,null,null,null,null,null,"No"]
[null,null,null,null,null,null,null,null,null,"No"]
[null,null,null,null,null,null,null,null,null,"No"]
[null,null,null,null,null,null,null,null,null,"No"]
[null,null,null,null,null,null,null,null,null,"No"]
[null,null,null,null,null,null,null,null,null,"No"]
[null,null,null,null,null,null,null,null,null,"No"]
[null,null,null,null,null,null,null,null,null,"No"]
[null,null,null,null,null,null,null,null,null,"No"]
[null,null,null,null,null,null,null,null,null,"No"]
[null,null,null,null,null,null,null,null,null,"No"]
[null,null,null,null,null,null,null,null,null,"No"]
[null,null,null,null,null,null,null,null,null,"No"]
[null,null,null,null,null,null,null,null,null,"No"]
[null,null,null,null,null,null,null,null,null,"No"]
[null,null,null,null,null,null,null,null,null,"No"]
[null,null,null,null,null,null,null,null,null,"No"]
[null,null,null,null,null,null,null,null,null,"No"]
[null,null,null,null,null,null,null,null,null,"No"]
[null,null,null,null,null,null,null,null,null,"No"]
[null,null,null,null,null,null,null,null,null,"No"]
[null,null,null,null,null,null,null,null,null,"No"]
[null,null,null,null,null,null,null,null,null,"No"]
[null,null,null,null,null,null,null,null,null,"No"]
[null,null,null,null,null,null,null,null,null,"No"]
[null,null,null,null,null,null,null,null,null,"No"]
[null,null,null,null,null,null,null,null,null,"No"]
[null,null,null,null,null,null,null,null,null,"No"]
[null,null,null,null,null,null,null,null,null,"No"]
[null,null,null,null,null,null,null,null,null,"No"]
[null,null,null,null,null,null,null,null,null,"No"]
[null,null,null,null,null,null,null,null,null,"No"]
[null,null,null,null,null,null,null,null,null,"No"]
[null,null,null,null,null,null,null,null,null,"No"]
[null,null,null,null,null,null,null,null,null,"No"]
[null,null,null,null,null,null,null,null,null,"No"]
[null,null,null,null,null,null,null,null,null,"No"]
[null,null,null,null,null,null,null,null,null,"No"]
[null,null,null,null,null,null,null,null,null,"No"]
[null,null,null,null,null,null,null,null,null,"No"]
[null,null,null,null,null,null,null,null,null,"No"]
[null,null,null,null,null,null,null,null,null,"No"]
[null,null,null,null,null,null,null,null,null,"No"]
[null,null,null,null,null,null,null,null,null,"No"]
[null,null,null,null,null,null,null,null,null,"No"]
[null,null,null,null,null,null,null,null,null,"No"]
[null,null,null,null,null,null,null,null,null,"No"]
[null,null,null,null,null,null,null,null,null,"No"]
[null,null,null,null,null,null,null,null,null,"No"]
[null,null,null,null,null,null,null,null,null,"No"]
[null,null,null,null,null,null,null,null,null,"No"]
[null,null,null,null,null,null,null,null,null,"No"]
[null,null,null,null,null,null,null,null,null,"No"]
[null,null,null,null,null,null,null,null,null,"No"]
[null,null,null,null,null,null,null,null,null,"No"]
[null,null,null,null,null,null,null,null,null,"No"]
[null,null,null,null,null,null,null,null,null,"No"]
[null,null,null,null,null,null,null,null,null,"No"]
[null,null,null,null,null,null,null,null,null,"No"]
[null,null,null,null,null,null,null,null,null,"No"]
[null,null,null,null,null,null,null,null,null,"No"]
[null,null,null,null,null,null,null,null,null,"No"]
[null,null,null,null,null,null,null,null,null,"No"]
[null,null,null,null,null,null,null,null,null,"No"]
[null,null,null,null,null,null,null,null,null,"No"]
[null,null,null,null,null,null,null,null,null,"No"]
[null,null,null,null,null,null,null,null,null,"No"]
[null,null,null,null,null,null,null,null,null,"No"]
[null,null,null,null,null,null,null,null,null,"No"]
[null,null,null,null,null,null,null,null,null,"No"]
[null,null,null,null,null,null,null,null,null,"No"]
[null,null,null,null,null,null,null,null,null,"No"]
[null,null,null,null,null,null,null,null,null,"No"]
[null,null,null,null,null,null,null,null,null,"No"]
[null,null,null,null,null,null,null,null,null,"No"]
[null,null,null,null,null,null,null,null,null,"No"]
[null,null,null,null,null,null,null,null,null,"No"]
[null,null,null,null,null,null,null,null,null,"No"]
[null,null,null,null,null,null,null,null,null,"No"]
[null,null,null,null,null,null,null,null,null,"No"]
[null,null,null,null,null,null,null,null,null,"No"]
[null,null,null,null,null,null,null,null,null,"No"]
[null,null,null,null,null,null,null,null,null,"No"]
[null,null,null,null,null,null,null,null,null,"No"]
[null,null,null,null,null,null,null,null,null,"No"]
[null,null,null,null,null,null,null,null,null,"No"]
[null,null,null,null,null,null,null,null,null,"No"]
[null,null,null,null,null,null,null,null,null,"No"]
[null,null,null,null,null,null,null,null,null,"No"]
[null,null,null,null,null,null,null,null,null,"No"]
[null,null,null,null,null,null,null,null,null,"No"]
[null,null,null,null,null,null,null,null,null,"No"]
[null,null,null,null,null,null,null,null,null,"No"]
[null,null,null,null,null,null,null,null,null,"No"]
[null,null,null,null,null,null,null,null,null,"No"]
[null,null,null,null,null,null,null,null,null,"No"]
[null,null,null,null,null,null,null,null,null,"No"]
[null,null,null,null,null,null,null,null,null,"No"]
[null,null,null,null,null,null,null,null,null,"No"]
[null,null,null,null,null,null,null,null,null,"No"]
[null,null,null,null,null,null,null,null,null,"No"]
[null,null,null,null,null,null,null,null,null,"No"]
[null,null,null,null,null,null,null,null,null,"No"]
[null,null,null,null,null,null,null,null,null,"No"]
[null,null,null,null,null,null,null,null,null,"No"]
[null,null,null,null,null,null,null,null,null,"No"]
[null,null,null,null,null,null,null,null,null,"No"]
[null,null,null,null,null,null,null,null,null,"No"]
[null,null,null,null,null,null,null,null,null,"No"]
[null,null,null,null,null,null,null,null,null,"No"]
[null,null,null,null,null,null,null,null,null,"No"]
[null,null,null,null,null,null,null,null,null,"No"]
[null,null,null,null,null,null,null,null,null,"No"]
[null,null,null,null,null,null,null,null,null,"No"]
[null,null,null,null,null,null,null,null,null,"No"]
[null,null,null,null,null,null,null,null,null,"No"]
[null,null,null,null,null,null,null,null,null,"No"]
[null,null,null,null,null,null,null,null,null,"No"]
[null,null,null,null,null,null,null,null,null,"No"]
[null,null,null,null,null,null,null,null,null,"No"]
[null,null,null,null,null,null,null,null,null,"No"]
[null,null,null,null,null,null,null,null,null,"No"]
[null,null,null,null,null,null,null,null,null,"No"]
[null,null,null,null,null,null,null,null,null,"No"]
[null,null,null,null,null,null,null,null,null,"No"]
[null,null,null,null,null,null,null,null,null,"No"]
[null,null,null,null,null,null,null,null,null,"No"]
[null,null,null,null,null,null,null,null,null,"No"]
[null,null,null,null,null,null,null,null,null,"No"]
[null,null,null,null,null,null,null,null,null,"No"]
[null,null,null,null,null,null,null,null,null,"No"]
[null,null,null,null,null,null,null,null,null,"No"]
[null,null,null,null,null,null,null,null,null,"No"]
[null,null,null,null,null,null,null,null,null,"No"]
[null,null,null,null,null,null,null,null,null,"No"]
[null,null,null,null,null,null,null,null,null,"No"]
[null,null,null,null,null,null,null,null,null,"No"]
[null,null,null,null,null,null,null,null,null,"No"]
[null,null,null,null,null,null,null,null,null,"No"]
[null,null,null,null,null,null,null,null,null,"No"]
[null,null,null,null,null,null,null,null,null,"No"]
[null,null,null,null,null,null,null,null,null,"No"]
[null,null,null,null,null,null,null,null,null,"No"]
[null,null,null,null,null,null,null,null,null,"No"]
[null,null,null,null,null,null,null,null,null,"No"]
[null,null,null,null,null,null,null,null,null,"No"]
[null,null,null,null,null,null,null,null,null,"No"]
[null,null,null,null,null,null,null,null,null,"No"]
[null,null,null,null,null,null,null,null,null,"No"]
[null,null,null,null,null,null,null,null,null,"No"]
[null,null,null,null,null,null,null,null,null,"No"]
[null,null,null,null,null,null,null,null,null,"No"]
[null,null,null,null,null,null,null,null,null,"No"]
[null,null,null,null,null,null,null,null,null,"No"]
[null,null,null,null,null,null,null,null,null,"No"]
[null,null,null,null,null,null,null,null,null,"No"]
[null,null,null,null,null,null,null,null,null,"No"]
[null,null,null,null,null,null,null,null,null,"No"]
[null,null,null,null,null,null,null,null,null,"No"]
[null,null,null,null,null,null,null,null,null,"No"]
[null,null,null,null,null,null,null,null,null,"No"]
[null,null,null,null,null,null,null,null,null,"No"]
[null,null,null,null,null,null,null,null,null,"No"]
[null,null,null,null,null,null,null,null,null,"No"]
[null,null,null,null,null,null,null,null,null,"No"]
[null,null,null,null,null,null,null,null,null,"No"]
[null,null,null,null,null,null,null,null,null,"No"]
[null,null,null,null,null,null,null,null,null,"No"]
[null,null,null,null,null,null,null,null,null,"No"]
[null,null,null,null,null,null,null,null,null,"No"]
[null,null,null,null,null,null,null,null,null,"No"]
[null,null,null,null,null,null,null,null,null,"No"]
[null,null,null,null,null,null,null,null,null,"No"]
[null,null,null,null,null,null,null,null,null,"No"]
[null,null,null,null,null,null,null,null,null,"No"]
[null,null,null,null,null,null,null,null,null,"No"]
[null,null,null,null,null,null,null,null,null,"No"]
[null,null,null,null,null,null,null,null,null,"No"]
[null,null,null,null,null,null,null,null,null,"No"]
[null,null,null,null,null,null,null,null,null,"No"]
[null,null,null,null,null,null,null,null,null,"No"]
[null,null,null,null,null,null,null,null,null,"No"]
[null,null,null,null,null,null,null,null,null,"No"]
[null,null,null,null,null,null,null,null,null,"No"]
[null,null,null,null,null,null,null,null,null,"No"]
[null,null,null,null,null,null,null,null,null,"No"]
[null,null,null,null,null,null,null,null,null,"No"]
[null,null,null,null,null,null,null,null,null,"No"]
[null,null,null,null,null,null,null,null,null,"No"]
[null,null,null,null,null,null,null,null,null,"No"]
[null,null,null,null,null,null,null,null,null,"No"]
[null,null,null,null,null,null,null,null,null,"No"]
[null,null,null,null,null,null,null,null,null,"No"]
[null,null,null,null,null,null,null,null,null,"No"]
[null,null,null,null,null,null,null,null,null,"No"]
[null,null,null,null,null,null,null,null,null,"No"]
[null,null,null,null,null,null,null,null,null,"No"]
[null,null,null,null,null,null,null,null,null,"No"]
[null,null,null,null,null,null,null,null,null,"No"]
[null,null,null,null,null,null,null,null,null,"No"]
[null,null,null,null,null,null,null,null,null,"No"]
[null,null,null,null,null,null,null,null,null,"No"]
[null,null,null,null,null,null,null,null,null,"No"]
[null,null,null,null,null,null,null,null,null,"No"]
[null,null,null,null,null,null,null,null,null,"No"]
[null,null,null,null,null,null,null,null,null,"No"]
[null,null,null,null,null,null,null,null,null,"No"]
[null,null,null,null,null,null,null,null,null,"No"]
[null,null,null,null,null,null,null,null,null,"No"]
[null,null,null,null,null,null,null,null,null,"No"]
[null,null,null,null,null,null,null,null,null,"No"]
[null,null,null,null,null,null,null,null,null,"No"]
[null,null,null,null,null,null,null,null,null,"No"]
[null,null,null,null,null,null,null,null,null,"No"]
[null,null,null,null,null,null,null,null,null,"No"]
[null,null,null,null,null,null,null,null,null,"No"]
[null,null,null,null,null,null,null,null,null,"No"]
[null,null,null,null,null,null,null,null,null,"No"]
[null,null,null,null,null,null,null,null,null,"No"]
[null,null,null,null,null,null,null,null,null,"No"]
[null,null,null,null,null,null,null,null,null,"No"]
[null,null,null,null,null,null,null,null,null,"No"]
[null,null,null,null,null,null,null,null,null,"No"]
[null,null,null,null,null,null,null,null,null,"No"]
[null,null,null,null,null,null,null,null,null,"No"]
[null,null,null,null,null,null,null,null,null,"No"]
[null,null,null,null,null,null,null,null,null,"No"]
[null,null,null,null,null,null,null,null,null,"No"]
[null,null,null,null,null,null,null,null,null,"No"]
[null,null,null,null,null,null,null,null,null,"No"]
[null,null,null,null,null,null,null,null,null,"No"]
[null,null,null,null,null,null,null,null,null,"No"]
[null,null,null,null,null,null,null,null,null,"No"]

{"sheet":"Road Tunnel","index":5,"n_rows":1300,"n_cols":19,"rows_kept":1300,"cut":false,"hidden":false,"merged":[[18,0,18,8],[18,11,18,14],[0,11,0,15],[1,11,1,14],[2,11,2,14],[3,11,3,14],[4,10,4,13],[5,10,5,13]]}
[null,null,null,null,null,null,null,null,null,null,null,"Specified Thresholds",null,null,null,null,null,null,"Yes"]
[null,null,null,null,null,null,null,null,null,null,null,"Potentially Exposed Population",null,null,null,{"$f":"Thresholds!C20","v":302},null,null,"No"]
[null,null,null,null,null,null,null,null,null,null,null,"Property Loss",null,null,null,{"$f":"Thresholds!C21","v":1007196726}]
[null,null,null,null,null,null,null,null,null,null,null,"Mission Importance",null,null,"Mission",{"$f":"Thresholds!C22","v":"Yes"},null,null,"Steel"]
[null,null,null,null,null,null,null,null,null,null,null,null,null,null,null,null,null,null,"Concrete"]
[null,null,null,null,null,null,null,null,null,null,null,null,null,null,null,null,null,null,"Other"]
[]
[]
[]
[]
[]
[]
[]
[]
[]
[]
[]
[]
["ROAD TUNNELS",null,null,null,null,null,null,null,null,null,null,"CRITICALITY"]
["Asset ID","Quantity","ADT","Length (ft)","Lanes","Detour (mi)",null,"Replacement Cost Per Asset (Optional)","Comments","Manually mark as critical?",null,"Potentially Exposed Population","Property Loss","Mission Importance","Manual Override"]
["Big Mountain Tunnel",1,27000,4229,4,135,null,null,null,"No",null,null,null,"Y"]
[" Bay Tunnel",1,8900,5450,2,437,null,null,null,"No",null,null,null,"Y"]
["Shoals Tunnel",1,8900,5738,2,437,null,null,null,"No",null,null,null,"Y"]
["Downtown Tunnel",1,95000,3813,4,10,null,null,null,"No",null,"Y",null,"Y"]
["East Mountain Tunnel",1,28000,5412,4,135,null,null,null,"No",null,null,null,"Y"]
["Uptown Tunnel",1,89000,18480,4,48,null,null,null,"No",null,"Y","Y","Y"]
["Midtown Tunnel",1,36000,4194,4,10,null,null,null,"No",null,null,null,"Y"]
["Memorial Tunnel",1,54000,24288,4,19,null,null,null,"No",null,"Y","Y","Y"]
["Harbor Tunnel",1,39000,680,4,10,null,null,null,"No",null,null,null,"Y"]
["Airport Runway Tunnel",1,12000,1000,2,10,null,null,null,"No",null,null,null,"Y"]
["Parkland Tunnel",1,70000,1000,4,10,null,null,null,"No",null,null,null,"Y"]
[null,null,null,null,null,null,null,null,null,"No"]
[null,null,null,null,null,null,null,null,null,"No"]
[null,null,null,null,null,null,null,null,null,"No"]
[null,null,null,null,null,null,null,null,null,"No"]
[null,null,null,null,null,null,null,null,null,"No"]
[null,null,null,null,null,null,null,null,null,"No"]
[null,null,null,null,null,null,null,null,null,"No"]
[null,null,null,null,null,null,null,null,null,"No"]
[null,null,null,null,null,null,null,null,null,"No"]
[null,null,null,null,null,null,null,null,null,"No"]
[null,null,null,null,null,null,null,null,null,"No"]
[null,null,null,null,null,null,null,null,null,"No"]
[null,null,null,null,null,null,null,null,null,"No"]
[null,null,null,null,null,null,null,null,null,"No"]
[null,null,null,null,null,null,null,null,null,"No"]
[null,null,null,null,null,null,null,null,null,"No"]
[null,null,null,null,null,null,null,null,null,"No"]
[null,null,null,null,null,null,null,null,null,"No"]
[null,null,null,null,null,null,null,null,null,"No"]
[null,null,null,null,null,null,null,null,null,"No"]
[null,null,null,null,null,null,null,null,null,"No"]
[null,null,null,null,null,null,null,null,null,"No"]
[null,null,null,null,null,null,null,null,null,"No"]
[null,null,null,null,null,null,null,null,null,"No"]
[null,null,null,null,null,null,null,null,null,"No"]
[null,null,null,null,null,null,null,null,null,"No"]
[null,null,null,null,null,null,null,null,null,"No"]
[null,null,null,null,null,null,null,null,null,"No"]
[null,null,null,null,null,null,null,null,null,"No"]
[null,null,null,null,null,null,null,null,null,"No"]
[null,null,null,null,null,null,null,null,null,"No"]
[null,null,null,null,null,null,null,null,null,"No"]
[null,null,null,null,null,null,null,null,null,"No"]
[null,null,null,null,null,null,null,null,null,"No"]
[null,null,null,null,null,null,null,null,null,"No"]
[null,null,null,null,null,null,null,null,null,"No"]
[null,null,null,null,null,null,null,null,null,"No"]
[null,null,null,null,null,null,null,null,null,"No"]
[null,null,null,null,null,null,null,null,null,"No"]
[null,null,null,null,null,null,null,null,null,"No"]
[null,null,null,null,null,null,null,null,null,"No"]
[null,null,null,null,null,null,null,null,null,"No"]
[null,null,null,null,null,null,null,null,null,"No"]
[null,null,null,null,null,null,null,null,null,"No"]
[null,null,null,null,null,null,null,null,null,"No"]
[null,null,null,null,null,null,null,null,null,"No"]
[null,null,null,null,null,null,null,null,null,"No"]
[null,null,null,null,null,null,null,null,null,"No"]
[null,null,null,null,null,null,null,null,null,"No"]
[null,null,null,null,null,null,null,null,null,"No"]
[null,null,null,null,null,null,null,null,null,"No"]
[null,null,null,null,null,null,null,null,null,"No"]
[null,null,null,null,null,null,null,null,null,"No"]
[null,null,null,null,null,null,null,null,null,"No"]
[null,null,null,null,null,null,null,null,null,"No"]
[null,null,null,null,null,null,null,null,null,"No"]
[null,null,null,null,null,null,null,null,null,"No"]
[null,null,null,null,null,null,null,null,null,"No"]
[null,null,null,null,null,null,null,null,null,"No"]
[null,null,null,null,null,null,null,null,null,"No"]
[null,null,null,null,null,null,null,null,null,"No"]
[null,null,null,null,null,null,null,null,null,"No"]
[null,null,null,null,null,null,null,null,null,"No"]
[null,null,null,null,null,null,null,null,null,"No"]
[null,null,null,null,null,null,null,null,null,"No"]
[null,null,null,null,null,null,null,null,null,"No"]
[null,null,null,null,null,null,null,null,null,"No"]
[null,null,null,null,null,null,null,null,null,"No"]
[null,null,null,null,null,null,null,null,null,"No"]
[null,null,null,null,null,null,null,null,null,"No"]
[null,null,null,null,null,null,null,null,null,"No"]
[null,null,null,null,null,null,null,null,null,"No"]
[null,null,null,null,null,null,null,null,null,"No"]
[null,null,null,null,null,null,null,null,null,"No"]
[null,null,null,null,null,null,null,null,null,"No"]
[null,null,null,null,null,null,null,null,null,"No"]
[null,null,null,null,null,null,null,null,null,"No"]
[null,null,null,null,null,null,null,null,null,"No"]
[null,null,null,null,null,null,null,null,null,"No"]
[null,null,null,null,null,null,null,null,null,"No"]
[null,null,null,null,null,null,null,null,null,"No"]
[null,null,null,null,null,null,null,null,null,"No"]
[null,null,null,null,null,null,null,null,null,"No"]
[null,null,null,null,null,null,null,null,null,"No"]
[null,null,null,null,null,null,null,null,null,"No"]
[null,null,null,null,null,null,null,null,null,"No"]
[null,null,null,null,null,null,null,null,null,"No"]
[null,null,null,null,null,null,null,null,null,"No"]
[null,null,null,null,null,null,null,null,null,"No"]
[null,null,null,null,null,null,null,null,null,"No"]
[null,null,null,null,null,null,null,null,null,"No"]
[null,null,null,null,null,null,null,null,null,"No"]
[null,null,null,null,null,null,null,null,null,"No"]
[null,null,null,null,null,null,null,null,null,"No"]
[null,null,null,null,null,null,null,null,null,"No"]
[null,null,null,null,null,null,null,null,null,"No"]
[null,null,null,null,null,null,null,null,null,"No"]
[null,null,null,null,null,null,null,null,null,"No"]
[null,null,null,null,null,null,null,null,null,"No"]
[null,null,null,null,null,null,null,null,null,"No"]
[null,null,null,null,null,null,null,null,null,"No"]
[null,null,null,null,null,null,null,null,null,"No"]
[null,null,null,null,null,null,null,null,null,"No"]
[null,null,null,null,null,null,null,null,null,"No"]
[null,null,null,null,null,null,null,null,null,"No"]
[null,null,null,null,null,null,null,null,null,"No"]
[null,null,null,null,null,null,null,null,null,"No"]
[null,null,null,null,null,null,null,null,null,"No"]
[null,null,null,null,null,null,null,null,null,"No"]
[null,null,null,null,null,null,null,null,null,"No"]
[null,null,null,null,null,null,null,null,null,"No"]
[null,null,null,null,null,null,null,null,null,"No"]
[null,null,null,null,null,null,null,null,null,"No"]
[null,null,null,null,null,null,null,null,null,"No"]
[null,null,null,null,null,null,null,null,null,"No"]
[null,null,null,null,null,null,null,null,null,"No"]
[null,null,null,null,null,null,null,null,null,"No"]
[null,null,null,null,null,null,null,null,null,"No"]
[null,null,null,null,null,null,null,null,null,"No"]
[null,null,null,null,null,null,null,null,null,"No"]
[null,null,null,null,null,null,null,null,null,"No"]
[null,null,null,null,null,null,null,null,null,"No"]
[null,null,null,null,null,null,null,null,null,"No"]
[null,null,null,null,null,null,null,null,null,"No"]
[null,null,null,null,null,null,null,null,null,"No"]
[null,null,null,null,null,null,null,null,null,"No"]
[null,null,null,null,null,null,null,null,null,"No"]
[null,null,null,null,null,null,null,null,null,"No"]
[null,null,null,null,null,null,null,null,null,"No"]
[null,null,null,null,null,null,null,null,null,"No"]
[null,null,null,null,null,null,null,null,null,"No"]
[null,null,null,null,null,null,null,null,null,"No"]
[null,null,null,null,null,null,null,null,null,"No"]
[null,null,null,null,null,null,null,null,null,"No"]
[null,null,null,null,null,null,null,null,null,"No"]
[null,null,null,null,null,null,null,null,null,"No"]
[null,null,null,null,null,null,null,null,null,"No"]
[null,null,null,null,null,null,null,null,null,"No"]
[null,null,null,null,null,null,null,null,null,"No"]
[null,null,null,null,null,null,null,null,null,"No"]
[null,null,null,null,null,null,null,null,null,"No"]
[null,null,null,null,null,null,null,null,null,"No"]
[null,null,null,null,null,null,null,null,null,"No"]
[null,null,null,null,null,null,null,null,null,"No"]
[null,null,null,null,null,null,null,null,null,"No"]
[null,null,null,null,null,null,null,null,null,"No"]
[null,null,null,null,null,null,null,null,null,"No"]
[null,null,null,null,null,null,null,null,null,"No"]
[null,null,null,null,null,null,null,null,null,"No"]
[null,null,null,null,null,null,null,null,null,"No"]
[null,null,null,null,null,null,null,null,null,"No"]
[null,null,null,null,null,null,null,null,null,"No"]
[null,null,null,null,null,null,null,null,null,"No"]
[null,null,null,null,null,null,null,null,null,"No"]
[null,null,null,null,null,null,null,null,null,"No"]
[null,null,null,null,null,null,null,null,null,"No"]
[null,null,null,null,null,null,null,null,null,"No"]
[null,null,null,null,null,null,null,null,null,"No"]
[null,null,null,null,null,null,null,null,null,"No"]
[null,null,null,null,null,null,null,null,null,"No"]
[null,null,null,null,null,null,null,null,null,"No"]
[null,null,null,null,null,null,null,null,null,"No"]
[null,null,null,null,null,null,null,null,null,"No"]
[null,null,null,null,null,null,null,null,null,"No"]
[null,null,null,null,null,null,null,null,null,"No"]
[null,null,null,null,null,null,null,null,null,"No"]
[null,null,null,null,null,null,null,null,null,"No"]
[null,null,null,null,null,null,null,null,null,"No"]
[null,null,null,null,null,null,null,null,null,"No"]
[null,null,null,null,null,null,null,null,null,"No"]
[null,null,null,null,null,null,null,null,null,"No"]
[null,null,null,null,null,null,null,null,null,"No"]
[null,null,null,null,null,null,null,null,null,"No"]
[null,null,null,null,null,null,null,null,null,"No"]
[null,null,null,null,null,null,null,null,null,"No"]
[null,null,null,null,null,null,null,null,null,"No"]
[null,null,null,null,null,null,null,null,null,"No"]
[null,null,null,null,null,null,null,null,null,"No"]
[null,null,null,null,null,null,null,null,null,"No"]
[null,null,null,null,null,null,null,null,null,"No"]
[null,null,null,null,null,null,null,null,null,"No"]
[null,null,null,null,null,null,null,null,null,"No"]
[null,null,null,null,null,null,null,null,null,"No"]
[null,null,null,null,null,null,null,null,null,"No"]
[null,null,null,null,null,null,null,null,null,"No"]
[null,null,null,null,null,null,null,null,null,"No"]
[null,null,null,null,null,null,null,null,null,"No"]
[null,null,null,null,null,null,null,null,null,"No"]
[null,null,null,null,null,null,null,null,null,"No"]
[null,null,null,null,null,null,null,null,null,"No"]
[null,null,null,null,null,null,null,null,null,"No"]
[null,null,null,null,null,null,null,null,null,"No"]
[null,null,null,null,null,null,null,null,null,"No"]
[null,null,null,null,null,null,null,null,null,"No"]
[null,null,null,null,null,null,null,null,null,"No"]
[null,null,null,null,null,null,null,null,null,"No"]
[null,null,null,null,null,null,null,null,null,"No"]
[null,null,null,null,null,null,null,null,null,"No"]
[null,null,null,null,null,null,null,null,null,"No"]
[null,null,null,null,null,null,null,null,null,"No"]
[null,null,null,null,null,null,null,null,null,"No"]
[null,null,null,null,null,null,null,null,null,"No"]
[null,null,null,null,null,null,null,null,null,"No"]
[null,null,null,null,null,null,null,null,null,"No"]
[null,null,null,null,null,null,null,null,null,"No"]
[null,null,null,null,null,null,null,null,null,"No"]
[null,null,null,null,null,null,null,null,null,"No"]
[null,null,null,null,null,null,null,null,null,"No"]
[null,null,null,null,null,null,null,null,null,"No"]
[null,null,null,null,null,null,null,null,null,"No"]
[null,null,null,null,null,null,null,null,null,"No"]
[null,null,null,null,null,null,null,null,null,"No"]
[null,null,null,null,null,null,null,null,null,"No"]
[null,null,null,null,null,null,null,null,null,"No"]
[null,null,null,null,null,null,null,null,null,"No"]
[null,null,null,null,null,null,null,null,null,"No"]
[null,null,null,null,null,null,null,null,null,"No"]
[null,null,null,null,null,null,null,null,null,"No"]
[null,null,null,null,null,null,null,null,null,"No"]
[null,null,null,null,null,null,null,null,null,"No"]
[null,null,null,null,null,null,null,null,null,"No"]
[null,null,null,null,null,null,null,null,null,"No"]
[null,null,null,null,null,null,null,null,null,"No"]
[null,null,null,null,null,null,null,null,null,"No"]
[null,null,null,null,null,null,null,null,null,"No"]
[null,null,null,null,null,null,null,null,null,"No"]
[null,null,null,null,null,null,null,null,null,"No"]
[null,null,null,null,null,null,null,null,null,"No"]
[null,null,null,null,null,null,null,null,null,"No"]
[null,null,null,null,null,null,null,null,null,"No"]
[null,null,null,null,null,null,null,null,null,"No"]
[null,null,null,null,null,null,null,null,null,"No"]
[null,null,null,null,null,null,null,null,null,"No"]
[null,null,null,null,null,null,null,null,null,"No"]
[null,null,null,null,null,null,null,null,null,"No"]
[null,null,null,null,null,null,null,null,null,"No"]
[null,null,null,null,null,null,null,null,null,"No"]
[null,null,null,null,null,null,null,null,null,"No"]
[null,null,null,null,null,null,null,null,null,"No"]
[null,null,null,null,null,null,null,null,null,"No"]
[null,null,null,null,null,null,null,null,null,"No"]
[null,null,null,null,null,null,null,null,null,"No"]
[null,null,null,null,null,null,null,null,null,"No"]
[null,null,null,null,null,null,null,null,null,"No"]
[null,null,null,null,null,null,null,null,null,"No"]
[null,null,null,null,null,null,null,null,null,"No"]
[null,null,null,null,null,null,null,null,null,"No"]
[null,null,null,null,null,null,null,null,null,"No"]
[null,null,null,null,null,null,null,null,null,"No"]
[null,null,null,null,null,null,null,null,null,"No"]
[null,null,null,null,null,null,null,null,null,"No"]
[null,null,null,null,null,null,null,null,null,"No"]
[null,null,null,null,null,null,null,null,null,"No"]
[null,null,null,null,null,null,null,null,null,"No"]
[null,null,null,null,null,null,null,null,null,"No"]
[null,null,null,null,null,null,null,null,null,"No"]
[null,null,null,null,null,null,null,null,null,"No"]
[null,null,null,null,null,null,null,null,null,"No"]
[null,null,null,null,null,null,null,null,null,"No"]
[null,null,null,null,null,null,null,null,null,"No"]
[null,null,null,null,null,null,null,null,null,"No"]
[null,null,null,null,null,null,null,null,null,"No"]
[null,null,null,null,null,null,null,null,null,"No"]
[null,null,null,null,null,null,null,null,null,"No"]
[null,null,null,null,null,null,null,null,null,"No"]
[null,null,null,null,null,null,null,null,null,"No"]
[null,null,null,null,null,null,null,null,null,"No"]
[null,null,null,null,null,null,null,null,null,"No"]
[null,null,null,null,null,null,null,null,null,"No"]
[null,null,null,null,null,null,null,null,null,"No"]
[null,null,null,null,null,null,null,null,null,"No"]
[null,null,null,null,null,null,null,null,null,"No"]
[null,null,null,null,null,null,null,null,null,"No"]
[null,null,null,null,null,null,null,null,null,"No"]
[null,null,null,null,null,null,null,null,null,"No"]
[null,null,null,null,null,null,null,null,null,"No"]
[null,null,null,null,null,null,null,null,null,"No"]
[null,null,null,null,null,null,null,null,null,"No"]
[null,null,null,null,null,null,null,null,null,"No"]
[null,null,null,null,null,null,null,null,null,"No"]
[null,null,null,null,null,null,null,null,null,"No"]
[null,null,null,null,null,null,null,null,null,"No"]
[null,null,null,null,null,null,null,null,null,"No"]
[null,null,null,null,null,null,null,null,null,"No"]
[null,null,null,null,null,null,null,null,null,"No"]
[null,null,null,null,null,null,null,null,null,"No"]
[null,null,null,null,null,null,null,null,null,"No"]
[null,null,null,null,null,null,null,null,null,"No"]
[null,null,null,null,null,null,null,null,null,"No"]
[null,null,null,null,null,null,null,null,null,"No"]
[null,null,null,null,null,null,null,null,null,"No"]
[null,null,null,null,null,null,null,null,null,"No"]
[null,null,null,null,null,null,null,null,null,"No"]
[null,null,null,null,null,null,null,null,null,"No"]
[null,null,null,null,null,null,null,null,null,"No"]
[null,null,null,null,null,null,null,null,null,"No"]
[null,null,null,null,null,null,null,null,null,"No"]
[null,null,null,null,null,null,null,null,null,"No"]
[null,null,null,null,null,null,null,null,null,"No"]
[null,null,null,null,null,null,null,null,null,"No"]
[null,null,null,null,null,null,null,null,null,"No"]
[null,null,null,null,null,null,null,null,null,"No"]
[null,null,null,null,null,null,null,null,null,"No"]
[null,null,null,null,null,null,null,null,null,"No"]
[null,null,null,null,null,null,null,null,null,"No"]
[null,null,null,null,null,null,null,null,null,"No"]
[null,null,null,null,null,null,null,null,null,"No"]
[null,null,null,null,null,null,null,null,null,"No"]
[null,null,null,null,null,null,null,null,null,"No"]
[null,null,null,null,null,null,null,null,null,"No"]
[null,null,null,null,null,null,null,null,null,"No"]
[null,null,null,null,null,null,null,null,null,"No"]
[null,null,null,null,null,null,null,null,null,"No"]
[null,null,null,null,null,null,null,null,null,"No"]
[null,null,null,null,null,null,null,null,null,"No"]
[null,null,null,null,null,null,null,null,null,"No"]
[null,null,null,null,null,null,null,null,null,"No"]
[null,null,null,null,null,null,null,null,null,"No"]
[null,null,null,null,null,null,null,null,null,"No"]
[null,null,null,null,null,null,null,null,null,"No"]
[null,null,null,null,null,null,null,null,null,"No"]
[null,null,null,null,null,null,null,null,null,"No"]
[null,null,null,null,null,null,null,null,null,"No"]
[null,null,null,null,null,null,null,null,null,"No"]
[null,null,null,null,null,null,null,null,null,"No"]
[null,null,null,null,null,null,null,null,null,"No"]
[null,null,null,null,null,null,null,null,null,"No"]
[null,null,null,null,null,null,null,null,null,"No"]
[null,null,null,null,null,null,null,null,null,"No"]
[null,null,null,null,null,null,null,null,null,"No"]
[null,null,null,null,null,null,null,null,null,"No"]
[null,null,null,null,null,null,null,null,null,"No"]
[null,null,null,null,null,null,null,null,null,"No"]
[null,null,null,null,null,null,null,null,null,"No"]
[null,null,null,null,null,null,null,null,null,"No"]
[null,null,null,null,null,null,null,null,null,"No"]
[null,null,null,null,null,null,null,null,null,"No"]
[null,null,null,null,null,null,null,null,null,"No"]
[null,null,null,null,null,null,null,null,null,"No"]
[null,null,null,null,null,null,null,null,null,"No"]
[null,null,null,null,null,null,null,null,null,"No"]
[null,null,null,null,null,null,null,null,null,"No"]
[null,null,null,null,null,null,null,null,null,"No"]
[null,null,null,null,null,null,null,null,null,"No"]
[null,null,null,null,null,null,null,null,null,"No"]
[null,null,null,null,null,null,null,null,null,"No"]
[null,null,null,null,null,null,null,null,null,"No"]
[null,null,null,null,null,null,null,null,null,"No"]
[null,null,null,null,null,null,null,null,null,"No"]
[null,null,null,null,null,null,null,null,null,"No"]
[null,null,null,null,null,null,null,null,null,"No"]
[null,null,null,null,null,null,null,null,null,"No"]
[null,null,null,null,null,null,null,null,null,"No"]
[null,null,null,null,null,null,null,null,null,"No"]
[null,null,null,null,null,null,null,null,null,"No"]
[null,null,null,null,null,null,null,null,null,"No"]
[null,null,null,null,null,null,null,null,null,"No"]
[null,null,null,null,null,null,null,null,null,"No"]
[null,null,null,null,null,null,null,null,null,"No"]
[null,null,null,null,null,null,null,null,null,"No"]
[null,null,null,null,null,null,null,null,null,"No"]
[null,null,null,null,null,null,null,null,null,"No"]
[null,null,null,null,null,null,null,null,null,"No"]
[null,null,null,null,null,null,null,null,null,"No"]
[null,null,null,null,null,null,null,null,null,"No"]
[null,null,null,null,null,null,null,null,null,"No"]
[null,null,null,null,null,null,null,null,null,"No"]
[null,null,null,null,null,null,null,null,null,"No"]
[null,null,null,null,null,null,null,null,null,"No"]
[null,null,null,null,null,null,null,null,null,"No"]
[null,null,null,null,null,null,null,null,null,"No"]
[null,null,null,null,null,null,null,null,null,"No"]
[null,null,null,null,null,null,null,null,null,"No"]
[null,null,null,null,null,null,null,null,null,"No"]
[null,null,null,null,null,null,null,null,null,"No"]
[null,null,null,null,null,null,null,null,null,"No"]
[null,null,null,null,null,null,null,null,null,"No"]
[null,null,null,null,null,null,null,null,null,"No"]
[null,null,null,null,null,null,null,null,null,"No"]
[null,null,null,null,null,null,null,null,null,"No"]
[null,null,null,null,null,null,null,null,null,"No"]
[null,null,null,null,null,null,null,null,null,"No"]
[null,null,null,null,null,null,null,null,null,"No"]
[null,null,null,null,null,null,null,null,null,"No"]
[null,null,null,null,null,null,null,null,null,"No"]
[null,null,null,null,null,null,null,null,null,"No"]
[null,null,null,null,null,null,null,null,null,"No"]
[null,null,null,null,null,null,null,null,null,"No"]
[null,null,null,null,null,null,null,null,null,"No"]
[null,null,null,null,null,null,null,null,null,"No"]
[null,null,null,null,null,null,null,null,null,"No"]
[null,null,null,null,null,null,null,null,null,"No"]
[null,null,null,null,null,null,null,null,null,"No"]
[null,null,null,null,null,null,null,null,null,"No"]
[null,null,null,null,null,null,null,null,null,"No"]
[null,null,null,null,null,null,null,null,null,"No"]
[null,null,null,null,null,null,null,null,null,"No"]
[null,null,null,null,null,null,null,null,null,"No"]
[null,null,null,null,null,null,null,null,null,"No"]
[null,null,null,null,null,null,null,null,null,"No"]
[null,null,null,null,null,null,null,null,null,"No"]
[null,null,null,null,null,null,null,null,null,"No"]
[null,null,null,null,null,null,null,null,null,"No"]
[null,null,null,null,null,null,null,null,null,"No"]
[null,null,null,null,null,null,null,null,null,"No"]
[null,null,null,null,null,null,null,null,null,"No"]
[null,null,null,null,null,null,null,null,null,"No"]
[null,null,null,null,null,null,null,null,null,"No"]
[null,null,null,null,null,null,null,null,null,"No"]
[null,null,null,null,null,null,null,null,null,"No"]
[null,null,null,null,null,null,null,null,null,"No"]
[null,null,null,null,null,null,null,null,null,"No"]
[null,null,null,null,null,null,null,null,null,"No"]
[null,null,null,null,null,null,null,null,null,"No"]
[null,null,null,null,null,null,null,null,null,"No"]
[null,null,null,null,null,null,null,null,null,"No"]
[null,null,null,null,null,null,null,null,null,"No"]
[null,null,null,null,null,null,null,null,null,"No"]
[null,null,null,null,null,null,null,null,null,"No"]
[null,null,null,null,null,null,null,null,null,"No"]
[null,null,null,null,null,null,null,null,null,"No"]
[null,null,null,null,null,null,null,null,null,"No"]
[null,null,null,null,null,null,null,null,null,"No"]
[null,null,null,null,null,null,null,null,null,"No"]
[null,null,null,null,null,null,null,null,null,"No"]
[null,null,null,null,null,null,null,null,null,"No"]
[null,null,null,null,null,null,null,null,null,"No"]
[null,null,null,null,null,null,null,null,null,"No"]
[null,null,null,null,null,null,null,null,null,"No"]
[null,null,null,null,null,null,null,null,null,"No"]
[null,null,null,null,null,null,null,null,null,"No"]
[null,null,null,null,null,null,null,null,null,"No"]
[null,null,null,null,null,null,null,null,null,"No"]
[null,null,null,null,null,null,null,null,null,"No"]
[null,null,null,null,null,null,null,null,null,"No"]
[null,null,null,null,null,null,null,null,null,"No"]
[null,null,null,null,null,null,null,null,null,"No"]
[null,null,null,null,null,null,null,null,null,"No"]
[null,null,null,null,null,null,null,null,null,"No"]
[null,null,null,null,null,null,null,null,null,"No"]
[null,null,null,null,null,null,null,null,null,"No"]
[null,null,null,null,null,null,null,null,null,"No"]
[null,null,null,null,null,null,null,null,null,"No"]
[null,null,null,null,null,null,null,null,null,"No"]
[null,null,null,null,null,null,null,null,null,"No"]
[null,null,null,null,null,null,null,null,null,"No"]
[null,null,null,null,null,null,null,null,null,"No"]
[null,null,null,null,null,null,null,null,null,"No"]
[null,null,null,null,null,null,null,null,null,"No"]
[null,null,null,null,null,null,null,null,null,"No"]
[null,null,null,null,null,null,null,null,null,"No"]
[null,null,null,null,null,null,null,null,null,"No"]
[null,null,null,null,null,null,null,null,null,"No"]
[null,null,null,null,null,null,null,null,null,"No"]
[null,null,null,null,null,null,null,null,null,"No"]
[null,null,null,null,null,null,null,null,null,"No"]
[null,null,null,null,null,null,null,null,null,"No"]
[null,null,null,null,null,null,null,null,null,"No"]
[null,null,null,null,null,null,null,null,null,"No"]
[null,null,null,null,null,null,null,null,null,"No"]
[null,null,null,null,null,null,null,null,null,"No"]
[null,null,null,null,null,null,null,null,null,"No"]
[null,null,null,null,null,null,null,null,null,"No"]
[null,null,null,null,null,null,null,null,null,"No"]
[null,null,null,null,null,null,null,null,null,"No"]
[null,null,null,null,null,null,null,null,null,"No"]
[null,null,null,null,null,null,null,null,null,"No"]
[null,null,null,null,null,null,null,null,null,"No"]
[null,null,null,null,null,null,null,null,null,"No"]
[null,null,null,null,null,null,null,null,null,"No"]
[null,null,null,null,null,null,null,null,null,"No"]
[null,null,null,null,null,null,null,null,null,"No"]
[null,null,null,null,null,null,null,null,null,"No"]
[null,null,null,null,null,null,null,null,null,"No"]
[null,null,null,null,null,null,null,null,null,"No"]
[null,null,null,null,null,null,null,null,null,"No"]
[null,null,null,null,null,null,null,null,null,"No"]
[null,null,null,null,null,null,null,null,null,"No"]
[null,null,null,null,null,null,null,null,null,"No"]
[null,null,null,null,null,null,null,null,null,"No"]
[null,null,null,null,null,null,null,null,null,"No"]
[null,null,null,null,null,null,null,null,null,"No"]
[null,null,null,null,null,null,null,null,null,"No"]
[null,null,null,null,null,null,null,null,null,"No"]
[null,null,null,null,null,null,null,null,null,"No"]
[null,null,null,null,null,null,null,null,null,"No"]
[null,null,null,null,null,null,null,null,null,"No"]
[null,null,null,null,null,null,null,null,null,"No"]
[null,null,null,null,null,null,null,null,null,"No"]
[null,null,null,null,null,null,null,null,null,"No"]
[null,null,null,null,null,null,null,null,null,"No"]
[null,null,null,null,null,null,null,null,null,"No"]
[null,null,null,null,null,null,null,null,null,"No"]
[null,null,null,null,null,null,null,null,null,"No"]
[null,null,null,null,null,null,null,null,null,"No"]
[null,null,null,null,null,null,null,null,null,"No"]
[null,null,null,null,null,null,null,null,null,"No"]
[null,null,null,null,null,null,null,null,null,"No"]
[null,null,null,null,null,null,null,null,null,"No"]
[null,null,null,null,null,null,null,null,null,"No"]
[null,null,null,null,null,null,null,null,null,"No"]
[null,null,null,null,null,null,null,null,null,"No"]
[null,null,null,null,null,null,null,null,null,"No"]
[null,null,null,null,null,null,null,null,null,"No"]
[null,null,null,null,null,null,null,null,null,"No"]
[null,null,null,null,null,null,null,null,null,"No"]
[null,null,null,null,null,null,null,null,null,"No"]
[null,null,null,null,null,null,null,null,null,"No"]
[null,null,null,null,null,null,null,null,null,"No"]
[null,null,null,null,null,null,null,null,null,"No"]
[null,null,null,null,null,null,null,null,null,"No"]
[null,null,null,null,null,null,null,null,null,"No"]
[null,null,null,null,null,null,null,null,null,"No"]
[null,null,null,null,null,null,null,null,null,"No"]
[null,null,null,null,null,null,null,null,null,"No"]
[null,null,null,null,null,null,null,null,null,"No"]
[null,null,null,null,null,null,null,null,null,"No"]
[null,null,null,null,null,null,null,null,null,"No"]
[null,null,null,null,null,null,null,null,null,"No"]
[null,null,null,null,null,null,null,null,null,"No"]
[null,null,null,null,null,null,null,null,null,"No"]
[null,null,null,null,null,null,null,null,null,"No"]
[null,null,null,null,null,null,null,null,null,"No"]
[null,null,null,null,null,null,null,null,null,"No"]
[null,null,null,null,null,null,null,null,null,"No"]
[null,null,null,null,null,null,null,null,null,"No"]
[null,null,null,null,null,null,null,null,null,"No"]
[null,null,null,null,null,null,null,null,null,"No"]
[null,null,null,null,null,null,null,null,null,"No"]
[null,null,null,null,null,null,null,null,null,"No"]
[null,null,null,null,null,null,null,null,null,"No"]
[null,null,null,null,null,null,null,null,null,"No"]
[null,null,null,null,null,null,null,null,null,"No"]
[null,null,null,null,null,null,null,null,null,"No"]
[null,null,null,null,null,null,null,null,null,"No"]
[null,null,null,null,null,null,null,null,null,"No"]
[null,null,null,null,null,null,null,null,null,"No"]
[null,null,null,null,null,null,null,null,null,"No"]
[null,null,null,null,null,null,null,null,null,"No"]
[null,null,null,null,null,null,null,null,null,"No"]
[null,null,null,null,null,null,null,null,null,"No"]
[null,null,null,null,null,null,null,null,null,"No"]
[null,null,null,null,null,null,null,null,null,"No"]
[null,null,null,null,null,null,null,null,null,"No"]
[null,null,null,null,null,null,null,null,null,"No"]
[null,null,null,null,null,null,null,null,null,"No"]
[null,null,null,null,null,null,null,null,null,"No"]
[null,null,null,null,null,null,null,null,null,"No"]
[null,null,null,null,null,null,null,null,null,"No"]
[null,null,null,null,null,null,null,null,null,"No"]
[null,null,null,null,null,null,null,null,null,"No"]
[null,null,null,null,null,null,null,null,null,"No"]
[null,null,null,null,null,null,null,null,null,"No"]
[null,null,null,null,null,null,null,null,null,"No"]
[null,null,null,null,null,null,null,null,null,"No"]
[null,null,null,null,null,null,null,null,null,"No"]
[null,null,null,null,null,null,null,null,null,"No"]
[null,null,null,null,null,null,null,null,null,"No"]
[null,null,null,null,null,null,null,null,null,"No"]
[null,null,null,null,null,null,null,null,null,"No"]
[null,null,null,null,null,null,null,null,null,"No"]
[null,null,null,null,null,null,null,null,null,"No"]
[null,null,null,null,null,null,null,null,null,"No"]
[null,null,null,null,null,null,null,null,null,"No"]
[null,null,null,null,null,null,null,null,null,"No"]
[null,null,null,null,null,null,null,null,null,"No"]
[null,null,null,null,null,null,null,null,null,"No"]
[null,null,null,null,null,null,null,null,null,"No"]
[null,null,null,null,null,null,null,null,null,"No"]
[null,null,null,null,null,null,null,null,null,"No"]
[null,null,null,null,null,null,null,null,null,"No"]
[null,null,null,null,null,null,null,null,null,"No"]
[null,null,null,null,null,null,null,null,null,"No"]
[null,null,null,null,null,null,null,null,null,"No"]
[null,null,null,null,null,null,null,null,null,"No"]
[null,null,null,null,null,null,null,null,null,"No"]
[null,null,null,null,null,null,null,null,null,"No"]
[null,null,null,null,null,null,null,null,null,"No"]
[null,null,null,null,null,null,null,null,null,"No"]
[null,null,null,null,null,null,null,null,null,"No"]
[null,null,null,null,null,null,null,null,null,"No"]
[null,null,null,null,null,null,null,null,null,"No"]
[null,null,null,null,null,null,null,null,null,"No"]
[null,null,null,null,null,null,null,null,null,"No"]
[null,null,null,null,null,null,null,null,null,"No"]
[null,null,null,null,null,null,null,null,null,"No"]
[null,null,null,null,null,null,null,null,null,"No"]
[null,null,null,null,null,null,null,null,null,"No"]
[null,null,null,null,null,null,null,null,null,"No"]
[null,null,null,null,null,null,null,null,null,"No"]
[null,null,null,null,null,null,null,null,null,"No"]
[null,null,null,null,null,null,null,null,null,"No"]
[null,null,null,null,null,null,null,null,null,"No"]
[null,null,null,null,null,null,null,null,null,"No"]
[null,null,null,null,null,null,null,null,null,"No"]
[null,null,null,null,null,null,null,null,null,"No"]
[null,null,null,null,null,null,null,null,null,"No"]
[null,null,null,null,null,null,null,null,null,"No"]
[null,null,null,null,null,null,null,null,null,"No"]
[null,null,null,null,null,null,null,null,null,"No"]
[null,null,null,null,null,null,null,null,null,"No"]
[null,null,null,null,null,null,null,null,null,"No"]
[null,null,null,null,null,null,null,null,null,"No"]
[null,null,null,null,null,null,null,null,null,"No"]
[null,null,null,null,null,null,null,null,null,"No"]
[null,null,null,null,null,null,null,null,null,"No"]
[null,null,null,null,null,null,null,null,null,"No"]
[null,null,null,null,null,null,null,null,null,"No"]
[null,null,null,null,null,null,null,null,null,"No"]
[null,null,null,null,null,null,null,null,null,"No"]
[null,null,null,null,null,null,null,null,null,"No"]
[null,null,null,null,null,null,null,null,null,"No"]
[null,null,null,null,null,null,null,null,null,"No"]
[null,null,null,null,null,null,null,null,null,"No"]
[null,null,null,null,null,null,null,null,null,"No"]
[null,null,null,null,null,null,null,null,null,"No"]
[null,null,null,null,null,null,null,null,null,"No"]
[null,null,null,null,null,null,null,null,null,"No"]
[null,null,null,null,null,null,null,null,null,"No"]
[null,null,null,null,null,null,null,null,null,"No"]
[null,null,null,null,null,null,null,null,null,"No"]
[null,null,null,null,null,null,null,null,null,"No"]
[null,null,null,null,null,null,null,null,null,"No"]
[null,null,null,null,null,null,null,null,null,"No"]
[null,null,null,null,null,null,null,null,null,"No"]
[null,null,null,null,null,null,null,null,null,"No"]
[null,null,null,null,null,null,null,null,null,"No"]
[null,null,null,null,null,null,null,null,null,"No"]
[null,null,null,null,null,null,null,null,null,"No"]
[null,null,null,null,null,null,null,null,null,"No"]
[null,null,null,null,null,null,null,null,null,"No"]
[null,null,null,null,null,null,null,null,null,"No"]
[null,null,null,null,null,null,null,null,null,"No"]
[null,null,null,null,null,null,null,null,null,"No"]
[null,null,null,null,null,null,null,null,null,"No"]
[null,null,null,null,null,null,null,null,null,"No"]
[null,null,null,null,null,null,null,null,null,"No"]
[null,null,null,null,null,null,null,null,null,"No"]
[null,null,null,null,null,null,null,null,null,"No"]
[null,null,null,null,null,null,null,null,null,"No"]
[null,null,null,null,null,null,null,null,null,"No"]
[null,null,null,null,null,null,null,null,null,"No"]
[null,null,null,null,null,null,null,null,null,"No"]
[null,null,null,null,null,null,null,null,null,"No"]
[null,null,null,null,null,null,null,null,null,"No"]
[null,null,null,null,null,null,null,null,null,"No"]
[null,null,null,null,null,null,null,null,null,"No"]
[null,null,null,null,null,null,null,null,null,"No"]
[null,null,null,null,null,null,null,null,null,"No"]
[null,null,null,null,null,null,null,null,null,"No"]
[null,null,null,null,null,null,null,null,null,"No"]
[null,null,null,null,null,null,null,null,null,"No"]
[null,null,null,null,null,null,null,null,null,"No"]
[null,null,null,null,null,null,null,null,null,"No"]
[null,null,null,null,null,null,null,null,null,"No"]
[null,null,null,null,null,null,null,null,null,"No"]
[null,null,null,null,null,null,null,null,null,"No"]
[null,null,null,null,null,null,null,null,null,"No"]
[null,null,null,null,null,null,null,null,null,"No"]
[null,null,null,null,null,null,null,null,null,"No"]
[null,null,null,null,null,null,null,null,null,"No"]
[null,null,null,null,null,null,null,null,null,"No"]
[null,null,null,null,null,null,null,null,null,"No"]
[null,null,null,null,null,null,null,null,null,"No"]
[null,null,null,null,null,null,null,null,null,"No"]
[null,null,null,null,null,null,null,null,null,"No"]
[null,null,null,null,null,null,null,null,null,"No"]
[null,null,null,null,null,null,null,null,null,"No"]
[null,null,null,null,null,null,null,null,null,"No"]
[null,null,null,null,null,null,null,null,null,"No"]
[null,null,null,null,null,null,null,null,null,"No"]
[null,null,null,null,null,null,null,null,null,"No"]
[null,null,null,null,null,null,null,null,null,"No"]
[null,null,null,null,null,null,null,null,null,"No"]
[null,null,null,null,null,null,null,null,null,"No"]
[null,null,null,null,null,null,null,null,null,"No"]
[null,null,null,null,null,null,null,null,null,"No"]
[null,null,null,null,null,null,null,null,null,"No"]
[null,null,null,null,null,null,null,null,null,"No"]
[null,null,null,null,null,null,null,null,null,"No"]
[null,null,null,null,null,null,null,null,null,"No"]
[null,null,null,null,null,null,null,null,null,"No"]
[null,null,null,null,null,null,null,null,null,"No"]
[null,null,null,null,null,null,null,null,null,"No"]
[null,null,null,null,null,null,null,null,null,"No"]
[null,null,null,null,null,null,null,null,null,"No"]
[null,null,null,null,null,null,null,null,null,"No"]
[null,null,null,null,null,null,null,null,null,"No"]
[null,null,null,null,null,null,null,null,null,"No"]
[null,null,null,null,null,null,null,null,null,"No"]
[null,null,null,null,null,null,null,null,null,"No"]
[null,null,null,null,null,null,null,null,null,"No"]
[null,null,null,null,null,null,null,null,null,"No"]
[null,null,null,null,null,null,null,null,null,"No"]
[null,null,null,null,null,null,null,null,null,"No"]
[null,null,null,null,null,null,null,null,null,"No"]
[null,null,null,null,null,null,null,null,null,"No"]
[null,null,null,null,null,null,null,null,null,"No"]
[null,null,null,null,null,null,null,null,null,"No"]
[null,null,null,null,null,null,null,null,null,"No"]
[null,null,null,null,null,null,null,null,null,"No"]
[null,null,null,null,null,null,null,null,null,"No"]
[null,null,null,null,null,null,null,null,null,"No"]
[null,null,null,null,null,null,null,null,null,"No"]
[null,null,null,null,null,null,null,null,null,"No"]
[null,null,null,null,null,null,null,null,null,"No"]
[null,null,null,null,null,null,null,null,null,"No"]
[null,null,null,null,null,null,null,null,null,"No"]
[null,null,null,null,null,null,null,null,null,"No"]
[null,null,null,null,null,null,null,null,null,"No"]
[null,null,null,null,null,null,null,null,null,"No"]
[null,null,null,null,null,null,null,null,null,"No"]
[null,null,null,null,null,null,null,null,null,"No"]
[null,null,null,null,null,null,null,null,null,"No"]
[null,null,null,null,null,null,null,null,null,"No"]
[null,null,null,null,null,null,null,null,null,"No"]
[null,null,null,null,null,null,null,null,null,"No"]
[null,null,null,null,null,null,null,null,null,"No"]
[null,null,null,null,null,null,null,null,null,"No"]
[null,null,null,null,null,null,null,null,null,"No"]
[null,null,null,null,null,null,null,null,null,"No"]
[null,null,null,null,null,null,null,null,null,"No"]
[null,null,null,null,null,null,null,null,null,"No"]
[null,null,null,null,null,null,null,null,null,"No"]
[null,null,null,null,null,null,null,null,null,"No"]
[null,null,null,null,null,null,null,null,null,"No"]
[null,null,null,null,null,null,null,null,null,"No"]
[null,null,null,null,null,null,null,null,null,"No"]
[null,null,null,null,null,null,null,null,null,"No"]
[null,null,null,null,null,null,null,null,null,"No"]
[null,null,null,null,null,null,null,null,null,"No"]
[null,null,null,null,null,null,null,null,null,"No"]
[null,null,null,null,null,null,null,null,null,"No"]
[null,null,null,null,null,null,null,null,null,"No"]
[null,null,null,null,null,null,null,null,null,"No"]
[null,null,null,null,null,null,null,null,null,"No"]
[null,null,null,null,null,null,null,null,null,"No"]
[null,null,null,null,null,null,null,null,null,"No"]
[null,null,null,null,null,null,null,null,null,"No"]
[null,null,null,null,null,null,null,null,null,"No"]
[null,null,null,null,null,null,null,null,null,"No"]
[null,null,null,null,null,null,null,null,null,"No"]
[null,null,null,null,null,null,null,null,null,"No"]
[null,null,null,null,null,null,null,null,null,"No"]
[null,null,null,null,null,null,null,null,null,"No"]
[null,null,null,null,null,null,null,null,null,"No"]
[null,null,null,null,null,null,null,null,null,"No"]
[null,null,null,null,null,null,null,null,null,"No"]
[null,null,null,null,null,null,null,null,null,"No"]
[null,null,null,null,null,null,null,null,null,"No"]
[null,null,null,null,null,null,null,null,null,"No"]
[null,null,null,null,null,null,null,null,null,"No"]
[null,null,null,null,null,null,null,null,null,"No"]
[null,null,null,null,null,null,null,null,null,"No"]
[null,null,null,null,null,null,null,null,null,"No"]
[null,null,null,null,null,null,null,null,null,"No"]
[null,null,null,null,null,null,null,null,null,"No"]
[null,null,null,null,null,null,null,null,null,"No"]
[null,null,null,null,null,null,null,null,null,"No"]
[null,null,null,null,null,null,null,null,null,"No"]
[null,null,null,null,null,null,null,null,null,"No"]
[null,null,null,null,null,null,null,null,null,"No"]
[null,null,null,null,null,null,null,null,null,"No"]
[null,null,null,null,null,null,null,null,null,"No"]
[null,null,null,null,null,null,null,null,null,"No"]
[null,null,null,null,null,null,null,null,null,"No"]
[null,null,null,null,null,null,null,null,null,"No"]
[null,null,null,null,null,null,null,null,null,"No"]
[null,null,null,null,null,null,null,null,null,"No"]
[null,null,null,null,null,null,null,null,null,"No"]
[null,null,null,null,null,null,null,null,null,"No"]
[null,null,null,null,null,null,null,null,null,"No"]
[null,null,null,null,null,null,null,null,null,"No"]
[null,null,null,null,null,null,null,null,null,"No"]
[null,null,null,null,null,null,null,null,null,"No"]
[null,null,null,null,null,null,null,null,null,"No"]
[null,null,null,null,null,null,null,null,null,"No"]
[null,null,null,null,null,null,null,null,null,"No"]
[null,null,null,null,null,null,null,null,null,"No"]
[null,null,null,null,null,null,null,null,null,"No"]
[null,null,null,null,null,null,null,null,null,"No"]
[null,null,null,null,null,null,null,null,null,"No"]
[null,null,null,null,null,null,null,null,null,"No"]
[null,null,null,null,null,null,null,null,null,"No"]
[null,null,null,null,null,null,null,null,null,"No"]
[null,null,null,null,null,null,null,null,null,"No"]
[null,null,null,null,null,null,null,null,null,"No"]
[null,null,null,null,null,null,null,null,null,"No"]
[null,null,null,null,null,null,null,null,null,"No"]
[null,null,null,null,null,null,null,null,null,"No"]
[null,null,null,null,null,null,null,null,null,"No"]
[null,null,null,null,null,null,null,null,null,"No"]
[null,null,null,null,null,null,null,null,null,"No"]
[null,null,null,null,null,null,null,null,null,"No"]
[null,null,null,null,null,null,null,null,null,"No"]
[null,null,null,null,null,null,null,null,null,"No"]
[null,null,null,null,null,null,null,null,null,"No"]
[null,null,null,null,null,null,null,null,null,"No"]
[null,null,null,null,null,null,null,null,null,"No"]
[null,null,null,null,null,null,null,null,null,"No"]
[null,null,null,null,null,null,null,null,null,"No"]
[null,null,null,null,null,null,null,null,null,"No"]
[null,null,null,null,null,null,null,null,null,"No"]
[null,null,null,null,null,null,null,null,null,"No"]
[null,null,null,null,null,null,null,null,null,"No"]
[null,null,null,null,null,null,null,null,null,"No"]
[null,null,null,null,null,null,null,null,null,"No"]
[null,null,null,null,null,null,null,null,null,"No"]
[null,null,null,null,null,null,null,null,null,"No"]
[null,null,null,null,null,null,null,null,null,"No"]
[null,null,null,null,null,null,null,null,null,"No"]
[null,null,null,null,null,null,null,null,null,"No"]
[null,null,null,null,null,null,null,null,null,"No"]
[null,null,null,null,null,null,null,null,null,"No"]
[null,null,null,null,null,null,null,null,null,"No"]
[null,null,null,null,null,null,null,null,null,"No"]
[null,null,null,null,null,null,null,null,null,"No"]
[null,null,null,null,null,null,null,null,null,"No"]
[null,null,null,null,null,null,null,null,null,"No"]
[null,null,null,null,null,null,null,null,null,"No"]
[null,null,null,null,null,null,null,null,null,"No"]
[null,null,null,null,null,null,null,null,null,"No"]
[null,null,null,null,null,null,null,null,null,"No"]
[null,null,null,null,null,null,null,null,null,"No"]
[null,null,null,null,null,null,null,null,null,"No"]
[null,null,null,null,null,null,null,null,null,"No"]
[null,null,null,null,null,null,null,null,null,"No"]
[null,null,null,null,null,null,null,null,null,"No"]
[null,null,null,null,null,null,null,null,null,"No"]
[null,null,null,null,null,null,null,null,null,"No"]
[null,null,null,null,null,null,null,null,null,"No"]
[null,null,null,null,null,null,null,null,null,"No"]
[null,null,null,null,null,null,null,null,null,"No"]
[null,null,null,null,null,null,null,null,null,"No"]
[null,null,null,null,null,null,null,null,null,"No"]
[null,null,null,null,null,null,null,null,null,"No"]
[null,null,null,null,null,null,null,null,null,"No"]
[null,null,null,null,null,null,null,null,null,"No"]
[null,null,null,null,null,null,null,null,null,"No"]
[null,null,null,null,null,null,null,null,null,"No"]
[null,null,null,null,null,null,null,null,null,"No"]
[null,null,null,null,null,null,null,null,null,"No"]
[null,null,null,null,null,null,null,null,null,"No"]
[null,null,null,null,null,null,null,null,null,"No"]
[null,null,null,null,null,null,null,null,null,"No"]
[null,null,null,null,null,null,null,null,null,"No"]
[null,null,null,null,null,null,null,null,null,"No"]
[null,null,null,null,null,null,null,null,null,"No"]
[null,null,null,null,null,null,null,null,null,"No"]
[null,null,null,null,null,null,null,null,null,"No"]
[null,null,null,null,null,null,null,null,null,"No"]
[null,null,null,null,null,null,null,null,null,"No"]
[null,null,null,null,null,null,null,null,null,"No"]
[null,null,null,null,null,null,null,null,null,"No"]
[null,null,null,null,null,null,null,null,null,"No"]
[null,null,null,null,null,null,null,null,null,"No"]
[null,null,null,null,null,null,null,null,null,"No"]
[null,null,null,null,null,null,null,null,null,"No"]
[null,null,null,null,null,null,null,null,null,"No"]
[null,null,null,null,null,null,null,null,null,"No"]
[null,null,null,null,null,null,null,null,null,"No"]
[null,null,null,null,null,null,null,null,null,"No"]
[null,null,null,null,null,null,null,null,null,"No"]
[null,null,null,null,null,null,null,null,null,"No"]
[null,null,null,null,null,null,null,null,null,"No"]
[null,null,null,null,null,null,null,null,null,"No"]
[null,null,null,null,null,null,null,null,null,"No"]
[null,null,null,null,null,null,null,null,null,"No"]
[null,null,null,null,null,null,null,null,null,"No"]
[null,null,null,null,null,null,null,null,null,"No"]
[null,null,null,null,null,null,null,null,null,"No"]
[null,null,null,null,null,null,null,null,null,"No"]
[null,null,null,null,null,null,null,null,null,"No"]
[null,null,null,null,null,null,null,null,null,"No"]
[null,null,null,null,null,null,null,null,null,"No"]
[null,null,null,null,null,null,null,null,null,"No"]
[null,null,null,null,null,null,null,null,null,"No"]
[null,null,null,null,null,null,null,null,null,"No"]
[null,null,null,null,null,null,null,null,null,"No"]
[null,null,null,null,null,null,null,null,null,"No"]
[null,null,null,null,null,null,null,null,null,"No"]
[null,null,null,null,null,null,null,null,null,"No"]
[null,null,null,null,null,null,null,null,null,"No"]
[null,null,null,null,null,null,null,null,null,"No"]
[null,null,null,null,null,null,null,null,null,"No"]
[null,null,null,null,null,null,null,null,null,"No"]
[null,null,null,null,null,null,null,null,null,"No"]
[null,null,null,null,null,null,null,null,null,"No"]
[null,null,null,null,null,null,null,null,null,"No"]
[null,null,null,null,null,null,null,null,null,"No"]
[null,null,null,null,null,null,null,null,null,"No"]
[null,null,null,null,null,null,null,null,null,"No"]
[null,null,null,null,null,null,null,null,null,"No"]
[null,null,null,null,null,null,null,null,null,"No"]
[null,null,null,null,null,null,null,null,null,"No"]
[null,null,null,null,null,null,null,null,null,"No"]
[null,null,null,null,null,null,null,null,null,"No"]
[null,null,null,null,null,null,null,null,null,"No"]
[null,null,null,null,null,null,null,null,null,"No"]
[null,null,null,null,null,null,null,null,null,"No"]
[null,null,null,null,null,null,null,null,null,"No"]
[null,null,null,null,null,null,null,null,null,"No"]
[null,null,null,null,null,null,null,null,null,"No"]
[null,null,null,null,null,null,null,null,null,"No"]
[null,null,null,null,null,null,null,null,null,"No"]
[null,null,null,null,null,null,null,null,null,"No"]
[null,null,null,null,null,null,null,null,null,"No"]
[null,null,null,null,null,null,null,null,null,"No"]
[null,null,null,null,null,null,null,null,null,"No"]
[null,null,null,null,null,null,null,null,null,"No"]
[null,null,null,null,null,null,null,null,null,"No"]
[null,null,null,null,null,null,null,null,null,"No"]
[null,null,null,null,null,null,null,null,null,"No"]
[null,null,null,null,null,null,null,null,null,"No"]
[null,null,null,null,null,null,null,null,null,"No"]
[null,null,null,null,null,null,null,null,null,"No"]
[null,null,null,null,null,null,null,null,null,"No"]
[null,null,null,null,null,null,null,null,null,"No"]
[null,null,null,null,null,null,null,null,null,"No"]
[null,null,null,null,null,null,null,null,null,"No"]
[null,null,null,null,null,null,null,null,null,"No"]
[null,null,null,null,null,null,null,null,null,"No"]
[null,null,null,null,null,null,null,null,null,"No"]
[null,null,null,null,null,null,null,null,null,"No"]
[null,null,null,null,null,null,null,null,null,"No"]
[null,null,null,null,null,null,null,null,null,"No"]
[null,null,null,null,null,null,null,null,null,"No"]
[null,null,null,null,null,null,null,null,null,"No"]
[null,null,null,null,null,null,null,null,null,"No"]
[null,null,null,null,null,null,null,null,null,"No"]
[null,null,null,null,null,null,null,null,null,"No"]
[null,null,null,null,null,null,null,null,null,"No"]
[null,null,null,null,null,null,null,null,null,"No"]
[null,null,null,null,null,null,null,null,null,"No"]
[null,null,null,null,null,null,null,null,null,"No"]
[null,null,null,null,null,null,null,null,null,"No"]
[null,null,null,null,null,null,null,null,null,"No"]
[null,null,null,null,null,null,null,null,null,"No"]
[null,null,null,null,null,null,null,null,null,"No"]
[null,null,null,null,null,null,null,null,null,"No"]
[null,null,null,null,null,null,null,null,null,"No"]
[null,null,null,null,null,null,null,null,null,"No"]
[null,null,null,null,null,null,null,null,null,"No"]
[null,null,null,null,null,null,null,null,null,"No"]
[null,null,null,null,null,null,null,null,null,"No"]
[null,null,null,null,null,null,null,null,null,"No"]
[null,null,null,null,null,null,null,null,null,"No"]
[null,null,null,null,null,null,null,null,null,"No"]
[null,null,null,null,null,null,null,null,null,"No"]
[null,null,null,null,null,null,null,null,null,"No"]
[null,null,null,null,null,null,null,null,null,"No"]
[null,null,null,null,null,null,null,null,null,"No"]
[null,null,null,null,null,null,null,null,null,"No"]
[null,null,null,null,null,null,null,null,null,"No"]
[null,null,null,null,null,null,null,null,null,"No"]
[null,null,null,null,null,null,null,null,null,"No"]
[null,null,null,null,null,null,null,null,null,"No"]
[null,null,null,null,null,null,null,null,null,"No"]
[null,null,null,null,null,null,null,null,null,"No"]
[null,null,null,null,null,null,null,null,null,"No"]
[null,null,null,null,null,null,null,null,null,"No"]
[null,null,null,null,null,null,null,null,null,"No"]
[null,null,null,null,null,null,null,null,null,"No"]
[null,null,null,null,null,null,null,null,null,"No"]
[null,null,null,null,null,null,null,null,null,"No"]
[null,null,null,null,null,null,null,null,null,"No"]
[null,null,null,null,null,null,null,null,null,"No"]
[null,null,null,null,null,null,null,null,null,"No"]
[null,null,null,null,null,null,null,null,null,"No"]
[null,null,null,null,null,null,null,null,null,"No"]
[null,null,null,null,null,null,null,null,null,"No"]
[null,null,null,null,null,null,null,null,null,"No"]
[null,null,null,null,null,null,null,null,null,"No"]
[null,null,null,null,null,null,null,null,null,"No"]
[null,null,null,null,null,null,null,null,null,"No"]
[null,null,null,null,null,null,null,null,null,"No"]
[null,null,null,null,null,null,null,null,null,"No"]
[null,null,null,null,null,null,null,null,null,"No"]
[null,null,null,null,null,null,null,null,null,"No"]
[null,null,null,null,null,null,null,null,null,"No"]
[null,null,null,null,null,null,null,null,null,"No"]
[null,null,null,null,null,null,null,null,null,"No"]
[null,null,null,null,null,null,null,null,null,"No"]
[null,null,null,null,null,null,null,null,null,"No"]
[null,null,null,null,null,null,null,null,null,"No"]
[null,null,null,null,null,null,null,null,null,"No"]
[null,null,null,null,null,null,null,null,null,"No"]
[null,null,null,null,null,null,null,null,null,"No"]
[null,null,null,null,null,null,null,null,null,"No"]
[null,null,null,null,null,null,null,null,null,"No"]
[null,null,null,null,null,null,null,null,null,"No"]
[null,null,null,null,null,null,null,null,null,"No"]
[null,null,null,null,null,null,null,null,null,"No"]
[null,null,null,null,null,null,null,null,null,"No"]
[null,null,null,null,null,null,null,null,null,"No"]
[null,null,null,null,null,null,null,null,null,"No"]
[null,null,null,null,null,null,null,null,null,"No"]
[null,null,null,null,null,null,null,null,null,"No"]
[null,null,null,null,null,null,null,null,null,"No"]
[null,null,null,null,null,null,null,null,null,"No"]
[null,null,null,null,null,null,null,null,null,"No"]
[null,null,null,null,null,null,null,null,null,"No"]
[null,null,null,null,null,null,null,null,null,"No"]
[null,null,null,null,null,null,null,null,null,"No"]
[null,null,null,null,null,null,null,null,null,"No"]
[null,null,null,null,null,null,null,null,null,"No"]
[null,null,null,null,null,null,null,null,null,"No"]
[null,null,null,null,null,null,null,null,null,"No"]
[null,null,null,null,null,null,null,null,null,"No"]
[null,null,null,null,null,null,null,null,null,"No"]
[null,null,null,null,null,null,null,null,null,"No"]
[null,null,null,null,null,null,null,null,null,"No"]
[null,null,null,null,null,null,null,null,null,"No"]
[null,null,null,null,null,null,null,null,null,"No"]
[null,null,null,null,null,null,null,null,null,"No"]
[null,null,null,null,null,null,null,null,null,"No"]
[null,null,null,null,null,null,null,null,null,"No"]
[null,null,null,null,null,null,null,null,null,"No"]
[null,null,null,null,null,null,null,null,null,"No"]
[null,null,null,null,null,null,null,null,null,"No"]
[null,null,null,null,null,null,null,null,null,"No"]
[null,null,null,null,null,null,null,null,null,"No"]
[null,null,null,null,null,null,null,null,null,"No"]
[null,null,null,null,null,null,null,null,null,"No"]
[null,null,null,null,null,null,null,null,null,"No"]
[null,null,null,null,null,null,null,null,null,"No"]
[null,null,null,null,null,null,null,null,null,"No"]
[null,null,null,null,null,null,null,null,null,"No"]
[null,null,null,null,null,null,null,null,null,"No"]
[null,null,null,null,null,null,null,null,null,"No"]
[null,null,null,null,null,null,null,null,null,"No"]
[null,null,null,null,null,null,null,null,null,"No"]
[null,null,null,null,null,null,null,null,null,"No"]
[null,null,null,null,null,null,null,null,null,"No"]
[null,null,null,null,null,null,null,null,null,"No"]
[null,null,null,null,null,null,null,null,null,"No"]
[null,null,null,null,null,null,null,null,null,"No"]
[null,null,null,null,null,null,null,null,null,"No"]
[null,null,null,null,null,null,null,null,null,"No"]
[null,null,null,null,null,null,null,null,null,"No"]
[null,null,null,null,null,null,null,null,null,"No"]
[null,null,null,null,null,null,null,null,null,"No"]
[null,null,null,null,null,null,null,null,null,"No"]
[null,null,null,null,null,null,null,null,null,"No"]
[null,null,null,null,null,null,null,null,null,"No"]
[null,null,null,null,null,null,null,null,null,"No"]
[null,null,null,null,null,null,null,null,null,"No"]
[null,null,null,null,null,null,null,null,null,"No"]
[null,null,null,null,null,null,null,null,null,"No"]
[null,null,null,null,null,null,null,null,null,"No"]
[null,null,null,null,null,null,null,null,null,"No"]
[null,null,null,null,null,null,null,null,null,"No"]
[null,null,null,null,null,null,null,null,null,"No"]
[null,null,null,null,null,null,null,null,null,"No"]
[null,null,null,null,null,null,null,null,null,"No"]
[null,null,null,null,null,null,null,null,null,"No"]
[null,null,null,null,null,null,null,null,null,"No"]
[null,null,null,null,null,null,null,null,null,"No"]
[null,null,null,null,null,null,null,null,null,"No"]
[null,null,null,null,null,null,null,null,null,"No"]
[null,null,null,null,null,null,null,null,null,"No"]
[null,null,null,null,null,null,null,null,null,"No"]
[null,null,null,null,null,null,null,null,null,"No"]
[null,null,null,null,null,null,null,null,null,"No"]
[null,null,null,null,null,null,null,null,null,"No"]
[null,null,null,null,null,null,null,null,null,"No"]
[null,null,null,null,null,null,null,null,null,"No"]
[null,null,null,null,null,null,null,null,null,"No"]
[null,null,null,null,null,null,null,null,null,"No"]
[null,null,null,null,null,null,null,null,null,"No"]
[null,null,null,null,null,null,null,null,null,"No"]
[null,null,null,null,null,null,null,null,null,"No"]
[null,null,null,null,null,null,null,null,null,"No"]
[null,null,null,null,null,null,null,null,null,"No"]
[null,null,null,null,null,null,null,null,null,"No"]
[null,null,null,null,null,null,null,null,null,"No"]
[null,null,null,null,null,null,null,null,null,"No"]
[null,null,null,null,null,null,null,null,null,"No"]
[null,null,null,null,null,null,null,null,null,"No"]
[null,null,null,null,null,null,null,null,null,"No"]
[null,null,null,null,null,null,null,null,null,"No"]
[null,null,null,null,null,null,null,null,null,"No"]
[null,null,null,null,null,null,null,null,null,"No"]
[null,null,null,null,null,null,null,null,null,"No"]
[null,null,null,null,null,null,null,null,null,"No"]
[null,null,null,null,null,null,null,null,null,"No"]
[null,null,null,null,null,null,null,null,null,"No"]
[null,null,null,null,null,null,null,null,null,"No"]
[null,null,null,null,null,null,null,null,null,"No"]
[null,null,null,null,null,null,null,null,null,"No"]
[null,null,null,null,null,null,null,null,null,"No"]
[null,null,null,null,null,null,null,null,null,"No"]
[null,null,null,null,null,null,null,null,null,"No"]
[null,null,null,null,null,null,null,null,null,"No"]
[null,null,null,null,null,null,null,null,null,"No"]
[null,null,null,null,null,null,null,null,null,"No"]
[null,null,null,null,null,null,null,null,null,"No"]
[null,null,null,null,null,null,null,null,null,"No"]
[null,null,null,null,null,null,null,null,null,"No"]
[null,null,null,null,null,null,null,null,null,"No"]
[null,null,null,null,null,null,null,null,null,"No"]
[null,null,null,null,null,null,null,null,null,"No"]
[null,null,null,null,null,null,null,null,null,"No"]
[null,null,null,null,null,null,null,null,null,"No"]
[null,null,null,null,null,null,null,null,null,"No"]
[null,null,null,null,null,null,null,null,null,"No"]
[null,null,null,null,null,null,null,null,null,"No"]
[null,null,null,null,null,null,null,null,null,"No"]
[null,null,null,null,null,null,null,null,null,"No"]
[null,null,null,null,null,null,null,null,null,"No"]
[null,null,null,null,null,null,null,null,null,"No"]
[null,null,null,null,null,null,null,null,null,"No"]
[null,null,null,null,null,null,null,null,null,"No"]
[null,null,null,null,null,null,null,null,null,"No"]
[null,null,null,null,null,null,null,null,null,"No"]
[null,null,null,null,null,null,null,null,null,"No"]
[null,null,null,null,null,null,null,null,null,"No"]
[null,null,null,null,null,null,null,null,null,"No"]
[null,null,null,null,null,null,null,null,null,"No"]
[null,null,null,null,null,null,null,null,null,"No"]
[null,null,null,null,null,null,null,null,null,"No"]
[null,null,null,null,null,null,null,null,null,"No"]
[null,null,null,null,null,null,null,null,null,"No"]
[null,null,null,null,null,null,null,null,null,"No"]
[null,null,null,null,null,null,null,null,null,"No"]
[null,null,null,null,null,null,null,null,null,"No"]
[null,null,null,null,null,null,null,null,null,"No"]
[null,null,null,null,null,null,null,null,null,"No"]
[null,null,null,null,null,null,null,null,null,"No"]
[null,null,null,null,null,null,null,null,null,"No"]
[null,null,null,null,null,null,null,null,null,"No"]
[null,null,null,null,null,null,null,null,null,"No"]
[null,null,null,null,null,null,null,null,null,"No"]
[null,null,null,null,null,null,null,null,null,"No"]
[null,null,null,null,null,null,null,null,null,"No"]
[null,null,null,null,null,null,null,null,null,"No"]
[null,null,null,null,null,null,null,null,null,"No"]
[null,null,null,null,null,null,null,null,null,"No"]
[null,null,null,null,null,null,null,null,null,"No"]
[null,null,null,null,null,null,null,null,null,"No"]
[null,null,null,null,null,null,null,null,null,"No"]
[null,null,null,null,null,null,null,null,null,"No"]
[null,null,null,null,null,null,null,null,null,"No"]
[null,null,null,null,null,null,null,null,null,"No"]
[null,null,null,null,null,null,null,null,null,"No"]
[null,null,null,null,null,null,null,null,null,"No"]
[null,null,null,null,null,null,null,null,null,"No"]
[null,null,null,null,null,null,null,null,null,"No"]
[null,null,null,null,null,null,null,null,null,"No"]
[null,null,null,null,null,null,null,null,null,"No"]
[null,null,null,null,null,null,null,null,null,"No"]
[null,null,null,null,null,null,null,null,null,"No"]
[null,null,null,null,null,null,null,null,null,"No"]
[null,null,null,null,null,null,null,null,null,"No"]
[null,null,null,null,null,null,null,null,null,"No"]
[null,null,null,null,null,null,null,null,null,"No"]
[null,null,null,null,null,null,null,null,null,"No"]
[null,null,null,null,null,null,null,null,null,"No"]
[null,null,null,null,null,null,null,null,null,"No"]
[null,null,null,null,null,null,null,null,null,"No"]
[null,null,null,null,null,null,null,null,null,"No"]
[null,null,null,null,null,null,null,null,null,"No"]
[null,null,null,null,null,null,null,null,null,"No"]
[null,null,null,null,null,null,null,null,null,"No"]
[null,null,null,null,null,null,null,null,null,"No"]
[null,null,null,null,null,null,null,null,null,"No"]
[null,null,null,null,null,null,null,null,null,"No"]
[null,null,null,null,null,null,null,null,null,"No"]
[null,null,null,null,null,null,null,null,null,"No"]
[null,null,null,null,null,null,null,null,null,"No"]
[null,null,null,null,null,null,null,null,null,"No"]
[null,null,null,null,null,null,null,null,null,"No"]
[null,null,null,null,null,null,null,null,null,"No"]
[null,null,null,null,null,null,null,null,null,"No"]
[null,null,null,null,null,null,null,null,null,"No"]
[null,null,null,null,null,null,null,null,null,"No"]
[null,null,null,null,null,null,null,null,null,"No"]
[null,null,null,null,null,null,null,null,null,"No"]
[null,null,null,null,null,null,null,null,null,"No"]
[null,null,null,null,null,null,null,null,null,"No"]
[null,null,null,null,null,null,null,null,null,"No"]
[null,null,null,null,null,null,null,null,null,"No"]
[null,null,null,null,null,null,null,null,null,"No"]
[null,null,null,null,null,null,null,null,null,"No"]
[null,null,null,null,null,null,null,null,null,"No"]
[null,null,null,null,null,null,null,null,null,"No"]
[null,null,null,null,null,null,null,null,null,"No"]
[null,null,null,null,null,null,null,null,null,"No"]
[null,null,null,null,null,null,null,null,null,"No"]
[null,null,null,null,null,null,null,null,null,"No"]
[null,null,null,null,null,null,null,null,null,"No"]
[null,null,null,null,null,null,null,null,null,"No"]
[null,null,null,null,null,null,null,null,null,"No"]
[null,null,null,null,null,null,null,null,null,"No"]
[null,null,null,null,null,null,null,null,null,"No"]
[null,null,null,null,null,null,null,null,null,"No"]
[null,null,null,null,null,null,null,null,null,"No"]
[null,null,null,null,null,null,null,null,null,"No"]
[null,null,null,null,null,null,null,null,null,"No"]
[null,null,null,null,null,null,null,null,null,"No"]
[null,null,null,null,null,null,null,null,null,"No"]
[null,null,null,null,null,null,null,null,null,"No"]
[null,null,null,null,null,null,null,null,null,"No"]
[null,null,null,null,null,null,null,null,null,"No"]
[null,null,null,null,null,null,null,null,null,"No"]
[null,null,null,null,null,null,null,null,null,"No"]
[null,null,null,null,null,null,null,null,null,"No"]
[null,null,null,null,null,null,null,null,null,"No"]
[null,null,null,null,null,null,null,null,null,"No"]
[null,null,null,null,null,null,null,null,null,"No"]
[null,null,null,null,null,null,null,null,null,"No"]
[null,null,null,null,null,null,null,null,null,"No"]
[null,null,null,null,null,null,null,null,null,"No"]
[null,null,null,null,null,null,null,null,null,"No"]
[null,null,null,null,null,null,null,null,null,"No"]
[null,null,null,null,null,null,null,null,null,"No"]
[null,null,null,null,null,null,null,null,null,"No"]
[null,null,null,null,null,null,null,null,null,"No"]
[null,null,null,null,null,null,null,null,null,"No"]
[null,null,null,null,null,null,null,null,null,"No"]
[null,null,null,null,null,null,null,null,null,"No"]
[null,null,null,null,null,null,null,null,null,"No"]
[null,null,null,null,null,null,null,null,null,"No"]
[null,null,null,null,null,null,null,null,null,"No"]
[null,null,null,null,null,null,null,null,null,"No"]
[null,null,null,null,null,null,null,null,null,"No"]
[null,null,null,null,null,null,null,null,null,"No"]
[null,null,null,null,null,null,null,null,null,"No"]
[null,null,null,null,null,null,null,null,null,"No"]
[null,null,null,null,null,null,null,null,null,"No"]
[null,null,null,null,null,null,null,null,null,"No"]
[null,null,null,null,null,null,null,null,null,"No"]
[null,null,null,null,null,null,null,null,null,"No"]
[null,null,null,null,null,null,null,null,null,"No"]
[null,null,null,null,null,null,null,null,null,"No"]
[null,null,null,null,null,null,null,null,null,"No"]
[null,null,null,null,null,null,null,null,null,"No"]
[null,null,null,null,null,null,null,null,null,"No"]
[null,null,null,null,null,null,null,null,null,"No"]
[null,null,null,null,null,null,null,null,null,"No"]
[null,null,null,null,null,null,null,null,null,"No"]
[null,null,null,null,null,null,null,null,null,"No"]
[null,null,null,null,null,null,null,null,null,"No"]
[null,null,null,null,null,null,null,null,null,"No"]
[null,null,null,null,null,null,null,null,null,"No"]
[null,null,null,null,null,null,null,null,null,"No"]
[null,null,null,null,null,null,null,null,null,"No"]
[null,null,null,null,null,null,null,null,null,"No"]
[null,null,null,null,null,null,null,null,null,"No"]
[null,null,null,null,null,null,null,null,null,"No"]
[null,null,null,null,null,null,null,null,null,"No"]
[null,null,null,null,null,null,null,null,null,"No"]
[null,null,null,null,null,null,null,null,null,"No"]
[null,null,null,null,null,null,null,null,null,"No"]
[null,null,null,null,null,null,null,null,null,"No"]
[null,null,null,null,null,null,null,null,null,"No"]
[null,null,null,null,null,null,null,null,null,"No"]
[null,null,null,null,null,null,null,null,null,"No"]
[null,null,null,null,null,null,null,null,null,"No"]
[null,null,null,null,null,null,null,null,null,"No"]
[null,null,null,null,null,null,null,null,null,"No"]
[null,null,null,null,null,null,null,null,null,"No"]
[null,null,null,null,null,null,null,null,null,"No"]
[null,null,null,null,null,null,null,null,null,"No"]
[null,null,null,null,null,null,null,null,null,"No"]
[null,null,null,null,null,null,null,null,null,"No"]
[null,null,null,null,null,null,null,null,null,"No"]
[null,null,null,null,null,null,null,null,null,"No"]
[null,null,null,null,null,null,null,null,null,"No"]

{"sheet":"Station","index":6,"n_rows":1300,"n_cols":19,"rows_kept":1300,"cut":false,"hidden":false,"merged":[[18,0,18,7],[18,11,18,14],[0,11,0,15],[1,11,1,14],[2,11,2,14],[3,11,3,14],[4,10,4,13],[5,10,5,13]]}
[null,null,null,null,null,null,null,null,null,null,null,"Specified Thresholds",null,null,null,null,null,null,"Yes"]
[null,null,null,null,null,null,null,null,null,null,null,"Potentially Exposed Population",null,null,null,{"$f":"Thresholds!C24","v":302},null,null,"No"]
[null,null,null,null,null,null,null,null,null,null,null,"Property Loss",null,null,null,{"$f":"Thresholds!C25","v":"Yes"}]
[null,null,null,null,null,null,null,null,null,null,null,"Mission Importance",null,null,"Mission",{"$f":"Thresholds!C26","v":"Yes"}]
[]
[]
[]
[]
[]
[]
[]
[]
[]
[]
[]
[]
[]
[]
["TRANSIT/RAIL STATION",null,null,null,null,null,null,null,null,null,null,"CRITICALITY"]
["Asset ID","Quantity","Max Train Occupancy","Below ground?","Transfer Station?",null,"Comments",null,null,"Manually mark as critical?",null,"Potentially Exposed Population","Property Loss","Mission Importance","Manual Override"]
["North Station",2,1200,"No","Yes",null,null,null,null,"No",null,"Y",null,"Y"]
["South Station",4,1200,"No","Yes",null,null,null,null,"No",null,"Y",null,"Y"]
["Bay Station",1,1200,"Yes","Yes",null,null,null,null,"No",null,"Y","Y","Y"]
["Downtown Station",1,1200,"Yes","Yes",null,null,null,null,"No",null,"Y","Y","Y"]
["Market Station",1,1200,"Yes","Yes",null,null,null,null,"No",null,"Y","Y","Y"]
["Park Street Station",1,1200,"Yes","Yes",null,null,null,null,"No",null,"Y","Y","Y"]
["Government Center",1,1200,"Yes","Yes",null,null,null,null,"No",null,"Y","Y","Y"]
["State Street",1,1200,"Yes","Yes",null,null,null,null,"No",null,"Y","Y","Y"]
["College Station",1,1200,"Yes","No",null,null,null,null,"No",null,"Y","Y"]
["Suburban Station",1,1200,"Yes","Yes",null,null,null,null,"No",null,"Y","Y","Y"]
["Airport Station",3,1200,"No","No",null,null,null,null,"No",null,"Y"]
["All other aboveground ",20,1200,"No","No",null,null,null,null,"No",null,"Y"]
["All other belowground",13,1200,"Yes","No",null,null,null,null,"No",null,"Y","Y"]
[null,null,null,null,null,null,null,null,null,"No"]
[null,null,null,null,null,null,null,null,null,"No"]
[null,null,null,null,null,null,null,null,null,"No"]
[null,null,null,null,null,null,null,null,null,"No"]
[null,null,null,null,null,null,null,null,null,"No"]
[null,null,null,null,null,null,null,null,null,"No"]
[null,null,null,null,null,null,null,null,null,"No"]
[null,null,null,null,null,null,null,null,null,"No"]
[null,null,null,null,null,null,null,null,null,"No"]
[null,null,null,null,null,null,null,null,null,"No"]
[null,null,null,null,null,null,null,null,null,"No"]
[null,null,null,null,null,null,null,null,null,"No"]
[null,null,null,null,null,null,null,null,null,"No"]
[null,null,null,null,null,null,null,null,null,"No"]
[null,null,null,null,null,null,null,null,null,"No"]
[null,null,null,null,null,null,null,null,null,"No"]
[null,null,null,null,null,null,null,null,null,"No"]
[null,null,null,null,null,null,null,null,null,"No"]
[null,null,null,null,null,null,null,null,null,"No"]
[null,null,null,null,null,null,null,null,null,"No"]
[null,null,null,null,null,null,null,null,null,"No"]
[null,null,null,null,null,null,null,null,null,"No"]
[null,null,null,null,null,null,null,null,null,"No"]
[null,null,null,null,null,null,null,null,null,"No"]
[null,null,null,null,null,null,null,null,null,"No"]
[null,null,null,null,null,null,null,null,null,"No"]
[null,null,null,null,null,null,null,null,null,"No"]
[null,null,null,null,null,null,null,null,null,"No"]
[null,null,null,null,null,null,null,null,null,"No"]
[null,null,null,null,null,null,null,null,null,"No"]
[null,null,null,null,null,null,null,null,null,"No"]
[null,null,null,null,null,null,null,null,null,"No"]
[null,null,null,null,null,null,null,null,null,"No"]
[null,null,null,null,null,null,null,null,null,"No"]
[null,null,null,null,null,null,null,null,null,"No"]
[null,null,null,null,null,null,null,null,null,"No"]
[null,null,null,null,null,null,null,null,null,"No"]
[null,null,null,null,null,null,null,null,null,"No"]
[null,null,null,null,null,null,null,null,null,"No"]
[null,null,null,null,null,null,null,null,null,"No"]
[null,null,null,null,null,null,null,null,null,"No"]
[null,null,null,null,null,null,null,null,null,"No"]
[null,null,null,null,null,null,null,null,null,"No"]
[null,null,null,null,null,null,null,null,null,"No"]
[null,null,null,null,null,null,null,null,null,"No"]
[null,null,null,null,null,null,null,null,null,"No"]
[null,null,null,null,null,null,null,null,null,"No"]
[null,null,null,null,null,null,null,null,null,"No"]
[null,null,null,null,null,null,null,null,null,"No"]
[null,null,null,null,null,null,null,null,null,"No"]
[null,null,null,null,null,null,null,null,null,"No"]
[null,null,null,null,null,null,null,null,null,"No"]
[null,null,null,null,null,null,null,null,null,"No"]
[null,null,null,null,null,null,null,null,null,"No"]
[null,null,null,null,null,null,null,null,null,"No"]
[null,null,null,null,null,null,null,null,null,"No"]
[null,null,null,null,null,null,null,null,null,"No"]
[null,null,null,null,null,null,null,null,null,"No"]
[null,null,null,null,null,null,null,null,null,"No"]
[null,null,null,null,null,null,null,null,null,"No"]
[null,null,null,null,null,null,null,null,null,"No"]
[null,null,null,null,null,null,null,null,null,"No"]
[null,null,null,null,null,null,null,null,null,"No"]
[null,null,null,null,null,null,null,null,null,"No"]
[null,null,null,null,null,null,null,null,null,"No"]
[null,null,null,null,null,null,null,null,null,"No"]
[null,null,null,null,null,null,null,null,null,"No"]
[null,null,null,null,null,null,null,null,null,"No"]
[null,null,null,null,null,null,null,null,null,"No"]
[null,null,null,null,null,null,null,null,null,"No"]
[null,null,null,null,null,null,null,null,null,"No"]
[null,null,null,null,null,null,null,null,null,"No"]
[null,null,null,null,null,null,null,null,null,"No"]
[null,null,null,null,null,null,null,null,null,"No"]
[null,null,null,null,null,null,null,null,null,"No"]
[null,null,null,null,null,null,null,null,null,"No"]
[null,null,null,null,null,null,null,null,null,"No"]
[null,null,null,null,null,null,null,null,null,"No"]
[null,null,null,null,null,null,null,null,null,"No"]
[null,null,null,null,null,null,null,null,null,"No"]
[null,null,null,null,null,null,null,null,null,"No"]
[null,null,null,null,null,null,null,null,null,"No"]
[null,null,null,null,null,null,null,null,null,"No"]
[null,null,null,null,null,null,null,null,null,"No"]
[null,null,null,null,null,null,null,null,null,"No"]
[null,null,null,null,null,null,null,null,null,"No"]
[null,null,null,null,null,null,null,null,null,"No"]
[null,null,null,null,null,null,null,null,null,"No"]
[null,null,null,null,null,null,null,null,null,"No"]
[null,null,null,null,null,null,null,null,null,"No"]
[null,null,null,null,null,null,null,null,null,"No"]
[null,null,null,null,null,null,null,null,null,"No"]
[null,null,null,null,null,null,null,null,null,"No"]
[null,null,null,null,null,null,null,null,null,"No"]
[null,null,null,null,null,null,null,null,null,"No"]
[null,null,null,null,null,null,null,null,null,"No"]
[null,null,null,null,null,null,null,null,null,"No"]
[null,null,null,null,null,null,null,null,null,"No"]
[null,null,null,null,null,null,null,null,null,"No"]
[null,null,null,null,null,null,null,null,null,"No"]
[null,null,null,null,null,null,null,null,null,"No"]
[null,null,null,null,null,null,null,null,null,"No"]
[null,null,null,null,null,null,null,null,null,"No"]
[null,null,null,null,null,null,null,null,null,"No"]
[null,null,null,null,null,null,null,null,null,"No"]
[null,null,null,null,null,null,null,null,null,"No"]
[null,null,null,null,null,null,null,null,null,"No"]
[null,null,null,null,null,null,null,null,null,"No"]
[null,null,null,null,null,null,null,null,null,"No"]
[null,null,null,null,null,null,null,null,null,"No"]
[null,null,null,null,null,null,null,null,null,"No"]
[null,null,null,null,null,null,null,null,null,"No"]
[null,null,null,null,null,null,null,null,null,"No"]
[null,null,null,null,null,null,null,null,null,"No"]
[null,null,null,null,null,null,null,null,null,"No"]
[null,null,null,null,null,null,null,null,null,"No"]
[null,null,null,null,null,null,null,null,null,"No"]
[null,null,null,null,null,null,null,null,null,"No"]
[null,null,null,null,null,null,null,null,null,"No"]
[null,null,null,null,null,null,null,null,null,"No"]
[null,null,null,null,null,null,null,null,null,"No"]
[null,null,null,null,null,null,null,null,null,"No"]
[null,null,null,null,null,null,null,null,null,"No"]
[null,null,null,null,null,null,null,null,null,"No"]
[null,null,null,null,null,null,null,null,null,"No"]
[null,null,null,null,null,null,null,null,null,"No"]
[null,null,null,null,null,null,null,null,null,"No"]
[null,null,null,null,null,null,null,null,null,"No"]
[null,null,null,null,null,null,null,null,null,"No"]
[null,null,null,null,null,null,null,null,null,"No"]
[null,null,null,null,null,null,null,null,null,"No"]
[null,null,null,null,null,null,null,null,null,"No"]
[null,null,null,null,null,null,null,null,null,"No"]
[null,null,null,null,null,null,null,null,null,"No"]
[null,null,null,null,null,null,null,null,null,"No"]
[null,null,null,null,null,null,null,null,null,"No"]
[null,null,null,null,null,null,null,null,null,"No"]
[null,null,null,null,null,null,null,null,null,"No"]
[null,null,null,null,null,null,null,null,null,"No"]
[null,null,null,null,null,null,null,null,null,"No"]
[null,null,null,null,null,null,null,null,null,"No"]
[null,null,null,null,null,null,null,null,null,"No"]
[null,null,null,null,null,null,null,null,null,"No"]
[null,null,null,null,null,null,null,null,null,"No"]
[null,null,null,null,null,null,null,null,null,"No"]
[null,null,null,null,null,null,null,null,null,"No"]
[null,null,null,null,null,null,null,null,null,"No"]
[null,null,null,null,null,null,null,null,null,"No"]
[null,null,null,null,null,null,null,null,null,"No"]
[null,null,null,null,null,null,null,null,null,"No"]
[null,null,null,null,null,null,null,null,null,"No"]
[null,null,null,null,null,null,null,null,null,"No"]
[null,null,null,null,null,null,null,null,null,"No"]
[null,null,null,null,null,null,null,null,null,"No"]
[null,null,null,null,null,null,null,null,null,"No"]
[null,null,null,null,null,null,null,null,null,"No"]
[null,null,null,null,null,null,null,null,null,"No"]
[null,null,null,null,null,null,null,null,null,"No"]
[null,null,null,null,null,null,null,null,null,"No"]
[null,null,null,null,null,null,null,null,null,"No"]
[null,null,null,null,null,null,null,null,null,"No"]
[null,null,null,null,null,null,null,null,null,"No"]
[null,null,null,null,null,null,null,null,null,"No"]
[null,null,null,null,null,null,null,null,null,"No"]
[null,null,null,null,null,null,null,null,null,"No"]
[null,null,null,null,null,null,null,null,null,"No"]
[null,null,null,null,null,null,null,null,null,"No"]
[null,null,null,null,null,null,null,null,null,"No"]
[null,null,null,null,null,null,null,null,null,"No"]
[null,null,null,null,null,null,null,null,null,"No"]
[null,null,null,null,null,null,null,null,null,"No"]
[null,null,null,null,null,null,null,null,null,"No"]
[null,null,null,null,null,null,null,null,null,"No"]
[null,null,null,null,null,null,null,null,null,"No"]
[null,null,null,null,null,null,null,null,null,"No"]
[null,null,null,null,null,null,null,null,null,"No"]
[null,null,null,null,null,null,null,null,null,"No"]
[null,null,null,null,null,null,null,null,null,"No"]
[null,null,null,null,null,null,null,null,null,"No"]
[null,null,null,null,null,null,null,null,null,"No"]
[null,null,null,null,null,null,null,null,null,"No"]
[null,null,null,null,null,null,null,null,null,"No"]
[null,null,null,null,null,null,null,null,null,"No"]
[null,null,null,null,null,null,null,null,null,"No"]
[null,null,null,null,null,null,null,null,null,"No"]
[null,null,null,null,null,null,null,null,null,"No"]
[null,null,null,null,null,null,null,null,null,"No"]
[null,null,null,null,null,null,null,null,null,"No"]
[null,null,null,null,null,null,null,null,null,"No"]
[null,null,null,null,null,null,null,null,null,"No"]
[null,null,null,null,null,null,null,null,null,"No"]
[null,null,null,null,null,null,null,null,null,"No"]
[null,null,null,null,null,null,null,null,null,"No"]
[null,null,null,null,null,null,null,null,null,"No"]
[null,null,null,null,null,null,null,null,null,"No"]
[null,null,null,null,null,null,null,null,null,"No"]
[null,null,null,null,null,null,null,null,null,"No"]
[null,null,null,null,null,null,null,null,null,"No"]
[null,null,null,null,null,null,null,null,null,"No"]
[null,null,null,null,null,null,null,null,null,"No"]
[null,null,null,null,null,null,null,null,null,"No"]
[null,null,null,null,null,null,null,null,null,"No"]
[null,null,null,null,null,null,null,null,null,"No"]
[null,null,null,null,null,null,null,null,null,"No"]
[null,null,null,null,null,null,null,null,null,"No"]
[null,null,null,null,null,null,null,null,null,"No"]
[null,null,null,null,null,null,null,null,null,"No"]
[null,null,null,null,null,null,null,null,null,"No"]
[null,null,null,null,null,null,null,null,null,"No"]
[null,null,null,null,null,null,null,null,null,"No"]
[null,null,null,null,null,null,null,null,null,"No"]
[null,null,null,null,null,null,null,null,null,"No"]
[null,null,null,null,null,null,null,null,null,"No"]
[null,null,null,null,null,null,null,null,null,"No"]
[null,null,null,null,null,null,null,null,null,"No"]
[null,null,null,null,null,null,null,null,null,"No"]
[null,null,null,null,null,null,null,null,null,"No"]
[null,null,null,null,null,null,null,null,null,"No"]
[null,null,null,null,null,null,null,null,null,"No"]
[null,null,null,null,null,null,null,null,null,"No"]
[null,null,null,null,null,null,null,null,null,"No"]
[null,null,null,null,null,null,null,null,null,"No"]
[null,null,null,null,null,null,null,null,null,"No"]
[null,null,null,null,null,null,null,null,null,"No"]
[null,null,null,null,null,null,null,null,null,"No"]
[null,null,null,null,null,null,null,null,null,"No"]
[null,null,null,null,null,null,null,null,null,"No"]
[null,null,null,null,null,null,null,null,null,"No"]
[null,null,null,null,null,null,null,null,null,"No"]
[null,null,null,null,null,null,null,null,null,"No"]
[null,null,null,null,null,null,null,null,null,"No"]
[null,null,null,null,null,null,null,null,null,"No"]
[null,null,null,null,null,null,null,null,null,"No"]
[null,null,null,null,null,null,null,null,null,"No"]
[null,null,null,null,null,null,null,null,null,"No"]
[null,null,null,null,null,null,null,null,null,"No"]
[null,null,null,null,null,null,null,null,null,"No"]
[null,null,null,null,null,null,null,null,null,"No"]
[null,null,null,null,null,null,null,null,null,"No"]
[null,null,null,null,null,null,null,null,null,"No"]
[null,null,null,null,null,null,null,null,null,"No"]
[null,null,null,null,null,null,null,null,null,"No"]
[null,null,null,null,null,null,null,null,null,"No"]
[null,null,null,null,null,null,null,null,null,"No"]
[null,null,null,null,null,null,null,null,null,"No"]
[null,null,null,null,null,null,null,null,null,"No"]
[null,null,null,null,null,null,null,null,null,"No"]
[null,null,null,null,null,null,null,null,null,"No"]
[null,null,null,null,null,null,null,null,null,"No"]
[null,null,null,null,null,null,null,null,null,"No"]
[null,null,null,null,null,null,null,null,null,"No"]
[null,null,null,null,null,null,null,null,null,"No"]
[null,null,null,null,null,null,null,null,null,"No"]
[null,null,null,null,null,null,null,null,null,"No"]
[null,null,null,null,null,null,null,null,null,"No"]
[null,null,null,null,null,null,null,null,null,"No"]
[null,null,null,null,null,null,null,null,null,"No"]
[null,null,null,null,null,null,null,null,null,"No"]
[null,null,null,null,null,null,null,null,null,"No"]
[null,null,null,null,null,null,null,null,null,"No"]
[null,null,null,null,null,null,null,null,null,"No"]
[null,null,null,null,null,null,null,null,null,"No"]
[null,null,null,null,null,null,null,null,null,"No"]
[null,null,null,null,null,null,null,null,null,"No"]
[null,null,null,null,null,null,null,null,null,"No"]
[null,null,null,null,null,null,null,null,null,"No"]
[null,null,null,null,null,null,null,null,null,"No"]
[null,null,null,null,null,null,null,null,null,"No"]
[null,null,null,null,null,null,null,null,null,"No"]
[null,null,null,null,null,null,null,null,null,"No"]
[null,null,null,null,null,null,null,null,null,"No"]
[null,null,null,null,null,null,null,null,null,"No"]
[null,null,null,null,null,null,null,null,null,"No"]
[null,null,null,null,null,null,null,null,null,"No"]
[null,null,null,null,null,null,null,null,null,"No"]
[null,null,null,null,null,null,null,null,null,"No"]
[null,null,null,null,null,null,null,null,null,"No"]
[null,null,null,null,null,null,null,null,null,"No"]
[null,null,null,null,null,null,null,null,null,"No"]
[null,null,null,null,null,null,null,null,null,"No"]
[null,null,null,null,null,null,null,null,null,"No"]
[null,null,null,null,null,null,null,null,null,"No"]
[null,null,null,null,null,null,null,null,null,"No"]
[null,null,null,null,null,null,null,null,null,"No"]
[null,null,null,null,null,null,null,null,null,"No"]
[null,null,null,null,null,null,null,null,null,"No"]
[null,null,null,null,null,null,null,null,null,"No"]
[null,null,null,null,null,null,null,null,null,"No"]
[null,null,null,null,null,null,null,null,null,"No"]
[null,null,null,null,null,null,null,null,null,"No"]
[null,null,null,null,null,null,null,null,null,"No"]
[null,null,null,null,null,null,null,null,null,"No"]
[null,null,null,null,null,null,null,null,null,"No"]
[null,null,null,null,null,null,null,null,null,"No"]
[null,null,null,null,null,null,null,null,null,"No"]
[null,null,null,null,null,null,null,null,null,"No"]
[null,null,null,null,null,null,null,null,null,"No"]
[null,null,null,null,null,null,null,null,null,"No"]
[null,null,null,null,null,null,null,null,null,"No"]
[null,null,null,null,null,null,null,null,null,"No"]
[null,null,null,null,null,null,null,null,null,"No"]
[null,null,null,null,null,null,null,null,null,"No"]
[null,null,null,null,null,null,null,null,null,"No"]
[null,null,null,null,null,null,null,null,null,"No"]
[null,null,null,null,null,null,null,null,null,"No"]
[null,null,null,null,null,null,null,null,null,"No"]
[null,null,null,null,null,null,null,null,null,"No"]
[null,null,null,null,null,null,null,null,null,"No"]
[null,null,null,null,null,null,null,null,null,"No"]
[null,null,null,null,null,null,null,null,null,"No"]
[null,null,null,null,null,null,null,null,null,"No"]
[null,null,null,null,null,null,null,null,null,"No"]
[null,null,null,null,null,null,null,null,null,"No"]
[null,null,null,null,null,null,null,null,null,"No"]
[null,null,null,null,null,null,null,null,null,"No"]
[null,null,null,null,null,null,null,null,null,"No"]
[null,null,null,null,null,null,null,null,null,"No"]
[null,null,null,null,null,null,null,null,null,"No"]
[null,null,null,null,null,null,null,null,null,"No"]
[null,null,null,null,null,null,null,null,null,"No"]
[null,null,null,null,null,null,null,null,null,"No"]
[null,null,null,null,null,null,null,null,null,"No"]
[null,null,null,null,null,null,null,null,null,"No"]
[null,null,null,null,null,null,null,null,null,"No"]
[null,null,null,null,null,null,null,null,null,"No"]
[null,null,null,null,null,null,null,null,null,"No"]
[null,null,null,null,null,null,null,null,null,"No"]
[null,null,null,null,null,null,null,null,null,"No"]
[null,null,null,null,null,null,null,null,null,"No"]
[null,null,null,null,null,null,null,null,null,"No"]
[null,null,null,null,null,null,null,null,null,"No"]
[null,null,null,null,null,null,null,null,null,"No"]
[null,null,null,null,null,null,null,null,null,"No"]
[null,null,null,null,null,null,null,null,null,"No"]
[null,null,null,null,null,null,null,null,null,"No"]
[null,null,null,null,null,null,null,null,null,"No"]
[null,null,null,null,null,null,null,null,null,"No"]
[null,null,null,null,null,null,null,null,null,"No"]
[null,null,null,null,null,null,null,null,null,"No"]
[null,null,null,null,null,null,null,null,null,"No"]
[null,null,null,null,null,null,null,null,null,"No"]
[null,null,null,null,null,null,null,null,null,"No"]
[null,null,null,null,null,null,null,null,null,"No"]
[null,null,null,null,null,null,null,null,null,"No"]
[null,null,null,null,null,null,null,null,null,"No"]
[null,null,null,null,null,null,null,null,null,"No"]
[null,null,null,null,null,null,null,null,null,"No"]
[null,null,null,null,null,null,null,null,null,"No"]
[null,null,null,null,null,null,null,null,null,"No"]
[null,null,null,null,null,null,null,null,null,"No"]
[null,null,null,null,null,null,null,null,null,"No"]
[null,null,null,null,null,null,null,null,null,"No"]
[null,null,null,null,null,null,null,null,null,"No"]
[null,null,null,null,null,null,null,null,null,"No"]
[null,null,null,null,null,null,null,null,null,"No"]
[null,null,null,null,null,null,null,null,null,"No"]
[null,null,null,null,null,null,null,null,null,"No"]
[null,null,null,null,null,null,null,null,null,"No"]
[null,null,null,null,null,null,null,null,null,"No"]
[null,null,null,null,null,null,null,null,null,"No"]
[null,null,null,null,null,null,null,null,null,"No"]
[null,null,null,null,null,null,null,null,null,"No"]
[null,null,null,null,null,null,null,null,null,"No"]
[null,null,null,null,null,null,null,null,null,"No"]
[null,null,null,null,null,null,null,null,null,"No"]
[null,null,null,null,null,null,null,null,null,"No"]
[null,null,null,null,null,null,null,null,null,"No"]
[null,null,null,null,null,null,null,null,null,"No"]
[null,null,null,null,null,null,null,null,null,"No"]
[null,null,null,null,null,null,null,null,null,"No"]
[null,null,null,null,null,null,null,null,null,"No"]
[null,null,null,null,null,null,null,null,null,"No"]
[null,null,null,null,null,null,null,null,null,"No"]
[null,null,null,null,null,null,null,null,null,"No"]
[null,null,null,null,null,null,null,null,null,"No"]
[null,null,null,null,null,null,null,null,null,"No"]
[null,null,null,null,null,null,null,null,null,"No"]
[null,null,null,null,null,null,null,null,null,"No"]
[null,null,null,null,null,null,null,null,null,"No"]
[null,null,null,null,null,null,null,null,null,"No"]
[null,null,null,null,null,null,null,null,null,"No"]
[null,null,null,null,null,null,null,null,null,"No"]
[null,null,null,null,null,null,null,null,null,"No"]
[null,null,null,null,null,null,null,null,null,"No"]
[null,null,null,null,null,null,null,null,null,"No"]
[null,null,null,null,null,null,null,null,null,"No"]
[null,null,null,null,null,null,null,null,null,"No"]
[null,null,null,null,null,null,null,null,null,"No"]
[null,null,null,null,null,null,null,null,null,"No"]
[null,null,null,null,null,null,null,null,null,"No"]
[null,null,null,null,null,null,null,null,null,"No"]
[null,null,null,null,null,null,null,null,null,"No"]
[null,null,null,null,null,null,null,null,null,"No"]
[null,null,null,null,null,null,null,null,null,"No"]
[null,null,null,null,null,null,null,null,null,"No"]
[null,null,null,null,null,null,null,null,null,"No"]
[null,null,null,null,null,null,null,null,null,"No"]
[null,null,null,null,null,null,null,null,null,"No"]
[null,null,null,null,null,null,null,null,null,"No"]
[null,null,null,null,null,null,null,null,null,"No"]
[null,null,null,null,null,null,null,null,null,"No"]
[null,null,null,null,null,null,null,null,null,"No"]
[null,null,null,null,null,null,null,null,null,"No"]
[null,null,null,null,null,null,null,null,null,"No"]
[null,null,null,null,null,null,null,null,null,"No"]
[null,null,null,null,null,null,null,null,null,"No"]
[null,null,null,null,null,null,null,null,null,"No"]
[null,null,null,null,null,null,null,null,null,"No"]
[null,null,null,null,null,null,null,null,null,"No"]
[null,null,null,null,null,null,null,null,null,"No"]
[null,null,null,null,null,null,null,null,null,"No"]
[null,null,null,null,null,null,null,null,null,"No"]
[null,null,null,null,null,null,null,null,null,"No"]
[null,null,null,null,null,null,null,null,null,"No"]
[null,null,null,null,null,null,null,null,null,"No"]
[null,null,null,null,null,null,null,null,null,"No"]
[null,null,null,null,null,null,null,null,null,"No"]
[null,null,null,null,null,null,null,null,null,"No"]
[null,null,null,null,null,null,null,null,null,"No"]
[null,null,null,null,null,null,null,null,null,"No"]
[null,null,null,null,null,null,null,null,null,"No"]
[null,null,null,null,null,null,null,null,null,"No"]
[null,null,null,null,null,null,null,null,null,"No"]
[null,null,null,null,null,null,null,null,null,"No"]
[null,null,null,null,null,null,null,null,null,"No"]
[null,null,null,null,null,null,null,null,null,"No"]
[null,null,null,null,null,null,null,null,null,"No"]
[null,null,null,null,null,null,null,null,null,"No"]
[null,null,null,null,null,null,null,null,null,"No"]
[null,null,null,null,null,null,null,null,null,"No"]
[null,null,null,null,null,null,null,null,null,"No"]
[null,null,null,null,null,null,null,null,null,"No"]
[null,null,null,null,null,null,null,null,null,"No"]
[null,null,null,null,null,null,null,null,null,"No"]
[null,null,null,null,null,null,null,null,null,"No"]
[null,null,null,null,null,null,null,null,null,"No"]
[null,null,null,null,null,null,null,null,null,"No"]
[null,null,null,null,null,null,null,null,null,"No"]
[null,null,null,null,null,null,null,null,null,"No"]
[null,null,null,null,null,null,null,null,null,"No"]
[null,null,null,null,null,null,null,null,null,"No"]
[null,null,null,null,null,null,null,null,null,"No"]
[null,null,null,null,null,null,null,null,null,"No"]
[null,null,null,null,null,null,null,null,null,"No"]
[null,null,null,null,null,null,null,null,null,"No"]
[null,null,null,null,null,null,null,null,null,"No"]
[null,null,null,null,null,null,null,null,null,"No"]
[null,null,null,null,null,null,null,null,null,"No"]
[null,null,null,null,null,null,null,null,null,"No"]
[null,null,null,null,null,null,null,null,null,"No"]
[null,null,null,null,null,null,null,null,null,"No"]
[null,null,null,null,null,null,null,null,null,"No"]
[null,null,null,null,null,null,null,null,null,"No"]
[null,null,null,null,null,null,null,null,null,"No"]
[null,null,null,null,null,null,null,null,null,"No"]
[null,null,null,null,null,null,null,null,null,"No"]
[null,null,null,null,null,null,null,null,null,"No"]
[null,null,null,null,null,null,null,null,null,"No"]
[null,null,null,null,null,null,null,null,null,"No"]
[null,null,null,null,null,null,null,null,null,"No"]
[null,null,null,null,null,null,null,null,null,"No"]
[null,null,null,null,null,null,null,null,null,"No"]
[null,null,null,null,null,null,null,null,null,"No"]
[null,null,null,null,null,null,null,null,null,"No"]
[null,null,null,null,null,null,null,null,null,"No"]
[null,null,null,null,null,null,null,null,null,"No"]
[null,null,null,null,null,null,null,null,null,"No"]
[null,null,null,null,null,null,null,null,null,"No"]
[null,null,null,null,null,null,null,null,null,"No"]
[null,null,null,null,null,null,null,null,null,"No"]
[null,null,null,null,null,null,null,null,null,"No"]
[null,null,null,null,null,null,null,null,null,"No"]
[null,null,null,null,null,null,null,null,null,"No"]
[null,null,null,null,null,null,null,null,null,"No"]
[null,null,null,null,null,null,null,null,null,"No"]
[null,null,null,null,null,null,null,null,null,"No"]
[null,null,null,null,null,null,null,null,null,"No"]
[null,null,null,null,null,null,null,null,null,"No"]
[null,null,null,null,null,null,null,null,null,"No"]
[null,null,null,null,null,null,null,null,null,"No"]
[null,null,null,null,null,null,null,null,null,"No"]
[null,null,null,null,null,null,null,null,null,"No"]
[null,null,null,null,null,null,null,null,null,"No"]
[null,null,null,null,null,null,null,null,null,"No"]
[null,null,null,null,null,null,null,null,null,"No"]
[null,null,null,null,null,null,null,null,null,"No"]
[null,null,null,null,null,null,null,null,null,"No"]
[null,null,null,null,null,null,null,null,null,"No"]
[null,null,null,null,null,null,null,null,null,"No"]
[null,null,null,null,null,null,null,null,null,"No"]
[null,null,null,null,null,null,null,null,null,"No"]
[null,null,null,null,null,null,null,null,null,"No"]
[null,null,null,null,null,null,null,null,null,"No"]
[null,null,null,null,null,null,null,null,null,"No"]
[null,null,null,null,null,null,null,null,null,"No"]
[null,null,null,null,null,null,null,null,null,"No"]
[null,null,null,null,null,null,null,null,null,"No"]
[null,null,null,null,null,null,null,null,null,"No"]
[null,null,null,null,null,null,null,null,null,"No"]
[null,null,null,null,null,null,null,null,null,"No"]
[null,null,null,null,null,null,null,null,null,"No"]
[null,null,null,null,null,null,null,null,null,"No"]
[null,null,null,null,null,null,null,null,null,"No"]
[null,null,null,null,null,null,null,null,null,"No"]
[null,null,null,null,null,null,null,null,null,"No"]
[null,null,null,null,null,null,null,null,null,"No"]
[null,null,null,null,null,null,null,null,null,"No"]
[null,null,null,null,null,null,null,null,null,"No"]
[null,null,null,null,null,null,null,null,null,"No"]
[null,null,null,null,null,null,null,null,null,"No"]
[null,null,null,null,null,null,null,null,null,"No"]
[null,null,null,null,null,null,null,null,null,"No"]
[null,null,null,null,null,null,null,null,null,"No"]
[null,null,null,null,null,null,null,null,null,"No"]
[null,null,null,null,null,null,null,null,null,"No"]
[null,null,null,null,null,null,null,null,null,"No"]
[null,null,null,null,null,null,null,null,null,"No"]
[null,null,null,null,null,null,null,null,null,"No"]
[null,null,null,null,null,null,null,null,null,"No"]
[null,null,null,null,null,null,null,null,null,"No"]
[null,null,null,null,null,null,null,null,null,"No"]
[null,null,null,null,null,null,null,null,null,"No"]
[null,null,null,null,null,null,null,null,null,"No"]
[null,null,null,null,null,null,null,null,null,"No"]
[null,null,null,null,null,null,null,null,null,"No"]
[null,null,null,null,null,null,null,null,null,"No"]
[null,null,null,null,null,null,null,null,null,"No"]
[null,null,null,null,null,null,null,null,null,"No"]
[null,null,null,null,null,null,null,null,null,"No"]
[null,null,null,null,null,null,null,null,null,"No"]
[null,null,null,null,null,null,null,null,null,"No"]
[null,null,null,null,null,null,null,null,null,"No"]
[null,null,null,null,null,null,null,null,null,"No"]
[null,null,null,null,null,null,null,null,null,"No"]
[null,null,null,null,null,null,null,null,null,"No"]
[null,null,null,null,null,null,null,null,null,"No"]
[null,null,null,null,null,null,null,null,null,"No"]
[null,null,null,null,null,null,null,null,null,"No"]
[null,null,null,null,null,null,null,null,null,"No"]
[null,null,null,null,null,null,null,null,null,"No"]
[null,null,null,null,null,null,null,null,null,"No"]
[null,null,null,null,null,null,null,null,null,"No"]
[null,null,null,null,null,null,null,null,null,"No"]
[null,null,null,null,null,null,null,null,null,"No"]
[null,null,null,null,null,null,null,null,null,"No"]
[null,null,null,null,null,null,null,null,null,"No"]
[null,null,null,null,null,null,null,null,null,"No"]
[null,null,null,null,null,null,null,null,null,"No"]
[null,null,null,null,null,null,null,null,null,"No"]
[null,null,null,null,null,null,null,null,null,"No"]
[null,null,null,null,null,null,null,null,null,"No"]
[null,null,null,null,null,null,null,null,null,"No"]
[null,null,null,null,null,null,null,null,null,"No"]
[null,null,null,null,null,null,null,null,null,"No"]
[null,null,null,null,null,null,null,null,null,"No"]
[null,null,null,null,null,null,null,null,null,"No"]
[null,null,null,null,null,null,null,null,null,"No"]
[null,null,null,null,null,null,null,null,null,"No"]
[null,null,null,null,null,null,null,null,null,"No"]
[null,null,null,null,null,null,null,null,null,"No"]
[null,null,null,null,null,null,null,null,null,"No"]
[null,null,null,null,null,null,null,null,null,"No"]
[null,null,null,null,null,null,null,null,null,"No"]
[null,null,null,null,null,null,null,null,null,"No"]
[null,null,null,null,null,null,null,null,null,"No"]
[null,null,null,null,null,null,null,null,null,"No"]
[null,null,null,null,null,null,null,null,null,"No"]
[null,null,null,null,null,null,null,null,null,"No"]
[null,null,null,null,null,null,null,null,null,"No"]
[null,null,null,null,null,null,null,null,null,"No"]
[null,null,null,null,null,null,null,null,null,"No"]
[null,null,null,null,null,null,null,null,null,"No"]
[null,null,null,null,null,null,null,null,null,"No"]
[null,null,null,null,null,null,null,null,null,"No"]
[null,null,null,null,null,null,null,null,null,"No"]
[null,null,null,null,null,null,null,null,null,"No"]
[null,null,null,null,null,null,null,null,null,"No"]
[null,null,null,null,null,null,null,null,null,"No"]
[null,null,null,null,null,null,null,null,null,"No"]
[null,null,null,null,null,null,null,null,null,"No"]
[null,null,null,null,null,null,null,null,null,"No"]
[null,null,null,null,null,null,null,null,null,"No"]
[null,null,null,null,null,null,null,null,null,"No"]
[null,null,null,null,null,null,null,null,null,"No"]
[null,null,null,null,null,null,null,null,null,"No"]
[null,null,null,null,null,null,null,null,null,"No"]
[null,null,null,null,null,null,null,null,null,"No"]
[null,null,null,null,null,null,null,null,null,"No"]
[null,null,null,null,null,null,null,null,null,"No"]
[null,null,null,null,null,null,null,null,null,"No"]
[null,null,null,null,null,null,null,null,null,"No"]
[null,null,null,null,null,null,null,null,null,"No"]
[null,null,null,null,null,null,null,null,null,"No"]
[null,null,null,null,null,null,null,null,null,"No"]
[null,null,null,null,null,null,null,null,null,"No"]
[null,null,null,null,null,null,null,null,null,"No"]
[null,null,null,null,null,null,null,null,null,"No"]
[null,null,null,null,null,null,null,null,null,"No"]
[null,null,null,null,null,null,null,null,null,"No"]
[null,null,null,null,null,null,null,null,null,"No"]
[null,null,null,null,null,null,null,null,null,"No"]
[null,null,null,null,null,null,null,null,null,"No"]
[null,null,null,null,null,null,null,null,null,"No"]
[null,null,null,null,null,null,null,null,null,"No"]
[null,null,null,null,null,null,null,null,null,"No"]
[null,null,null,null,null,null,null,null,null,"No"]
[null,null,null,null,null,null,null,null,null,"No"]
[null,null,null,null,null,null,null,null,null,"No"]
[null,null,null,null,null,null,null,null,null,"No"]
[null,null,null,null,null,null,null,null,null,"No"]
[null,null,null,null,null,null,null,null,null,"No"]
[null,null,null,null,null,null,null,null,null,"No"]
[null,null,null,null,null,null,null,null,null,"No"]
[null,null,null,null,null,null,null,null,null,"No"]
[null,null,null,null,null,null,null,null,null,"No"]
[null,null,null,null,null,null,null,null,null,"No"]
[null,null,null,null,null,null,null,null,null,"No"]
[null,null,null,null,null,null,null,null,null,"No"]
[null,null,null,null,null,null,null,null,null,"No"]
[null,null,null,null,null,null,null,null,null,"No"]
[null,null,null,null,null,null,null,null,null,"No"]
[null,null,null,null,null,null,null,null,null,"No"]
[null,null,null,null,null,null,null,null,null,"No"]
[null,null,null,null,null,null,null,null,null,"No"]
[null,null,null,null,null,null,null,null,null,"No"]
[null,null,null,null,null,null,null,null,null,"No"]
[null,null,null,null,null,null,null,null,null,"No"]
[null,null,null,null,null,null,null,null,null,"No"]
[null,null,null,null,null,null,null,null,null,"No"]
[null,null,null,null,null,null,null,null,null,"No"]
[null,null,null,null,null,null,null,null,null,"No"]
[null,null,null,null,null,null,null,null,null,"No"]
[null,null,null,null,null,null,null,null,null,"No"]
[null,null,null,null,null,null,null,null,null,"No"]
[null,null,null,null,null,null,null,null,null,"No"]
[null,null,null,null,null,null,null,null,null,"No"]
[null,null,null,null,null,null,null,null,null,"No"]
[null,null,null,null,null,null,null,null,null,"No"]
[null,null,null,null,null,null,null,null,null,"No"]
[null,null,null,null,null,null,null,null,null,"No"]
[null,null,null,null,null,null,null,null,null,"No"]
[null,null,null,null,null,null,null,null,null,"No"]
[null,null,null,null,null,null,null,null,null,"No"]
[null,null,null,null,null,null,null,null,null,"No"]
[null,null,null,null,null,null,null,null,null,"No"]
[null,null,null,null,null,null,null,null,null,"No"]
[null,null,null,null,null,null,null,null,null,"No"]
[null,null,null,null,null,null,null,null,null,"No"]
[null,null,null,null,null,null,null,null,null,"No"]
[null,null,null,null,null,null,null,null,null,"No"]
[null,null,null,null,null,null,null,null,null,"No"]
[null,null,null,null,null,null,null,null,null,"No"]
[null,null,null,null,null,null,null,null,null,"No"]
[null,null,null,null,null,null,null,null,null,"No"]
[null,null,null,null,null,null,null,null,null,"No"]
[null,null,null,null,null,null,null,null,null,"No"]
[null,null,null,null,null,null,null,null,null,"No"]
[null,null,null,null,null,null,null,null,null,"No"]
[null,null,null,null,null,null,null,null,null,"No"]
[null,null,null,null,null,null,null,null,null,"No"]
[null,null,null,null,null,null,null,null,null,"No"]
[null,null,null,null,null,null,null,null,null,"No"]
[null,null,null,null,null,null,null,null,null,"No"]
[null,null,null,null,null,null,null,null,null,"No"]
[null,null,null,null,null,null,null,null,null,"No"]
[null,null,null,null,null,null,null,null,null,"No"]
[null,null,null,null,null,null,null,null,null,"No"]
[null,null,null,null,null,null,null,null,null,"No"]
[null,null,null,null,null,null,null,null,null,"No"]
[null,null,null,null,null,null,null,null,null,"No"]
[null,null,null,null,null,null,null,null,null,"No"]
[null,null,null,null,null,null,null,null,null,"No"]
[null,null,null,null,null,null,null,null,null,"No"]
[null,null,null,null,null,null,null,null,null,"No"]
[null,null,null,null,null,null,null,null,null,"No"]
[null,null,null,null,null,null,null,null,null,"No"]
[null,null,null,null,null,null,null,null,null,"No"]
[null,null,null,null,null,null,null,null,null,"No"]
[null,null,null,null,null,null,null,null,null,"No"]
[null,null,null,null,null,null,null,null,null,"No"]
[null,null,null,null,null,null,null,null,null,"No"]
[null,null,null,null,null,null,null,null,null,"No"]
[null,null,null,null,null,null,null,null,null,"No"]
[null,null,null,null,null,null,null,null,null,"No"]
[null,null,null,null,null,null,null,null,null,"No"]
[null,null,null,null,null,null,null,null,null,"No"]
[null,null,null,null,null,null,null,null,null,"No"]
[null,null,null,null,null,null,null,null,null,"No"]
[null,null,null,null,null,null,null,null,null,"No"]
[null,null,null,null,null,null,null,null,null,"No"]
[null,null,null,null,null,null,null,null,null,"No"]
[null,null,null,null,null,null,null,null,null,"No"]
[null,null,null,null,null,null,null,null,null,"No"]
[null,null,null,null,null,null,null,null,null,"No"]
[null,null,null,null,null,null,null,null,null,"No"]
[null,null,null,null,null,null,null,null,null,"No"]
[null,null,null,null,null,null,null,null,null,"No"]
[null,null,null,null,null,null,null,null,null,"No"]
[null,null,null,null,null,null,null,null,null,"No"]
[null,null,null,null,null,null,null,null,null,"No"]
[null,null,null,null,null,null,null,null,null,"No"]
[null,null,null,null,null,null,null,null,null,"No"]
[null,null,null,null,null,null,null,null,null,"No"]
[null,null,null,null,null,null,null,null,null,"No"]
[null,null,null,null,null,null,null,null,null,"No"]
[null,null,null,null,null,null,null,null,null,"No"]
[null,null,null,null,null,null,null,null,null,"No"]
[null,null,null,null,null,null,null,null,null,"No"]
[null,null,null,null,null,null,null,null,null,"No"]
[null,null,null,null,null,null,null,null,null,"No"]
[null,null,null,null,null,null,null,null,null,"No"]
[null,null,null,null,null,null,null,null,null,"No"]
[null,null,null,null,null,null,null,null,null,"No"]
[null,null,null,null,null,null,null,null,null,"No"]
[null,null,null,null,null,null,null,null,null,"No"]
[null,null,null,null,null,null,null,null,null,"No"]
[null,null,null,null,null,null,null,null,null,"No"]
[null,null,null,null,null,null,null,null,null,"No"]
[null,null,null,null,null,null,null,null,null,"No"]
[null,null,null,null,null,null,null,null,null,"No"]
[null,null,null,null,null,null,null,null,null,"No"]
[null,null,null,null,null,null,null,null,null,"No"]
[null,null,null,null,null,null,null,null,null,"No"]
[null,null,null,null,null,null,null,null,null,"No"]
[null,null,null,null,null,null,null,null,null,"No"]
[null,null,null,null,null,null,null,null,null,"No"]
[null,null,null,null,null,null,null,null,null,"No"]
[null,null,null,null,null,null,null,null,null,"No"]
[null,null,null,null,null,null,null,null,null,"No"]
[null,null,null,null,null,null,null,null,null,"No"]
[null,null,null,null,null,null,null,null,null,"No"]
[null,null,null,null,null,null,null,null,null,"No"]
[null,null,null,null,null,null,null,null,null,"No"]
[null,null,null,null,null,null,null,null,null,"No"]
[null,null,null,null,null,null,null,null,null,"No"]
[null,null,null,null,null,null,null,null,null,"No"]
[null,null,null,null,null,null,null,null,null,"No"]
[null,null,null,null,null,null,null,null,null,"No"]
[null,null,null,null,null,null,null,null,null,"No"]
[null,null,null,null,null,null,null,null,null,"No"]
[null,null,null,null,null,null,null,null,null,"No"]
[null,null,null,null,null,null,null,null,null,"No"]
[null,null,null,null,null,null,null,null,null,"No"]
[null,null,null,null,null,null,null,null,null,"No"]
[null,null,null,null,null,null,null,null,null,"No"]
[null,null,null,null,null,null,null,null,null,"No"]
[null,null,null,null,null,null,null,null,null,"No"]
[null,null,null,null,null,null,null,null,null,"No"]
[null,null,null,null,null,null,null,null,null,"No"]
[null,null,null,null,null,null,null,null,null,"No"]
[null,null,null,null,null,null,null,null,null,"No"]
[null,null,null,null,null,null,null,null,null,"No"]
[null,null,null,null,null,null,null,null,null,"No"]
[null,null,null,null,null,null,null,null,null,"No"]
[null,null,null,null,null,null,null,null,null,"No"]
[null,null,null,null,null,null,null,null,null,"No"]
[null,null,null,null,null,null,null,null,null,"No"]
[null,null,null,null,null,null,null,null,null,"No"]
[null,null,null,null,null,null,null,null,null,"No"]
[null,null,null,null,null,null,null,null,null,"No"]
[null,null,null,null,null,null,null,null,null,"No"]
[null,null,null,null,null,null,null,null,null,"No"]
[null,null,null,null,null,null,null,null,null,"No"]
[null,null,null,null,null,null,null,null,null,"No"]
[null,null,null,null,null,null,null,null,null,"No"]
[null,null,null,null,null,null,null,null,null,"No"]
[null,null,null,null,null,null,null,null,null,"No"]
[null,null,null,null,null,null,null,null,null,"No"]
[null,null,null,null,null,null,null,null,null,"No"]
[null,null,null,null,null,null,null,null,null,"No"]
[null,null,null,null,null,null,null,null,null,"No"]
[null,null,null,null,null,null,null,null,null,"No"]
[null,null,null,null,null,null,null,null,null,"No"]
[null,null,null,null,null,null,null,null,null,"No"]
[null,null,null,null,null,null,null,null,null,"No"]
[null,null,null,null,null,null,null,null,null,"No"]
[null,null,null,null,null,null,null,null,null,"No"]
[null,null,null,null,null,null,null,null,null,"No"]
[null,null,null,null,null,null,null,null,null,"No"]
[null,null,null,null,null,null,null,null,null,"No"]
[null,null,null,null,null,null,null,null,null,"No"]
[null,null,null,null,null,null,null,null,null,"No"]
[null,null,null,null,null,null,null,null,null,"No"]
[null,null,null,null,null,null,null,null,null,"No"]
[null,null,null,null,null,null,null,null,null,"No"]
[null,null,null,null,null,null,null,null,null,"No"]
[null,null,null,null,null,null,null,null,null,"No"]
[null,null,null,null,null,null,null,null,null,"No"]
[null,null,null,null,null,null,null,null,null,"No"]
[null,null,null,null,null,null,null,null,null,"No"]
[null,null,null,null,null,null,null,null,null,"No"]
[null,null,null,null,null,null,null,null,null,"No"]
[null,null,null,null,null,null,null,null,null,"No"]
[null,null,null,null,null,null,null,null,null,"No"]
[null,null,null,null,null,null,null,null,null,"No"]
[null,null,null,null,null,null,null,null,null,"No"]
[null,null,null,null,null,null,null,null,null,"No"]
[null,null,null,null,null,null,null,null,null,"No"]
[null,null,null,null,null,null,null,null,null,"No"]
[null,null,null,null,null,null,null,null,null,"No"]
[null,null,null,null,null,null,null,null,null,"No"]
[null,null,null,null,null,null,null,null,null,"No"]
[null,null,null,null,null,null,null,null,null,"No"]
[null,null,null,null,null,null,null,null,null,"No"]
[null,null,null,null,null,null,null,null,null,"No"]
[null,null,null,null,null,null,null,null,null,"No"]
[null,null,null,null,null,null,null,null,null,"No"]
[null,null,null,null,null,null,null,null,null,"No"]
[null,null,null,null,null,null,null,null,null,"No"]
[null,null,null,null,null,null,null,null,null,"No"]
[null,null,null,null,null,null,null,null,null,"No"]
[null,null,null,null,null,null,null,null,null,"No"]
[null,null,null,null,null,null,null,null,null,"No"]
[null,null,null,null,null,null,null,null,null,"No"]
[null,null,null,null,null,null,null,null,null,"No"]
[null,null,null,null,null,null,null,null,null,"No"]
[null,null,null,null,null,null,null,null,null,"No"]
[null,null,null,null,null,null,null,null,null,"No"]
[null,null,null,null,null,null,null,null,null,"No"]
[null,null,null,null,null,null,null,null,null,"No"]
[null,null,null,null,null,null,null,null,null,"No"]
[null,null,null,null,null,null,null,null,null,"No"]
[null,null,null,null,null,null,null,null,null,"No"]
[null,null,null,null,null,null,null,null,null,"No"]
[null,null,null,null,null,null,null,null,null,"No"]
[null,null,null,null,null,null,null,null,null,"No"]
[null,null,null,null,null,null,null,null,null,"No"]
[null,null,null,null,null,null,null,null,null,"No"]
[null,null,null,null,null,null,null,null,null,"No"]
[null,null,null,null,null,null,null,null,null,"No"]
[null,null,null,null,null,null,null,null,null,"No"]
[null,null,null,null,null,null,null,null,null,"No"]
[null,null,null,null,null,null,null,null,null,"No"]
[null,null,null,null,null,null,null,null,null,"No"]
[null,null,null,null,null,null,null,null,null,"No"]
[null,null,null,null,null,null,null,null,null,"No"]
[null,null,null,null,null,null,null,null,null,"No"]
[null,null,null,null,null,null,null,null,null,"No"]
[null,null,null,null,null,null,null,null,null,"No"]
[null,null,null,null,null,null,null,null,null,"No"]
[null,null,null,null,null,null,null,null,null,"No"]
[null,null,null,null,null,null,null,null,null,"No"]
[null,null,null,null,null,null,null,null,null,"No"]
[null,null,null,null,null,null,null,null,null,"No"]
[null,null,null,null,null,null,null,null,null,"No"]
[null,null,null,null,null,null,null,null,null,"No"]
[null,null,null,null,null,null,null,null,null,"No"]
[null,null,null,null,null,null,null,null,null,"No"]
[null,null,null,null,null,null,null,null,null,"No"]
[null,null,null,null,null,null,null,null,null,"No"]
[null,null,null,null,null,null,null,null,null,"No"]
[null,null,null,null,null,null,null,null,null,"No"]
[null,null,null,null,null,null,null,null,null,"No"]
[null,null,null,null,null,null,null,null,null,"No"]
[null,null,null,null,null,null,null,null,null,"No"]
[null,null,null,null,null,null,null,null,null,"No"]
[null,null,null,null,null,null,null,null,null,"No"]
[null,null,null,null,null,null,null,null,null,"No"]
[null,null,null,null,null,null,null,null,null,"No"]
[null,null,null,null,null,null,null,null,null,"No"]
[null,null,null,null,null,null,null,null,null,"No"]
[null,null,null,null,null,null,null,null,null,"No"]
[null,null,null,null,null,null,null,null,null,"No"]
[null,null,null,null,null,null,null,null,null,"No"]
[null,null,null,null,null,null,null,null,null,"No"]
[null,null,null,null,null,null,null,null,null,"No"]
[null,null,null,null,null,null,null,null,null,"No"]
[null,null,null,null,null,null,null,null,null,"No"]
[null,null,null,null,null,null,null,null,null,"No"]
[null,null,null,null,null,null,null,null,null,"No"]
[null,null,null,null,null,null,null,null,null,"No"]
[null,null,null,null,null,null,null,null,null,"No"]
[null,null,null,null,null,null,null,null,null,"No"]
[null,null,null,null,null,null,null,null,null,"No"]
[null,null,null,null,null,null,null,null,null,"No"]
[null,null,null,null,null,null,null,null,null,"No"]
[null,null,null,null,null,null,null,null,null,"No"]
[null,null,null,null,null,null,null,null,null,"No"]
[null,null,null,null,null,null,null,null,null,"No"]
[null,null,null,null,null,null,null,null,null,"No"]
[null,null,null,null,null,null,null,null,null,"No"]
[null,null,null,null,null,null,null,null,null,"No"]
[null,null,null,null,null,null,null,null,null,"No"]
[null,null,null,null,null,null,null,null,null,"No"]
[null,null,null,null,null,null,null,null,null,"No"]
[null,null,null,null,null,null,null,null,null,"No"]
[null,null,null,null,null,null,null,null,null,"No"]
[null,null,null,null,null,null,null,null,null,"No"]
[null,null,null,null,null,null,null,null,null,"No"]
[null,null,null,null,null,null,null,null,null,"No"]
[null,null,null,null,null,null,null,null,null,"No"]
[null,null,null,null,null,null,null,null,null,"No"]
[null,null,null,null,null,null,null,null,null,"No"]
[null,null,null,null,null,null,null,null,null,"No"]
[null,null,null,null,null,null,null,null,null,"No"]
[null,null,null,null,null,null,null,null,null,"No"]
[null,null,null,null,null,null,null,null,null,"No"]
[null,null,null,null,null,null,null,null,null,"No"]
[null,null,null,null,null,null,null,null,null,"No"]
[null,null,null,null,null,null,null,null,null,"No"]
[null,null,null,null,null,null,null,null,null,"No"]
[null,null,null,null,null,null,null,null,null,"No"]
[null,null,null,null,null,null,null,null,null,"No"]
[null,null,null,null,null,null,null,null,null,"No"]
[null,null,null,null,null,null,null,null,null,"No"]
[null,null,null,null,null,null,null,null,null,"No"]
[null,null,null,null,null,null,null,null,null,"No"]
[null,null,null,null,null,null,null,null,null,"No"]
[null,null,null,null,null,null,null,null,null,"No"]
[null,null,null,null,null,null,null,null,null,"No"]
[null,null,null,null,null,null,null,null,null,"No"]
[null,null,null,null,null,null,null,null,null,"No"]
[null,null,null,null,null,null,null,null,null,"No"]
[null,null,null,null,null,null,null,null,null,"No"]
[null,null,null,null,null,null,null,null,null,"No"]
[null,null,null,null,null,null,null,null,null,"No"]
[null,null,null,null,null,null,null,null,null,"No"]
[null,null,null,null,null,null,null,null,null,"No"]
[null,null,null,null,null,null,null,null,null,"No"]
[null,null,null,null,null,null,null,null,null,"No"]
[null,null,null,null,null,null,null,null,null,"No"]
[null,null,null,null,null,null,null,null,null,"No"]
[null,null,null,null,null,null,null,null,null,"No"]
[null,null,null,null,null,null,null,null,null,"No"]
[null,null,null,null,null,null,null,null,null,"No"]
[null,null,null,null,null,null,null,null,null,"No"]
[null,null,null,null,null,null,null,null,null,"No"]
[null,null,null,null,null,null,null,null,null,"No"]
[null,null,null,null,null,null,null,null,null,"No"]
[null,null,null,null,null,null,null,null,null,"No"]
[null,null,null,null,null,null,null,null,null,"No"]
[null,null,null,null,null,null,null,null,null,"No"]
[null,null,null,null,null,null,null,null,null,"No"]
[null,null,null,null,null,null,null,null,null,"No"]
[null,null,null,null,null,null,null,null,null,"No"]
[null,null,null,null,null,null,null,null,null,"No"]
[null,null,null,null,null,null,null,null,null,"No"]
[null,null,null,null,null,null,null,null,null,"No"]
[null,null,null,null,null,null,null,null,null,"No"]
[null,null,null,null,null,null,null,null,null,"No"]
[null,null,null,null,null,null,null,null,null,"No"]
[null,null,null,null,null,null,null,null,null,"No"]
[null,null,null,null,null,null,null,null,null,"No"]
[null,null,null,null,null,null,null,null,null,"No"]
[null,null,null,null,null,null,null,null,null,"No"]
[null,null,null,null,null,null,null,null,null,"No"]
[null,null,null,null,null,null,null,null,null,"No"]
[null,null,null,null,null,null,null,null,null,"No"]
[null,null,null,null,null,null,null,null,null,"No"]
[null,null,null,null,null,null,null,null,null,"No"]
[null,null,null,null,null,null,null,null,null,"No"]
[null,null,null,null,null,null,null,null,null,"No"]
[null,null,null,null,null,null,null,null,null,"No"]
[null,null,null,null,null,null,null,null,null,"No"]
[null,null,null,null,null,null,null,null,null,"No"]
[null,null,null,null,null,null,null,null,null,"No"]
[null,null,null,null,null,null,null,null,null,"No"]
[null,null,null,null,null,null,null,null,null,"No"]
[null,null,null,null,null,null,null,null,null,"No"]
[null,null,null,null,null,null,null,null,null,"No"]
[null,null,null,null,null,null,null,null,null,"No"]
[null,null,null,null,null,null,null,null,null,"No"]
[null,null,null,null,null,null,null,null,null,"No"]
[null,null,null,null,null,null,null,null,null,"No"]
[null,null,null,null,null,null,null,null,null,"No"]
[null,null,null,null,null,null,null,null,null,"No"]
[null,null,null,null,null,null,null,null,null,"No"]
[null,null,null,null,null,null,null,null,null,"No"]
[null,null,null,null,null,null,null,null,null,"No"]
[null,null,null,null,null,null,null,null,null,"No"]
[null,null,null,null,null,null,null,null,null,"No"]
[null,null,null,null,null,null,null,null,null,"No"]
[null,null,null,null,null,null,null,null,null,"No"]
[null,null,null,null,null,null,null,null,null,"No"]
[null,null,null,null,null,null,null,null,null,"No"]
[null,null,null,null,null,null,null,null,null,"No"]
[null,null,null,null,null,null,null,null,null,"No"]
[null,null,null,null,null,null,null,null,null,"No"]
[null,null,null,null,null,null,null,null,null,"No"]
[null,null,null,null,null,null,null,null,null,"No"]
[null,null,null,null,null,null,null,null,null,"No"]
[null,null,null,null,null,null,null,null,null,"No"]
[null,null,null,null,null,null,null,null,null,"No"]
[null,null,null,null,null,null,null,null,null,"No"]
[null,null,null,null,null,null,null,null,null,"No"]
[null,null,null,null,null,null,null,null,null,"No"]
[null,null,null,null,null,null,null,null,null,"No"]
[null,null,null,null,null,null,null,null,null,"No"]
[null,null,null,null,null,null,null,null,null,"No"]
[null,null,null,null,null,null,null,null,null,"No"]
[null,null,null,null,null,null,null,null,null,"No"]
[null,null,null,null,null,null,null,null,null,"No"]
[null,null,null,null,null,null,null,null,null,"No"]
[null,null,null,null,null,null,null,null,null,"No"]
[null,null,null,null,null,null,null,null,null,"No"]
[null,null,null,null,null,null,null,null,null,"No"]
[null,null,null,null,null,null,null,null,null,"No"]
[null,null,null,null,null,null,null,null,null,"No"]
[null,null,null,null,null,null,null,null,null,"No"]
[null,null,null,null,null,null,null,null,null,"No"]
[null,null,null,null,null,null,null,null,null,"No"]
[null,null,null,null,null,null,null,null,null,"No"]
[null,null,null,null,null,null,null,null,null,"No"]
[null,null,null,null,null,null,null,null,null,"No"]
[null,null,null,null,null,null,null,null,null,"No"]
[null,null,null,null,null,null,null,null,null,"No"]
[null,null,null,null,null,null,null,null,null,"No"]
[null,null,null,null,null,null,null,null,null,"No"]
[null,null,null,null,null,null,null,null,null,"No"]
[null,null,null,null,null,null,null,null,null,"No"]
[null,null,null,null,null,null,null,null,null,"No"]
[null,null,null,null,null,null,null,null,null,"No"]
[null,null,null,null,null,null,null,null,null,"No"]
[null,null,null,null,null,null,null,null,null,"No"]
[null,null,null,null,null,null,null,null,null,"No"]
[null,null,null,null,null,null,null,null,null,"No"]
[null,null,null,null,null,null,null,null,null,"No"]
[null,null,null,null,null,null,null,null,null,"No"]
[null,null,null,null,null,null,null,null,null,"No"]
[null,null,null,null,null,null,null,null,null,"No"]
[null,null,null,null,null,null,null,null,null,"No"]
[null,null,null,null,null,null,null,null,null,"No"]
[null,null,null,null,null,null,null,null,null,"No"]
[null,null,null,null,null,null,null,null,null,"No"]
[null,null,null,null,null,null,null,null,null,"No"]
[null,null,null,null,null,null,null,null,null,"No"]
[null,null,null,null,null,null,null,null,null,"No"]
[null,null,null,null,null,null,null,null,null,"No"]
[null,null,null,null,null,null,null,null,null,"No"]
[null,null,null,null,null,null,null,null,null,"No"]
[null,null,null,null,null,null,null,null,null,"No"]
[null,null,null,null,null,null,null,null,null,"No"]
[null,null,null,null,null,null,null,null,null,"No"]
[null,null,null,null,null,null,null,null,null,"No"]
[null,null,null,null,null,null,null,null,null,"No"]
[null,null,null,null,null,null,null,null,null,"No"]
[null,null,null,null,null,null,null,null,null,"No"]
[null,null,null,null,null,null,null,null,null,"No"]
[null,null,null,null,null,null,null,null,null,"No"]
[null,null,null,null,null,null,null,null,null,"No"]
[null,null,null,null,null,null,null,null,null,"No"]
[null,null,null,null,null,null,null,null,null,"No"]
[null,null,null,null,null,null,null,null,null,"No"]
[null,null,null,null,null,null,null,null,null,"No"]
[null,null,null,null,null,null,null,null,null,"No"]
[null,null,null,null,null,null,null,null,null,"No"]
[null,null,null,null,null,null,null,null,null,"No"]
[null,null,null,null,null,null,null,null,null,"No"]
[null,null,null,null,null,null,null,null,null,"No"]
[null,null,null,null,null,null,null,null,null,"No"]
[null,null,null,null,null,null,null,null,null,"No"]
[null,null,null,null,null,null,null,null,null,"No"]
[null,null,null,null,null,null,null,null,null,"No"]
[null,null,null,null,null,null,null,null,null,"No"]
[null,null,null,null,null,null,null,null,null,"No"]
[null,null,null,null,null,null,null,null,null,"No"]
[null,null,null,null,null,null,null,null,null,"No"]
[null,null,null,null,null,null,null,null,null,"No"]
[null,null,null,null,null,null,null,null,null,"No"]
[null,null,null,null,null,null,null,null,null,"No"]
[null,null,null,null,null,null,null,null,null,"No"]
[null,null,null,null,null,null,null,null,null,"No"]
[null,null,null,null,null,null,null,null,null,"No"]
[null,null,null,null,null,null,null,null,null,"No"]
[null,null,null,null,null,null,null,null,null,"No"]
[null,null,null,null,null,null,null,null,null,"No"]
[null,null,null,null,null,null,null,null,null,"No"]
[null,null,null,null,null,null,null,null,null,"No"]
[null,null,null,null,null,null,null,null,null,"No"]
[null,null,null,null,null,null,null,null,null,"No"]
[null,null,null,null,null,null,null,null,null,"No"]
[null,null,null,null,null,null,null,null,null,"No"]
[null,null,null,null,null,null,null,null,null,"No"]
[null,null,null,null,null,null,null,null,null,"No"]
[null,null,null,null,null,null,null,null,null,"No"]
[null,null,null,null,null,null,null,null,null,"No"]
[null,null,null,null,null,null,null,null,null,"No"]
[null,null,null,null,null,null,null,null,null,"No"]
[null,null,null,null,null,null,null,null,null,"No"]
[null,null,null,null,null,null,null,null,null,"No"]
[null,null,null,null,null,null,null,null,null,"No"]
[null,null,null,null,null,null,null,null,null,"No"]
[null,null,null,null,null,null,null,null,null,"No"]
[null,null,null,null,null,null,null,null,null,"No"]
[null,null,null,null,null,null,null,null,null,"No"]
[null,null,null,null,null,null,null,null,null,"No"]
[null,null,null,null,null,null,null,null,null,"No"]
[null,null,null,null,null,null,null,null,null,"No"]
[null,null,null,null,null,null,null,null,null,"No"]
[null,null,null,null,null,null,null,null,null,"No"]
[null,null,null,null,null,null,null,null,null,"No"]
[null,null,null,null,null,null,null,null,null,"No"]
[null,null,null,null,null,null,null,null,null,"No"]
[null,null,null,null,null,null,null,null,null,"No"]
[null,null,null,null,null,null,null,null,null,"No"]
[null,null,null,null,null,null,null,null,null,"No"]
[null,null,null,null,null,null,null,null,null,"No"]
[null,null,null,null,null,null,null,null,null,"No"]
[null,null,null,null,null,null,null,null,null,"No"]
[null,null,null,null,null,null,null,null,null,"No"]
[null,null,null,null,null,null,null,null,null,"No"]
[null,null,null,null,null,null,null,null,null,"No"]
[null,null,null,null,null,null,null,null,null,"No"]
[null,null,null,null,null,null,null,null,null,"No"]
[null,null,null,null,null,null,null,null,null,"No"]
[null,null,null,null,null,null,null,null,null,"No"]
[null,null,null,null,null,null,null,null,null,"No"]
[null,null,null,null,null,null,null,null,null,"No"]
[null,null,null,null,null,null,null,null,null,"No"]
[null,null,null,null,null,null,null,null,null,"No"]
[null,null,null,null,null,null,null,null,null,"No"]
[null,null,null,null,null,null,null,null,null,"No"]
[null,null,null,null,null,null,null,null,null,"No"]
[null,null,null,null,null,null,null,null,null,"No"]
[null,null,null,null,null,null,null,null,null,"No"]
[null,null,null,null,null,null,null,null,null,"No"]
[null,null,null,null,null,null,null,null,null,"No"]
[null,null,null,null,null,null,null,null,null,"No"]
[null,null,null,null,null,null,null,null,null,"No"]
[null,null,null,null,null,null,null,null,null,"No"]
[null,null,null,null,null,null,null,null,null,"No"]
[null,null,null,null,null,null,null,null,null,"No"]
[null,null,null,null,null,null,null,null,null,"No"]
[null,null,null,null,null,null,null,null,null,"No"]
[null,null,null,null,null,null,null,null,null,"No"]
[null,null,null,null,null,null,null,null,null,"No"]
[null,null,null,null,null,null,null,null,null,"No"]
[null,null,null,null,null,null,null,null,null,"No"]
[null,null,null,null,null,null,null,null,null,"No"]
[null,null,null,null,null,null,null,null,null,"No"]
[null,null,null,null,null,null,null,null,null,"No"]
[null,null,null,null,null,null,null,null,null,"No"]
[null,null,null,null,null,null,null,null,null,"No"]
[null,null,null,null,null,null,null,null,null,"No"]
[null,null,null,null,null,null,null,null,null,"No"]
[null,null,null,null,null,null,null,null,null,"No"]
[null,null,null,null,null,null,null,null,null,"No"]
[null,null,null,null,null,null,null,null,null,"No"]
[null,null,null,null,null,null,null,null,null,"No"]
[null,null,null,null,null,null,null,null,null,"No"]
[null,null,null,null,null,null,null,null,null,"No"]
[null,null,null,null,null,null,null,null,null,"No"]
[null,null,null,null,null,null,null,null,null,"No"]
[null,null,null,null,null,null,null,null,null,"No"]
[null,null,null,null,null,null,null,null,null,"No"]
[null,null,null,null,null,null,null,null,null,"No"]
[null,null,null,null,null,null,null,null,null,"No"]
[null,null,null,null,null,null,null,null,null,"No"]
[null,null,null,null,null,null,null,null,null,"No"]
[null,null,null,null,null,null,null,null,null,"No"]
[null,null,null,null,null,null,null,null,null,"No"]
[null,null,null,null,null,null,null,null,null,"No"]
[null,null,null,null,null,null,null,null,null,"No"]
[null,null,null,null,null,null,null,null,null,"No"]
[null,null,null,null,null,null,null,null,null,"No"]
[null,null,null,null,null,null,null,null,null,"No"]
[null,null,null,null,null,null,null,null,null,"No"]
[null,null,null,null,null,null,null,null,null,"No"]
[null,null,null,null,null,null,null,null,null,"No"]
[null,null,null,null,null,null,null,null,null,"No"]
[null,null,null,null,null,null,null,null,null,"No"]
[null,null,null,null,null,null,null,null,null,"No"]
[null,null,null,null,null,null,null,null,null,"No"]
[null,null,null,null,null,null,null,null,null,"No"]
[null,null,null,null,null,null,null,null,null,"No"]
[null,null,null,null,null,null,null,null,null,"No"]
[null,null,null,null,null,null,null,null,null,"No"]
[null,null,null,null,null,null,null,null,null,"No"]
[null,null,null,null,null,null,null,null,null,"No"]
[null,null,null,null,null,null,null,null,null,"No"]
[null,null,null,null,null,null,null,null,null,"No"]
[null,null,null,null,null,null,null,null,null,"No"]
[null,null,null,null,null,null,null,null,null,"No"]
[null,null,null,null,null,null,null,null,null,"No"]
[null,null,null,null,null,null,null,null,null,"No"]
[null,null,null,null,null,null,null,null,null,"No"]
[null,null,null,null,null,null,null,null,null,"No"]
[null,null,null,null,null,null,null,null,null,"No"]
[null,null,null,null,null,null,null,null,null,"No"]
[null,null,null,null,null,null,null,null,null,"No"]
[null,null,null,null,null,null,null,null,null,"No"]
[null,null,null,null,null,null,null,null,null,"No"]
[null,null,null,null,null,null,null,null,null,"No"]
[null,null,null,null,null,null,null,null,null,"No"]
[null,null,null,null,null,null,null,null,null,"No"]
[null,null,null,null,null,null,null,null,null,"No"]
[null,null,null,null,null,null,null,null,null,"No"]
[null,null,null,null,null,null,null,null,null,"No"]
[null,null,null,null,null,null,null,null,null,"No"]
[null,null,null,null,null,null,null,null,null,"No"]
[null,null,null,null,null,null,null,null,null,"No"]
[null,null,null,null,null,null,null,null,null,"No"]
[null,null,null,null,null,null,null,null,null,"No"]
[null,null,null,null,null,null,null,null,null,"No"]
[null,null,null,null,null,null,null,null,null,"No"]
[null,null,null,null,null,null,null,null,null,"No"]
[null,null,null,null,null,null,null,null,null,"No"]
[null,null,null,null,null,null,null,null,null,"No"]
[null,null,null,null,null,null,null,null,null,"No"]
[null,null,null,null,null,null,null,null,null,"No"]
[null,null,null,null,null,null,null,null,null,"No"]
[null,null,null,null,null,null,null,null,null,"No"]
[null,null,null,null,null,null,null,null,null,"No"]
[null,null,null,null,null,null,null,null,null,"No"]
[null,null,null,null,null,null,null,null,null,"No"]
[null,null,null,null,null,null,null,null,null,"No"]
[null,null,null,null,null,null,null,null,null,"No"]
[null,null,null,null,null,null,null,null,null,"No"]
[null,null,null,null,null,null,null,null,null,"No"]
[null,null,null,null,null,null,null,null,null,"No"]
[null,null,null,null,null,null,null,null,null,"No"]
[null,null,null,null,null,null,null,null,null,"No"]
[null,null,null,null,null,null,null,null,null,"No"]
[null,null,null,null,null,null,null,null,null,"No"]
[null,null,null,null,null,null,null,null,null,"No"]
[null,null,null,null,null,null,null,null,null,"No"]
[null,null,null,null,null,null,null,null,null,"No"]
[null,null,null,null,null,null,null,null,null,"No"]
[null,null,null,null,null,null,null,null,null,"No"]
[null,null,null,null,null,null,null,null,null,"No"]
[null,null,null,null,null,null,null,null,null,"No"]
[null,null,null,null,null,null,null,null,null,"No"]
[null,null,null,null,null,null,null,null,null,"No"]
[null,null,null,null,null,null,null,null,null,"No"]
[null,null,null,null,null,null,null,null,null,"No"]
[null,null,null,null,null,null,null,null,null,"No"]
[null,null,null,null,null,null,null,null,null,"No"]
[null,null,null,null,null,null,null,null,null,"No"]
[null,null,null,null,null,null,null,null,null,"No"]
[null,null,null,null,null,null,null,null,null,"No"]
[null,null,null,null,null,null,null,null,null,"No"]
[null,null,null,null,null,null,null,null,null,"No"]
[null,null,null,null,null,null,null,null,null,"No"]
[null,null,null,null,null,null,null,null,null,"No"]
[null,null,null,null,null,null,null,null,null,"No"]
[null,null,null,null,null,null,null,null,null,"No"]
[null,null,null,null,null,null,null,null,null,"No"]
[null,null,null,null,null,null,null,null,null,"No"]
[null,null,null,null,null,null,null,null,null,"No"]
[null,null,null,null,null,null,null,null,null,"No"]
[null,null,null,null,null,null,null,null,null,"No"]
[null,null,null,null,null,null,null,null,null,"No"]
[null,null,null,null,null,null,null,null,null,"No"]
[null,null,null,null,null,null,null,null,null,"No"]
[null,null,null,null,null,null,null,null,null,"No"]
[null,null,null,null,null,null,null,null,null,"No"]
[null,null,null,null,null,null,null,null,null,"No"]
[null,null,null,null,null,null,null,null,null,"No"]
[null,null,null,null,null,null,null,null,null,"No"]
[null,null,null,null,null,null,null,null,null,"No"]
[null,null,null,null,null,null,null,null,null,"No"]
[null,null,null,null,null,null,null,null,null,"No"]
[null,null,null,null,null,null,null,null,null,"No"]
[null,null,null,null,null,null,null,null,null,"No"]
[null,null,null,null,null,null,null,null,null,"No"]
[null,null,null,null,null,null,null,null,null,"No"]
[null,null,null,null,null,null,null,null,null,"No"]
[null,null,null,null,null,null,null,null,null,"No"]
[null,null,null,null,null,null,null,null,null,"No"]
[null,null,null,null,null,null,null,null,null,"No"]
[null,null,null,null,null,null,null,null,null,"No"]
[null,null,null,null,null,null,null,null,null,"No"]
[null,null,null,null,null,null,null,null,null,"No"]
[null,null,null,null,null,null,null,null,null,"No"]
[null,null,null,null,null,null,null,null,null,"No"]
[null,null,null,null,null,null,null,null,null,"No"]
[null,null,null,null,null,null,null,null,null,"No"]

{"sheet":"Rail Bridge","index":7,"n_rows":1300,"n_cols":19,"rows_kept":1300,"cut":false,"hidden":false,"merged":[[18,0,18,7],[18,11,18,14],[0,11,0,15],[1,11,1,14],[2,11,2,14],[3,11,3,14],[4,10,4,13],[5,10,5,13]]}
[null,null,null,null,null,null,null,null,null,null,null,"Specified Thresholds",null,null,null,null,null,null,"Yes"]
[null,null,null,null,null,null,null,null,null,null,null,"Potentially Exposed Population",null,null,null,{"$f":"Thresholds!C28","v":302},null,null,"No"]
[null,null,null,null,null,null,null,null,null,null,null,"Property Loss",null,null,null,{"$f":"Thresholds!C29","v":503600863}]
[null,null,null,null,null,null,null,null,null,null,null,"Mission Importance",null,null,null,{"$f":"Thresholds!C30","v":50},null,null,"Steel"]
[null,null,null,null,null,null,null,null,null,null,null,null,null,null,null,null,null,null,"Concrete"]
[]
[]
[]
[]
[]
[]
[]
[]
[]
[]
[]
[]
[]
["TRANSIT/RAIL BRIDGES",null,null,null,null,null,null,null,null,null,null,"CRITICALITY"]
["Asset ID","Quantity","Max Train Occupancy","Replacement Cost Per Asset (Optional)","Length (ft)","% of Ridership Using Bridge","Comments",null,null,"Manually mark as critical?",null,"Potentially Exposed Population","Property Loss","Mission Importance","Manual Override"]
["River Bridge",1,1200,null,1000,49,null,null,null,"No",null,"Y"]
["Bay Bridge",1,1200,null,2000,78,null,null,null,"No",null,"Y",null,"Y"]
["Shipyard Bridge",1,1200,null,1000,32,null,null,null,"No",null,"Y"]
["Pedestrian",1,1200,null,3000,23,null,null,null,"No",null,"Y","Y"]
["Highway Bridges - A",23,1200,null,500,23,null,null,null,"No",null,"Y"]
["Highway Bridges - B",23,1200,null,1000,23,null,null,null,"No",null,"Y"]
[null,null,null,null,null,null,null,null,null,"No"]
[null,null,null,null,null,null,null,null,null,"No"]
[null,null,null,null,null,null,null,null,null,"No"]
[null,null,null,null,null,null,null,null,null,"No"]
[null,null,null,null,null,null,null,null,null,"No"]
[null,null,null,null,null,null,null,null,null,"No"]
[null,null,null,null,null,null,null,null,null,"No"]
[null,null,null,null,null,null,null,null,null,"No"]
[null,null,null,null,null,null,null,null,null,"No"]
[null,null,null,null,null,null,null,null,null,"No"]
[null,null,null,null,null,null,null,null,null,"No"]
[null,null,null,null,null,null,null,null,null,"No"]
[null,null,null,null,null,null,null,null,null,"No"]
[null,null,null,null,null,null,null,null,null,"No"]
[null,null,null,null,null,null,null,null,null,"No"]
[null,null,null,null,null,null,null,null,null,"No"]
[null,null,null,null,null,null,null,null,null,"No"]
[null,null,null,null,null,null,null,null,null,"No"]
[null,null,null,null,null,null,null,null,null,"No"]
[null,null,null,null,null,null,null,null,null,"No"]
[null,null,null,null,null,null,null,null,null,"No"]
[null,null,null,null,null,null,null,null,null,"No"]
[null,null,null,null,null,null,null,null,null,"No"]
[null,null,null,null,null,null,null,null,null,"No"]
[null,null,null,null,null,null,null,null,null,"No"]
[null,null,null,null,null,null,null,null,null,"No"]
[null,null,null,null,null,null,null,null,null,"No"]
[null,null,null,null,null,null,null,null,null,"No"]
[null,null,null,null,null,null,null,null,null,"No"]
[null,null,null,null,null,null,null,null,null,"No"]
[null,null,null,null,null,null,null,null,null,"No"]
[null,null,null,null,null,null,null,null,null,"No"]
[null,null,null,null,null,null,null,null,null,"No"]
[null,null,null,null,null,null,null,null,null,"No"]
[null,null,null,null,null,null,null,null,null,"No"]
[null,null,null,null,null,null,null,null,null,"No"]
[null,null,null,null,null,null,null,null,null,"No"]
[null,null,null,null,null,null,null,null,null,"No"]
[null,null,null,null,null,null,null,null,null,"No"]
[null,null,null,null,null,null,null,null,null,"No"]
[null,null,null,null,null,null,null,null,null,"No"]
[null,null,null,null,null,null,null,null,null,"No"]
[null,null,null,null,null,null,null,null,null,"No"]
[null,null,null,null,null,null,null,null,null,"No"]
[null,null,null,null,null,null,null,null,null,"No"]
[null,null,null,null,null,null,null,null,null,"No"]
[null,null,null,null,null,null,null,null,null,"No"]
[null,null,null,null,null,null,null,null,null,"No"]
[null,null,null,null,null,null,null,null,null,"No"]
[null,null,null,null,null,null,null,null,null,"No"]
[null,null,null,null,null,null,null,null,null,"No"]
[null,null,null,null,null,null,null,null,null,"No"]
[null,null,null,null,null,null,null,null,null,"No"]
[null,null,null,null,null,null,null,null,null,"No"]
[null,null,null,null,null,null,null,null,null,"No"]
[null,null,null,null,null,null,null,null,null,"No"]
[null,null,null,null,null,null,null,null,null,"No"]
[null,null,null,null,null,null,null,null,null,"No"]
[null,null,null,null,null,null,null,null,null,"No"]
[null,null,null,null,null,null,null,null,null,"No"]
[null,null,null,null,null,null,null,null,null,"No"]
[null,null,null,null,null,null,null,null,null,"No"]
[null,null,null,null,null,null,null,null,null,"No"]
[null,null,null,null,null,null,null,null,null,"No"]
[null,null,null,null,null,null,null,null,null,"No"]
[null,null,null,null,null,null,null,null,null,"No"]
[null,null,null,null,null,null,null,null,null,"No"]
[null,null,null,null,null,null,null,null,null,"No"]
[null,null,null,null,null,null,null,null,null,"No"]
[null,null,null,null,null,null,null,null,null,"No"]
[null,null,null,null,null,null,null,null,null,"No"]
[null,null,null,null,null,null,null,null,null,"No"]
[null,null,null,null,null,null,null,null,null,"No"]
[null,null,null,null,null,null,null,null,null,"No"]
[null,null,null,null,null,null,null,null,null,"No"]
[null,null,null,null,null,null,null,null,null,"No"]
[null,null,null,null,null,null,null,null,null,"No"]
[null,null,null,null,null,null,null,null,null,"No"]
[null,null,null,null,null,null,null,null,null,"No"]
[null,null,null,null,null,null,null,null,null,"No"]
[null,null,null,null,null,null,null,null,null,"No"]
[null,null,null,null,null,null,null,null,null,"No"]
[null,null,null,null,null,null,null,null,null,"No"]
[null,null,null,null,null,null,null,null,null,"No"]
[null,null,null,null,null,null,null,null,null,"No"]
[null,null,null,null,null,null,null,null,null,"No"]
[null,null,null,null,null,null,null,null,null,"No"]
[null,null,null,null,null,null,null,null,null,"No"]
[null,null,null,null,null,null,null,null,null,"No"]
[null,null,null,null,null,null,null,null,null,"No"]
[null,null,null,null,null,null,null,null,null,"No"]
[null,null,null,null,null,null,null,null,null,"No"]
[null,null,null,null,null,null,null,null,null,"No"]
[null,null,null,null,null,null,null,null,null,"No"]
[null,null,null,null,null,null,null,null,null,"No"]
[null,null,null,null,null,null,null,null,null,"No"]
[null,null,null,null,null,null,null,null,null,"No"]
[null,null,null,null,null,null,null,null,null,"No"]
[null,null,null,null,null,null,null,null,null,"No"]
[null,null,null,null,null,null,null,null,null,"No"]
[null,null,null,null,null,null,null,null,null,"No"]
[null,null,null,null,null,null,null,null,null,"No"]
[null,null,null,null,null,null,null,null,null,"No"]
[null,null,null,null,null,null,null,null,null,"No"]
[null,null,null,null,null,null,null,null,null,"No"]
[null,null,null,null,null,null,null,null,null,"No"]
[null,null,null,null,null,null,null,null,null,"No"]
[null,null,null,null,null,null,null,null,null,"No"]
[null,null,null,null,null,null,null,null,null,"No"]
[null,null,null,null,null,null,null,null,null,"No"]
[null,null,null,null,null,null,null,null,null,"No"]
[null,null,null,null,null,null,null,null,null,"No"]
[null,null,null,null,null,null,null,null,null,"No"]
[null,null,null,null,null,null,null,null,null,"No"]
[null,null,null,null,null,null,null,null,null,"No"]
[null,null,null,null,null,null,null,null,null,"No"]
[null,null,null,null,null,null,null,null,null,"No"]
[null,null,null,null,null,null,null,null,null,"No"]
[null,null,null,null,null,null,null,null,null,"No"]
[null,null,null,null,null,null,null,null,null,"No"]
[null,null,null,null,null,null,null,null,null,"No"]
[null,null,null,null,null,null,null,null,null,"No"]
[null,null,null,null,null,null,null,null,null,"No"]
[null,null,null,null,null,null,null,null,null,"No"]
[null,null,null,null,null,null,null,null,null,"No"]
[null,null,null,null,null,null,null,null,null,"No"]
[null,null,null,null,null,null,null,null,null,"No"]
[null,null,null,null,null,null,null,null,null,"No"]
[null,null,null,null,null,null,null,null,null,"No"]
[null,null,null,null,null,null,null,null,null,"No"]
[null,null,null,null,null,null,null,null,null,"No"]
[null,null,null,null,null,null,null,null,null,"No"]
[null,null,null,null,null,null,null,null,null,"No"]
[null,null,null,null,null,null,null,null,null,"No"]
[null,null,null,null,null,null,null,null,null,"No"]
[null,null,null,null,null,null,null,null,null,"No"]
[null,null,null,null,null,null,null,null,null,"No"]
[null,null,null,null,null,null,null,null,null,"No"]
[null,null,null,null,null,null,null,null,null,"No"]
[null,null,null,null,null,null,null,null,null,"No"]
[null,null,null,null,null,null,null,null,null,"No"]
[null,null,null,null,null,null,null,null,null,"No"]
[null,null,null,null,null,null,null,null,null,"No"]
[null,null,null,null,null,null,null,null,null,"No"]
[null,null,null,null,null,null,null,null,null,"No"]
[null,null,null,null,null,null,null,null,null,"No"]
[null,null,null,null,null,null,null,null,null,"No"]
[null,null,null,null,null,null,null,null,null,"No"]
[null,null,null,null,null,null,null,null,null,"No"]
[null,null,null,null,null,null,null,null,null,"No"]
[null,null,null,null,null,null,null,null,null,"No"]
[null,null,null,null,null,null,null,null,null,"No"]
[null,null,null,null,null,null,null,null,null,"No"]
[null,null,null,null,null,null,null,null,null,"No"]
[null,null,null,null,null,null,null,null,null,"No"]
[null,null,null,null,null,null,null,null,null,"No"]
[null,null,null,null,null,null,null,null,null,"No"]
[null,null,null,null,null,null,null,null,null,"No"]
[null,null,null,null,null,null,null,null,null,"No"]
[null,null,null,null,null,null,null,null,null,"No"]
[null,null,null,null,null,null,null,null,null,"No"]
[null,null,null,null,null,null,null,null,null,"No"]
[null,null,null,null,null,null,null,null,null,"No"]
[null,null,null,null,null,null,null,null,null,"No"]
[null,null,null,null,null,null,null,null,null,"No"]
[null,null,null,null,null,null,null,null,null,"No"]
[null,null,null,null,null,null,null,null,null,"No"]
[null,null,null,null,null,null,null,null,null,"No"]
[null,null,null,null,null,null,null,null,null,"No"]
[null,null,null,null,null,null,null,null,null,"No"]
[null,null,null,null,null,null,null,null,null,"No"]
[null,null,null,null,null,null,null,null,null,"No"]
[null,null,null,null,null,null,null,null,null,"No"]
[null,null,null,null,null,null,null,null,null,"No"]
[null,null,null,null,null,null,null,null,null,"No"]
[null,null,null,null,null,null,null,null,null,"No"]
[null,null,null,null,null,null,null,null,null,"No"]
[null,null,null,null,null,null,null,null,null,"No"]
[null,null,null,null,null,null,null,null,null,"No"]
[null,null,null,null,null,null,null,null,null,"No"]
[null,null,null,null,null,null,null,null,null,"No"]
[null,null,null,null,null,null,null,null,null,"No"]
[null,null,null,null,null,null,null,null,null,"No"]
[null,null,null,null,null,null,null,null,null,"No"]
[null,null,null,null,null,null,null,null,null,"No"]
[null,null,null,null,null,null,null,null,null,"No"]
[null,null,null,null,null,null,null,null,null,"No"]
[null,null,null,null,null,null,null,null,null,"No"]
[null,null,null,null,null,null,null,null,null,"No"]
[null,null,null,null,null,null,null,null,null,"No"]
[null,null,null,null,null,null,null,null,null,"No"]
[null,null,null,null,null,null,null,null,null,"No"]
[null,null,null,null,null,null,null,null,null,"No"]
[null,null,null,null,null,null,null,null,null,"No"]
[null,null,null,null,null,null,null,null,null,"No"]
[null,null,null,null,null,null,null,null,null,"No"]
[null,null,null,null,null,null,null,null,null,"No"]
[null,null,null,null,null,null,null,null,null,"No"]
[null,null,null,null,null,null,null,null,null,"No"]
[null,null,null,null,null,null,null,null,null,"No"]
[null,null,null,null,null,null,null,null,null,"No"]
[null,null,null,null,null,null,null,null,null,"No"]
[null,null,null,null,null,null,null,null,null,"No"]
[null,null,null,null,null,null,null,null,null,"No"]
[null,null,null,null,null,null,null,null,null,"No"]
[null,null,null,null,null,null,null,null,null,"No"]
[null,null,null,null,null,null,null,null,null,"No"]
[null,null,null,null,null,null,null,null,null,"No"]
[null,null,null,null,null,null,null,null,null,"No"]
[null,null,null,null,null,null,null,null,null,"No"]
[null,null,null,null,null,null,null,null,null,"No"]
[null,null,null,null,null,null,null,null,null,"No"]
[null,null,null,null,null,null,null,null,null,"No"]
[null,null,null,null,null,null,null,null,null,"No"]
[null,null,null,null,null,null,null,null,null,"No"]
[null,null,null,null,null,null,null,null,null,"No"]
[null,null,null,null,null,null,null,null,null,"No"]
[null,null,null,null,null,null,null,null,null,"No"]
[null,null,null,null,null,null,null,null,null,"No"]
[null,null,null,null,null,null,null,null,null,"No"]
[null,null,null,null,null,null,null,null,null,"No"]
[null,null,null,null,null,null,null,null,null,"No"]
[null,null,null,null,null,null,null,null,null,"No"]
[null,null,null,null,null,null,null,null,null,"No"]
[null,null,null,null,null,null,null,null,null,"No"]
[null,null,null,null,null,null,null,null,null,"No"]
[null,null,null,null,null,null,null,null,null,"No"]
[null,null,null,null,null,null,null,null,null,"No"]
[null,null,null,null,null,null,null,null,null,"No"]
[null,null,null,null,null,null,null,null,null,"No"]
[null,null,null,null,null,null,null,null,null,"No"]
[null,null,null,null,null,null,null,null,null,"No"]
[null,null,null,null,null,null,null,null,null,"No"]
[null,null,null,null,null,null,null,null,null,"No"]
[null,null,null,null,null,null,null,null,null,"No"]
[null,null,null,null,null,null,null,null,null,"No"]
[null,null,null,null,null,null,null,null,null,"No"]
[null,null,null,null,null,null,null,null,null,"No"]
[null,null,null,null,null,null,null,null,null,"No"]
[null,null,null,null,null,null,null,null,null,"No"]
[null,null,null,null,null,null,null,null,null,"No"]
[null,null,null,null,null,null,null,null,null,"No"]
[null,null,null,null,null,null,null,null,null,"No"]
[null,null,null,null,null,null,null,null,null,"No"]
[null,null,null,null,null,null,null,null,null,"No"]
[null,null,null,null,null,null,null,null,null,"No"]
[null,null,null,null,null,null,null,null,null,"No"]
[null,null,null,null,null,null,null,null,null,"No"]
[null,null,null,null,null,null,null,null,null,"No"]
[null,null,null,null,null,null,null,null,null,"No"]
[null,null,null,null,null,null,null,null,null,"No"]
[null,null,null,null,null,null,null,null,null,"No"]
[null,null,null,null,null,null,null,null,null,"No"]
[null,null,null,null,null,null,null,null,null,"No"]
[null,null,null,null,null,null,null,null,null,"No"]
[null,null,null,null,null,null,null,null,null,"No"]
[null,null,null,null,null,null,null,null,null,"No"]
[null,null,null,null,null,null,null,null,null,"No"]
[null,null,null,null,null,null,null,null,null,"No"]
[null,null,null,null,null,null,null,null,null,"No"]
[null,null,null,null,null,null,null,null,null,"No"]
[null,null,null,null,null,null,null,null,null,"No"]
[null,null,null,null,null,null,null,null,null,"No"]
[null,null,null,null,null,null,null,null,null,"No"]
[null,null,null,null,null,null,null,null,null,"No"]
[null,null,null,null,null,null,null,null,null,"No"]
[null,null,null,null,null,null,null,null,null,"No"]
[null,null,null,null,null,null,null,null,null,"No"]
[null,null,null,null,null,null,null,null,null,"No"]
[null,null,null,null,null,null,null,null,null,"No"]
[null,null,null,null,null,null,null,null,null,"No"]
[null,null,null,null,null,null,null,null,null,"No"]
[null,null,null,null,null,null,null,null,null,"No"]
[null,null,null,null,null,null,null,null,null,"No"]
[null,null,null,null,null,null,null,null,null,"No"]
[null,null,null,null,null,null,null,null,null,"No"]
[null,null,null,null,null,null,null,null,null,"No"]
[null,null,null,null,null,null,null,null,null,"No"]
[null,null,null,null,null,null,null,null,null,"No"]
[null,null,null,null,null,null,null,null,null,"No"]
[null,null,null,null,null,null,null,null,null,"No"]
[null,null,null,null,null,null,null,null,null,"No"]
[null,null,null,null,null,null,null,null,null,"No"]
[null,null,null,null,null,null,null,null,null,"No"]
[null,null,null,null,null,null,null,null,null,"No"]
[null,null,null,null,null,null,null,null,null,"No"]
[null,null,null,null,null,null,null,null,null,"No"]
[null,null,null,null,null,null,null,null,null,"No"]
[null,null,null,null,null,null,null,null,null,"No"]
[null,null,null,null,null,null,null,null,null,"No"]
[null,null,null,null,null,null,null,null,null,"No"]
[null,null,null,null,null,null,null,null,null,"No"]
[null,null,null,null,null,null,null,null,null,"No"]
[null,null,null,null,null,null,null,null,null,"No"]
[null,null,null,null,null,null,null,null,null,"No"]
[null,null,null,null,null,null,null,null,null,"No"]
[null,null,null,null,null,null,null,null,null,"No"]
[null,null,null,null,null,null,null,null,null,"No"]
[null,null,null,null,null,null,null,null,null,"No"]
[null,null,null,null,null,null,null,null,null,"No"]
[null,null,null,null,null,null,null,null,null,"No"]
[null,null,null,null,null,null,null,null,null,"No"]
[null,null,null,null,null,null,null,null,null,"No"]
[null,null,null,null,null,null,null,null,null,"No"]
[null,null,null,null,null,null,null,null,null,"No"]
[null,null,null,null,null,null,null,null,null,"No"]
[null,null,null,null,null,null,null,null,null,"No"]
[null,null,null,null,null,null,null,null,null,"No"]
[null,null,null,null,null,null,null,null,null,"No"]
[null,null,null,null,null,null,null,null,null,"No"]
[null,null,null,null,null,null,null,null,null,"No"]
[null,null,null,null,null,null,null,null,null,"No"]
[null,null,null,null,null,null,null,null,null,"No"]
[null,null,null,null,null,null,null,null,null,"No"]
[null,null,null,null,null,null,null,null,null,"No"]
[null,null,null,null,null,null,null,null,null,"No"]
[null,null,null,null,null,null,null,null,null,"No"]
[null,null,null,null,null,null,null,null,null,"No"]
[null,null,null,null,null,null,null,null,null,"No"]
[null,null,null,null,null,null,null,null,null,"No"]
[null,null,null,null,null,null,null,null,null,"No"]
[null,null,null,null,null,null,null,null,null,"No"]
[null,null,null,null,null,null,null,null,null,"No"]
[null,null,null,null,null,null,null,null,null,"No"]
[null,null,null,null,null,null,null,null,null,"No"]
[null,null,null,null,null,null,null,null,null,"No"]
[null,null,null,null,null,null,null,null,null,"No"]
[null,null,null,null,null,null,null,null,null,"No"]
[null,null,null,null,null,null,null,null,null,"No"]
[null,null,null,null,null,null,null,null,null,"No"]
[null,null,null,null,null,null,null,null,null,"No"]
[null,null,null,null,null,null,null,null,null,"No"]
[null,null,null,null,null,null,null,null,null,"No"]
[null,null,null,null,null,null,null,null,null,"No"]
[null,null,null,null,null,null,null,null,null,"No"]
[null,null,null,null,null,null,null,null,null,"No"]
[null,null,null,null,null,null,null,null,null,"No"]
[null,null,null,null,null,null,null,null,null,"No"]
[null,null,null,null,null,null,null,null,null,"No"]
[null,null,null,null,null,null,null,null,null,"No"]
[null,null,null,null,null,null,null,null,null,"No"]
[null,null,null,null,null,null,null,null,null,"No"]
[null,null,null,null,null,null,null,null,null,"No"]
[null,null,null,null,null,null,null,null,null,"No"]
[null,null,null,null,null,null,null,null,null,"No"]
[null,null,null,null,null,null,null,null,null,"No"]
[null,null,null,null,null,null,null,null,null,"No"]
[null,null,null,null,null,null,null,null,null,"No"]
[null,null,null,null,null,null,null,null,null,"No"]
[null,null,null,null,null,null,null,null,null,"No"]
[null,null,null,null,null,null,null,null,null,"No"]
[null,null,null,null,null,null,null,null,null,"No"]
[null,null,null,null,null,null,null,null,null,"No"]
[null,null,null,null,null,null,null,null,null,"No"]
[null,null,null,null,null,null,null,null,null,"No"]
[null,null,null,null,null,null,null,null,null,"No"]
[null,null,null,null,null,null,null,null,null,"No"]
[null,null,null,null,null,null,null,null,null,"No"]
[null,null,null,null,null,null,null,null,null,"No"]
[null,null,null,null,null,null,null,null,null,"No"]
[null,null,null,null,null,null,null,null,null,"No"]
[null,null,null,null,null,null,null,null,null,"No"]
[null,null,null,null,null,null,null,null,null,"No"]
[null,null,null,null,null,null,null,null,null,"No"]
[null,null,null,null,null,null,null,null,null,"No"]
[null,null,null,null,null,null,null,null,null,"No"]
[null,null,null,null,null,null,null,null,null,"No"]
[null,null,null,null,null,null,null,null,null,"No"]
[null,null,null,null,null,null,null,null,null,"No"]
[null,null,null,null,null,null,null,null,null,"No"]
[null,null,null,null,null,null,null,null,null,"No"]
[null,null,null,null,null,null,null,null,null,"No"]
[null,null,null,null,null,null,null,null,null,"No"]
[null,null,null,null,null,null,null,null,null,"No"]
[null,null,null,null,null,null,null,null,null,"No"]
[null,null,null,null,null,null,null,null,null,"No"]
[null,null,null,null,null,null,null,null,null,"No"]
[null,null,null,null,null,null,null,null,null,"No"]
[null,null,null,null,null,null,null,null,null,"No"]
[null,null,null,null,null,null,null,null,null,"No"]
[null,null,null,null,null,null,null,null,null,"No"]
[null,null,null,null,null,null,null,null,null,"No"]
[null,null,null,null,null,null,null,null,null,"No"]
[null,null,null,null,null,null,null,null,null,"No"]
[null,null,null,null,null,null,null,null,null,"No"]
[null,null,null,null,null,null,null,null,null,"No"]
[null,null,null,null,null,null,null,null,null,"No"]
[null,null,null,null,null,null,null,null,null,"No"]
[null,null,null,null,null,null,null,null,null,"No"]
[null,null,null,null,null,null,null,null,null,"No"]
[null,null,null,null,null,null,null,null,null,"No"]
[null,null,null,null,null,null,null,null,null,"No"]
[null,null,null,null,null,null,null,null,null,"No"]
[null,null,null,null,null,null,null,null,null,"No"]
[null,null,null,null,null,null,null,null,null,"No"]
[null,null,null,null,null,null,null,null,null,"No"]
[null,null,null,null,null,null,null,null,null,"No"]
[null,null,null,null,null,null,null,null,null,"No"]
[null,null,null,null,null,null,null,null,null,"No"]
[null,null,null,null,null,null,null,null,null,"No"]
[null,null,null,null,null,null,null,null,null,"No"]
[null,null,null,null,null,null,null,null,null,"No"]
[null,null,null,null,null,null,null,null,null,"No"]
[null,null,null,null,null,null,null,null,null,"No"]
[null,null,null,null,null,null,null,null,null,"No"]
[null,null,null,null,null,null,null,null,null,"No"]
[null,null,null,null,null,null,null,null,null,"No"]
[null,null,null,null,null,null,null,null,null,"No"]
[null,null,null,null,null,null,null,null,null,"No"]
[null,null,null,null,null,null,null,null,null,"No"]
[null,null,null,null,null,null,null,null,null,"No"]
[null,null,null,null,null,null,null,null,null,"No"]
[null,null,null,null,null,null,null,null,null,"No"]
[null,null,null,null,null,null,null,null,null,"No"]
[null,null,null,null,null,null,null,null,null,"No"]
[null,null,null,null,null,null,null,null,null,"No"]
[null,null,null,null,null,null,null,null,null,"No"]
[null,null,null,null,null,null,null,null,null,"No"]
[null,null,null,null,null,null,null,null,null,"No"]
[null,null,null,null,null,null,null,null,null,"No"]
[null,null,null,null,null,null,null,null,null,"No"]
[null,null,null,null,null,null,null,null,null,"No"]
[null,null,null,null,null,null,null,null,null,"No"]
[null,null,null,null,null,null,null,null,null,"No"]
[null,null,null,null,null,null,null,null,null,"No"]
[null,null,null,null,null,null,null,null,null,"No"]
[null,null,null,null,null,null,null,null,null,"No"]
[null,null,null,null,null,null,null,null,null,"No"]
[null,null,null,null,null,null,null,null,null,"No"]
[null,null,null,null,null,null,null,null,null,"No"]
[null,null,null,null,null,null,null,null,null,"No"]
[null,null,null,null,null,null,null,null,null,"No"]
[null,null,null,null,null,null,null,null,null,"No"]
[null,null,null,null,null,null,null,null,null,"No"]
[null,null,null,null,null,null,null,null,null,"No"]
[null,null,null,null,null,null,null,null,null,"No"]
[null,null,null,null,null,null,null,null,null,"No"]
[null,null,null,null,null,null,null,null,null,"No"]
[null,null,null,null,null,null,null,null,null,"No"]
[null,null,null,null,null,null,null,null,null,"No"]
[null,null,null,null,null,null,null,null,null,"No"]
[null,null,null,null,null,null,null,null,null,"No"]
[null,null,null,null,null,null,null,null,null,"No"]
[null,null,null,null,null,null,null,null,null,"No"]
[null,null,null,null,null,null,null,null,null,"No"]
[null,null,null,null,null,null,null,null,null,"No"]
[null,null,null,null,null,null,null,null,null,"No"]
[null,null,null,null,null,null,null,null,null,"No"]
[null,null,null,null,null,null,null,null,null,"No"]
[null,null,null,null,null,null,null,null,null,"No"]
[null,null,null,null,null,null,null,null,null,"No"]
[null,null,null,null,null,null,null,null,null,"No"]
[null,null,null,null,null,null,null,null,null,"No"]
[null,null,null,null,null,null,null,null,null,"No"]
[null,null,null,null,null,null,null,null,null,"No"]
[null,null,null,null,null,null,null,null,null,"No"]
[null,null,null,null,null,null,null,null,null,"No"]
[null,null,null,null,null,null,null,null,null,"No"]
[null,null,null,null,null,null,null,null,null,"No"]
[null,null,null,null,null,null,null,null,null,"No"]
[null,null,null,null,null,null,null,null,null,"No"]
[null,null,null,null,null,null,null,null,null,"No"]
[null,null,null,null,null,null,null,null,null,"No"]
[null,null,null,null,null,null,null,null,null,"No"]
[null,null,null,null,null,null,null,null,null,"No"]
[null,null,null,null,null,null,null,null,null,"No"]
[null,null,null,null,null,null,null,null,null,"No"]
[null,null,null,null,null,null,null,null,null,"No"]
[null,null,null,null,null,null,null,null,null,"No"]
[null,null,null,null,null,null,null,null,null,"No"]
[null,null,null,null,null,null,null,null,null,"No"]
[null,null,null,null,null,null,null,null,null,"No"]
[null,null,null,null,null,null,null,null,null,"No"]
[null,null,null,null,null,null,null,null,null,"No"]
[null,null,null,null,null,null,null,null,null,"No"]
[null,null,null,null,null,null,null,null,null,"No"]
[null,null,null,null,null,null,null,null,null,"No"]
[null,null,null,null,null,null,null,null,null,"No"]
[null,null,null,null,null,null,null,null,null,"No"]
[null,null,null,null,null,null,null,null,null,"No"]
[null,null,null,null,null,null,null,null,null,"No"]
[null,null,null,null,null,null,null,null,null,"No"]
[null,null,null,null,null,null,null,null,null,"No"]
[null,null,null,null,null,null,null,null,null,"No"]
[null,null,null,null,null,null,null,null,null,"No"]
[null,null,null,null,null,null,null,null,null,"No"]
[null,null,null,null,null,null,null,null,null,"No"]
[null,null,null,null,null,null,null,null,null,"No"]
[null,null,null,null,null,null,null,null,null,"No"]
[null,null,null,null,null,null,null,null,null,"No"]
[null,null,null,null,null,null,null,null,null,"No"]
[null,null,null,null,null,null,null,null,null,"No"]
[null,null,null,null,null,null,null,null,null,"No"]
[null,null,null,null,null,null,null,null,null,"No"]
[null,null,null,null,null,null,null,null,null,"No"]
[null,null,null,null,null,null,null,null,null,"No"]
[null,null,null,null,null,null,null,null,null,"No"]
[null,null,null,null,null,null,null,null,null,"No"]
[null,null,null,null,null,null,null,null,null,"No"]
[null,null,null,null,null,null,null,null,null,"No"]
[null,null,null,null,null,null,null,null,null,"No"]
[null,null,null,null,null,null,null,null,null,"No"]
[null,null,null,null,null,null,null,null,null,"No"]
[null,null,null,null,null,null,null,null,null,"No"]
[null,null,null,null,null,null,null,null,null,"No"]
[null,null,null,null,null,null,null,null,null,"No"]
[null,null,null,null,null,null,null,null,null,"No"]
[null,null,null,null,null,null,null,null,null,"No"]
[null,null,null,null,null,null,null,null,null,"No"]
[null,null,null,null,null,null,null,null,null,"No"]
[null,null,null,null,null,null,null,null,null,"No"]
[null,null,null,null,null,null,null,null,null,"No"]
[null,null,null,null,null,null,null,null,null,"No"]
[null,null,null,null,null,null,null,null,null,"No"]
[null,null,null,null,null,null,null,null,null,"No"]
[null,null,null,null,null,null,null,null,null,"No"]
[null,null,null,null,null,null,null,null,null,"No"]
[null,null,null,null,null,null,null,null,null,"No"]
[null,null,null,null,null,null,null,null,null,"No"]
[null,null,null,null,null,null,null,null,null,"No"]
[null,null,null,null,null,null,null,null,null,"No"]
[null,null,null,null,null,null,null,null,null,"No"]
[null,null,null,null,null,null,null,null,null,"No"]
[null,null,null,null,null,null,null,null,null,"No"]
[null,null,null,null,null,null,null,null,null,"No"]
[null,null,null,null,null,null,null,null,null,"No"]
[null,null,null,null,null,null,null,null,null,"No"]
[null,null,null,null,null,null,null,null,null,"No"]
[null,null,null,null,null,null,null,null,null,"No"]
[null,null,null,null,null,null,null,null,null,"No"]
[null,null,null,null,null,null,null,null,null,"No"]
[null,null,null,null,null,null,null,null,null,"No"]
[null,null,null,null,null,null,null,null,null,"No"]
[null,null,null,null,null,null,null,null,null,"No"]
[null,null,null,null,null,null,null,null,null,"No"]
[null,null,null,null,null,null,null,null,null,"No"]
[null,null,null,null,null,null,null,null,null,"No"]
[null,null,null,null,null,null,null,null,null,"No"]
[null,null,null,null,null,null,null,null,null,"No"]
[null,null,null,null,null,null,null,null,null,"No"]
[null,null,null,null,null,null,null,null,null,"No"]
[null,null,null,null,null,null,null,null,null,"No"]
[null,null,null,null,null,null,null,null,null,"No"]
[null,null,null,null,null,null,null,null,null,"No"]
[null,null,null,null,null,null,null,null,null,"No"]
[null,null,null,null,null,null,null,null,null,"No"]
[null,null,null,null,null,null,null,null,null,"No"]
[null,null,null,null,null,null,null,null,null,"No"]
[null,null,null,null,null,null,null,null,null,"No"]
[null,null,null,null,null,null,null,null,null,"No"]
[null,null,null,null,null,null,null,null,null,"No"]
[null,null,null,null,null,null,null,null,null,"No"]
[null,null,null,null,null,null,null,null,null,"No"]
[null,null,null,null,null,null,null,null,null,"No"]
[null,null,null,null,null,null,null,null,null,"No"]
[null,null,null,null,null,null,null,null,null,"No"]
[null,null,null,null,null,null,null,null,null,"No"]
[null,null,null,null,null,null,null,null,null,"No"]
[null,null,null,null,null,null,null,null,null,"No"]
[null,null,null,null,null,null,null,null,null,"No"]
[null,null,null,null,null,null,null,null,null,"No"]
[null,null,null,null,null,null,null,null,null,"No"]
[null,null,null,null,null,null,null,null,null,"No"]
[null,null,null,null,null,null,null,null,null,"No"]
[null,null,null,null,null,null,null,null,null,"No"]
[null,null,null,null,null,null,null,null,null,"No"]
[null,null,null,null,null,null,null,null,null,"No"]
[null,null,null,null,null,null,null,null,null,"No"]
[null,null,null,null,null,null,null,null,null,"No"]
[null,null,null,null,null,null,null,null,null,"No"]
[null,null,null,null,null,null,null,null,null,"No"]
[null,null,null,null,null,null,null,null,null,"No"]
[null,null,null,null,null,null,null,null,null,"No"]
[null,null,null,null,null,null,null,null,null,"No"]
[null,null,null,null,null,null,null,null,null,"No"]
[null,null,null,null,null,null,null,null,null,"No"]
[null,null,null,null,null,null,null,null,null,"No"]
[null,null,null,null,null,null,null,null,null,"No"]
[null,null,null,null,null,null,null,null,null,"No"]
[null,null,null,null,null,null,null,null,null,"No"]
[null,null,null,null,null,null,null,null,null,"No"]
[null,null,null,null,null,null,null,null,null,"No"]
[null,null,null,null,null,null,null,null,null,"No"]
[null,null,null,null,null,null,null,null,null,"No"]
[null,null,null,null,null,null,null,null,null,"No"]
[null,null,null,null,null,null,null,null,null,"No"]
[null,null,null,null,null,null,null,null,null,"No"]
[null,null,null,null,null,null,null,null,null,"No"]
[null,null,null,null,null,null,null,null,null,"No"]
[null,null,null,null,null,null,null,null,null,"No"]
[null,null,null,null,null,null,null,null,null,"No"]
[null,null,null,null,null,null,null,null,null,"No"]
[null,null,null,null,null,null,null,null,null,"No"]
[null,null,null,null,null,null,null,null,null,"No"]
[null,null,null,null,null,null,null,null,null,"No"]
[null,null,null,null,null,null,null,null,null,"No"]
[null,null,null,null,null,null,null,null,null,"No"]
[null,null,null,null,null,null,null,null,null,"No"]
[null,null,null,null,null,null,null,null,null,"No"]
[null,null,null,null,null,null,null,null,null,"No"]
[null,null,null,null,null,null,null,null,null,"No"]
[null,null,null,null,null,null,null,null,null,"No"]
[null,null,null,null,null,null,null,null,null,"No"]
[null,null,null,null,null,null,null,null,null,"No"]
[null,null,null,null,null,null,null,null,null,"No"]
[null,null,null,null,null,null,null,null,null,"No"]
[null,null,null,null,null,null,null,null,null,"No"]
[null,null,null,null,null,null,null,null,null,"No"]
[null,null,null,null,null,null,null,null,null,"No"]
[null,null,null,null,null,null,null,null,null,"No"]
[null,null,null,null,null,null,null,null,null,"No"]
[null,null,null,null,null,null,null,null,null,"No"]
[null,null,null,null,null,null,null,null,null,"No"]
[null,null,null,null,null,null,null,null,null,"No"]
[null,null,null,null,null,null,null,null,null,"No"]
[null,null,null,null,null,null,null,null,null,"No"]
[null,null,null,null,null,null,null,null,null,"No"]
[null,null,null,null,null,null,null,null,null,"No"]
[null,null,null,null,null,null,null,null,null,"No"]
[null,null,null,null,null,null,null,null,null,"No"]
[null,null,null,null,null,null,null,null,null,"No"]
[null,null,null,null,null,null,null,null,null,"No"]
[null,null,null,null,null,null,null,null,null,"No"]
[null,null,null,null,null,null,null,null,null,"No"]
[null,null,null,null,null,null,null,null,null,"No"]
[null,null,null,null,null,null,null,null,null,"No"]
[null,null,null,null,null,null,null,null,null,"No"]
[null,null,null,null,null,null,null,null,null,"No"]
[null,null,null,null,null,null,null,null,null,"No"]
[null,null,null,null,null,null,null,null,null,"No"]
[null,null,null,null,null,null,null,null,null,"No"]
[null,null,null,null,null,null,null,null,null,"No"]
[null,null,null,null,null,null,null,null,null,"No"]
[null,null,null,null,null,null,null,null,null,"No"]
[null,null,null,null,null,null,null,null,null,"No"]
[null,null,null,null,null,null,null,null,null,"No"]
[null,null,null,null,null,null,null,null,null,"No"]
[null,null,null,null,null,null,null,null,null,"No"]
[null,null,null,null,null,null,null,null,null,"No"]
[null,null,null,null,null,null,null,null,null,"No"]
[null,null,null,null,null,null,null,null,null,"No"]
[null,null,null,null,null,null,null,null,null,"No"]
[null,null,null,null,null,null,null,null,null,"No"]
[null,null,null,null,null,null,null,null,null,"No"]
[null,null,null,null,null,null,null,null,null,"No"]
[null,null,null,null,null,null,null,null,null,"No"]
[null,null,null,null,null,null,null,null,null,"No"]
[null,null,null,null,null,null,null,null,null,"No"]
[null,null,null,null,null,null,null,null,null,"No"]
[null,null,null,null,null,null,null,null,null,"No"]
[null,null,null,null,null,null,null,null,null,"No"]
[null,null,null,null,null,null,null,null,null,"No"]
[null,null,null,null,null,null,null,null,null,"No"]
[null,null,null,null,null,null,null,null,null,"No"]
[null,null,null,null,null,null,null,null,null,"No"]
[null,null,null,null,null,null,null,null,null,"No"]
[null,null,null,null,null,null,null,null,null,"No"]
[null,null,null,null,null,null,null,null,null,"No"]
[null,null,null,null,null,null,null,null,null,"No"]
[null,null,null,null,null,null,null,null,null,"No"]
[null,null,null,null,null,null,null,null,null,"No"]
[null,null,null,null,null,null,null,null,null,"No"]
[null,null,null,null,null,null,null,null,null,"No"]
[null,null,null,null,null,null,null,null,null,"No"]
[null,null,null,null,null,null,null,null,null,"No"]
[null,null,null,null,null,null,null,null,null,"No"]
[null,null,null,null,null,null,null,null,null,"No"]
[null,null,null,null,null,null,null,null,null,"No"]
[null,null,null,null,null,null,null,null,null,"No"]
[null,null,null,null,null,null,null,null,null,"No"]
[null,null,null,null,null,null,null,null,null,"No"]
[null,null,null,null,null,null,null,null,null,"No"]
[null,null,null,null,null,null,null,null,null,"No"]
[null,null,null,null,null,null,null,null,null,"No"]
[null,null,null,null,null,null,null,null,null,"No"]
[null,null,null,null,null,null,null,null,null,"No"]
[null,null,null,null,null,null,null,null,null,"No"]
[null,null,null,null,null,null,null,null,null,"No"]
[null,null,null,null,null,null,null,null,null,"No"]
[null,null,null,null,null,null,null,null,null,"No"]
[null,null,null,null,null,null,null,null,null,"No"]
[null,null,null,null,null,null,null,null,null,"No"]
[null,null,null,null,null,null,null,null,null,"No"]
[null,null,null,null,null,null,null,null,null,"No"]
[null,null,null,null,null,null,null,null,null,"No"]
[null,null,null,null,null,null,null,null,null,"No"]
[null,null,null,null,null,null,null,null,null,"No"]
[null,null,null,null,null,null,null,null,null,"No"]
[null,null,null,null,null,null,null,null,null,"No"]
[null,null,null,null,null,null,null,null,null,"No"]
[null,null,null,null,null,null,null,null,null,"No"]
[null,null,null,null,null,null,null,null,null,"No"]
[null,null,null,null,null,null,null,null,null,"No"]
[null,null,null,null,null,null,null,null,null,"No"]
[null,null,null,null,null,null,null,null,null,"No"]
[null,null,null,null,null,null,null,null,null,"No"]
[null,null,null,null,null,null,null,null,null,"No"]
[null,null,null,null,null,null,null,null,null,"No"]
[null,null,null,null,null,null,null,null,null,"No"]
[null,null,null,null,null,null,null,null,null,"No"]
[null,null,null,null,null,null,null,null,null,"No"]
[null,null,null,null,null,null,null,null,null,"No"]
[null,null,null,null,null,null,null,null,null,"No"]
[null,null,null,null,null,null,null,null,null,"No"]
[null,null,null,null,null,null,null,null,null,"No"]
[null,null,null,null,null,null,null,null,null,"No"]
[null,null,null,null,null,null,null,null,null,"No"]
[null,null,null,null,null,null,null,null,null,"No"]
[null,null,null,null,null,null,null,null,null,"No"]
[null,null,null,null,null,null,null,null,null,"No"]
[null,null,null,null,null,null,null,null,null,"No"]
[null,null,null,null,null,null,null,null,null,"No"]
[null,null,null,null,null,null,null,null,null,"No"]
[null,null,null,null,null,null,null,null,null,"No"]
[null,null,null,null,null,null,null,null,null,"No"]
[null,null,null,null,null,null,null,null,null,"No"]
[null,null,null,null,null,null,null,null,null,"No"]
[null,null,null,null,null,null,null,null,null,"No"]
[null,null,null,null,null,null,null,null,null,"No"]
[null,null,null,null,null,null,null,null,null,"No"]
[null,null,null,null,null,null,null,null,null,"No"]
[null,null,null,null,null,null,null,null,null,"No"]
[null,null,null,null,null,null,null,null,null,"No"]
[null,null,null,null,null,null,null,null,null,"No"]
[null,null,null,null,null,null,null,null,null,"No"]
[null,null,null,null,null,null,null,null,null,"No"]
[null,null,null,null,null,null,null,null,null,"No"]
[null,null,null,null,null,null,null,null,null,"No"]
[null,null,null,null,null,null,null,null,null,"No"]
[null,null,null,null,null,null,null,null,null,"No"]
[null,null,null,null,null,null,null,null,null,"No"]
[null,null,null,null,null,null,null,null,null,"No"]
[null,null,null,null,null,null,null,null,null,"No"]
[null,null,null,null,null,null,null,null,null,"No"]
[null,null,null,null,null,null,null,null,null,"No"]
[null,null,null,null,null,null,null,null,null,"No"]
[null,null,null,null,null,null,null,null,null,"No"]
[null,null,null,null,null,null,null,null,null,"No"]
[null,null,null,null,null,null,null,null,null,"No"]
[null,null,null,null,null,null,null,null,null,"No"]
[null,null,null,null,null,null,null,null,null,"No"]
[null,null,null,null,null,null,null,null,null,"No"]
[null,null,null,null,null,null,null,null,null,"No"]
[null,null,null,null,null,null,null,null,null,"No"]
[null,null,null,null,null,null,null,null,null,"No"]
[null,null,null,null,null,null,null,null,null,"No"]
[null,null,null,null,null,null,null,null,null,"No"]
[null,null,null,null,null,null,null,null,null,"No"]
[null,null,null,null,null,null,null,null,null,"No"]
[null,null,null,null,null,null,null,null,null,"No"]
[null,null,null,null,null,null,null,null,null,"No"]
[null,null,null,null,null,null,null,null,null,"No"]
[null,null,null,null,null,null,null,null,null,"No"]
[null,null,null,null,null,null,null,null,null,"No"]
[null,null,null,null,null,null,null,null,null,"No"]
[null,null,null,null,null,null,null,null,null,"No"]
[null,null,null,null,null,null,null,null,null,"No"]
[null,null,null,null,null,null,null,null,null,"No"]
[null,null,null,null,null,null,null,null,null,"No"]
[null,null,null,null,null,null,null,null,null,"No"]
[null,null,null,null,null,null,null,null,null,"No"]
[null,null,null,null,null,null,null,null,null,"No"]
[null,null,null,null,null,null,null,null,null,"No"]
[null,null,null,null,null,null,null,null,null,"No"]
[null,null,null,null,null,null,null,null,null,"No"]
[null,null,null,null,null,null,null,null,null,"No"]
[null,null,null,null,null,null,null,null,null,"No"]
[null,null,null,null,null,null,null,null,null,"No"]
[null,null,null,null,null,null,null,null,null,"No"]
[null,null,null,null,null,null,null,null,null,"No"]
[null,null,null,null,null,null,null,null,null,"No"]
[null,null,null,null,null,null,null,null,null,"No"]
[null,null,null,null,null,null,null,null,null,"No"]
[null,null,null,null,null,null,null,null,null,"No"]
[null,null,null,null,null,null,null,null,null,"No"]
[null,null,null,null,null,null,null,null,null,"No"]
[null,null,null,null,null,null,null,null,null,"No"]
[null,null,null,null,null,null,null,null,null,"No"]
[null,null,null,null,null,null,null,null,null,"No"]
[null,null,null,null,null,null,null,null,null,"No"]
[null,null,null,null,null,null,null,null,null,"No"]
[null,null,null,null,null,null,null,null,null,"No"]
[null,null,null,null,null,null,null,null,null,"No"]
[null,null,null,null,null,null,null,null,null,"No"]
[null,null,null,null,null,null,null,null,null,"No"]
[null,null,null,null,null,null,null,null,null,"No"]
[null,null,null,null,null,null,null,null,null,"No"]
[null,null,null,null,null,null,null,null,null,"No"]
[null,null,null,null,null,null,null,null,null,"No"]
[null,null,null,null,null,null,null,null,null,"No"]
[null,null,null,null,null,null,null,null,null,"No"]
[null,null,null,null,null,null,null,null,null,"No"]
[null,null,null,null,null,null,null,null,null,"No"]
[null,null,null,null,null,null,null,null,null,"No"]
[null,null,null,null,null,null,null,null,null,"No"]
[null,null,null,null,null,null,null,null,null,"No"]
[null,null,null,null,null,null,null,null,null,"No"]
[null,null,null,null,null,null,null,null,null,"No"]
[null,null,null,null,null,null,null,null,null,"No"]
[null,null,null,null,null,null,null,null,null,"No"]
[null,null,null,null,null,null,null,null,null,"No"]
[null,null,null,null,null,null,null,null,null,"No"]
[null,null,null,null,null,null,null,null,null,"No"]
[null,null,null,null,null,null,null,null,null,"No"]
[null,null,null,null,null,null,null,null,null,"No"]
[null,null,null,null,null,null,null,null,null,"No"]
[null,null,null,null,null,null,null,null,null,"No"]
[null,null,null,null,null,null,null,null,null,"No"]
[null,null,null,null,null,null,null,null,null,"No"]
[null,null,null,null,null,null,null,null,null,"No"]
[null,null,null,null,null,null,null,null,null,"No"]
[null,null,null,null,null,null,null,null,null,"No"]
[null,null,null,null,null,null,null,null,null,"No"]
[null,null,null,null,null,null,null,null,null,"No"]
[null,null,null,null,null,null,null,null,null,"No"]
[null,null,null,null,null,null,null,null,null,"No"]
[null,null,null,null,null,null,null,null,null,"No"]
[null,null,null,null,null,null,null,null,null,"No"]
[null,null,null,null,null,null,null,null,null,"No"]
[null,null,null,null,null,null,null,null,null,"No"]
[null,null,null,null,null,null,null,null,null,"No"]
[null,null,null,null,null,null,null,null,null,"No"]
[null,null,null,null,null,null,null,null,null,"No"]
[null,null,null,null,null,null,null,null,null,"No"]
[null,null,null,null,null,null,null,null,null,"No"]
[null,null,null,null,null,null,null,null,null,"No"]
[null,null,null,null,null,null,null,null,null,"No"]
[null,null,null,null,null,null,null,null,null,"No"]
[null,null,null,null,null,null,null,null,null,"No"]
[null,null,null,null,null,null,null,null,null,"No"]
[null,null,null,null,null,null,null,null,null,"No"]
[null,null,null,null,null,null,null,null,null,"No"]
[null,null,null,null,null,null,null,null,null,"No"]
[null,null,null,null,null,null,null,null,null,"No"]
[null,null,null,null,null,null,null,null,null,"No"]
[null,null,null,null,null,null,null,null,null,"No"]
[null,null,null,null,null,null,null,null,null,"No"]
[null,null,null,null,null,null,null,null,null,"No"]
[null,null,null,null,null,null,null,null,null,"No"]
[null,null,null,null,null,null,null,null,null,"No"]
[null,null,null,null,null,null,null,null,null,"No"]
[null,null,null,null,null,null,null,null,null,"No"]
[null,null,null,null,null,null,null,null,null,"No"]
[null,null,null,null,null,null,null,null,null,"No"]
[null,null,null,null,null,null,null,null,null,"No"]
[null,null,null,null,null,null,null,null,null,"No"]
[null,null,null,null,null,null,null,null,null,"No"]
[null,null,null,null,null,null,null,null,null,"No"]
[null,null,null,null,null,null,null,null,null,"No"]
[null,null,null,null,null,null,null,null,null,"No"]
[null,null,null,null,null,null,null,null,null,"No"]
[null,null,null,null,null,null,null,null,null,"No"]
[null,null,null,null,null,null,null,null,null,"No"]
[null,null,null,null,null,null,null,null,null,"No"]
[null,null,null,null,null,null,null,null,null,"No"]
[null,null,null,null,null,null,null,null,null,"No"]
[null,null,null,null,null,null,null,null,null,"No"]
[null,null,null,null,null,null,null,null,null,"No"]
[null,null,null,null,null,null,null,null,null,"No"]
[null,null,null,null,null,null,null,null,null,"No"]
[null,null,null,null,null,null,null,null,null,"No"]
[null,null,null,null,null,null,null,null,null,"No"]
[null,null,null,null,null,null,null,null,null,"No"]
[null,null,null,null,null,null,null,null,null,"No"]
[null,null,null,null,null,null,null,null,null,"No"]
[null,null,null,null,null,null,null,null,null,"No"]
[null,null,null,null,null,null,null,null,null,"No"]
[null,null,null,null,null,null,null,null,null,"No"]
[null,null,null,null,null,null,null,null,null,"No"]
[null,null,null,null,null,null,null,null,null,"No"]
[null,null,null,null,null,null,null,null,null,"No"]
[null,null,null,null,null,null,null,null,null,"No"]
[null,null,null,null,null,null,null,null,null,"No"]
[null,null,null,null,null,null,null,null,null,"No"]
[null,null,null,null,null,null,null,null,null,"No"]
[null,null,null,null,null,null,null,null,null,"No"]
[null,null,null,null,null,null,null,null,null,"No"]
[null,null,null,null,null,null,null,null,null,"No"]
[null,null,null,null,null,null,null,null,null,"No"]
[null,null,null,null,null,null,null,null,null,"No"]
[null,null,null,null,null,null,null,null,null,"No"]
[null,null,null,null,null,null,null,null,null,"No"]
[null,null,null,null,null,null,null,null,null,"No"]
[null,null,null,null,null,null,null,null,null,"No"]
[null,null,null,null,null,null,null,null,null,"No"]
[null,null,null,null,null,null,null,null,null,"No"]
[null,null,null,null,null,null,null,null,null,"No"]
[null,null,null,null,null,null,null,null,null,"No"]
[null,null,null,null,null,null,null,null,null,"No"]
[null,null,null,null,null,null,null,null,null,"No"]
[null,null,null,null,null,null,null,null,null,"No"]
[null,null,null,null,null,null,null,null,null,"No"]
[null,null,null,null,null,null,null,null,null,"No"]
[null,null,null,null,null,null,null,null,null,"No"]
[null,null,null,null,null,null,null,null,null,"No"]
[null,null,null,null,null,null,null,null,null,"No"]
[null,null,null,null,null,null,null,null,null,"No"]
[null,null,null,null,null,null,null,null,null,"No"]
[null,null,null,null,null,null,null,null,null,"No"]
[null,null,null,null,null,null,null,null,null,"No"]
[null,null,null,null,null,null,null,null,null,"No"]
[null,null,null,null,null,null,null,null,null,"No"]
[null,null,null,null,null,null,null,null,null,"No"]
[null,null,null,null,null,null,null,null,null,"No"]
[null,null,null,null,null,null,null,null,null,"No"]
[null,null,null,null,null,null,null,null,null,"No"]
[null,null,null,null,null,null,null,null,null,"No"]
[null,null,null,null,null,null,null,null,null,"No"]
[null,null,null,null,null,null,null,null,null,"No"]
[null,null,null,null,null,null,null,null,null,"No"]
[null,null,null,null,null,null,null,null,null,"No"]
[null,null,null,null,null,null,null,null,null,"No"]
[null,null,null,null,null,null,null,null,null,"No"]
[null,null,null,null,null,null,null,null,null,"No"]
[null,null,null,null,null,null,null,null,null,"No"]
[null,null,null,null,null,null,null,null,null,"No"]
[null,null,null,null,null,null,null,null,null,"No"]
[null,null,null,null,null,null,null,null,null,"No"]
[null,null,null,null,null,null,null,null,null,"No"]
[null,null,null,null,null,null,null,null,null,"No"]
[null,null,null,null,null,null,null,null,null,"No"]
[null,null,null,null,null,null,null,null,null,"No"]
[null,null,null,null,null,null,null,null,null,"No"]
[null,null,null,null,null,null,null,null,null,"No"]
[null,null,null,null,null,null,null,null,null,"No"]
[null,null,null,null,null,null,null,null,null,"No"]
[null,null,null,null,null,null,null,null,null,"No"]
[null,null,null,null,null,null,null,null,null,"No"]
[null,null,null,null,null,null,null,null,null,"No"]
[null,null,null,null,null,null,null,null,null,"No"]
[null,null,null,null,null,null,null,null,null,"No"]
[null,null,null,null,null,null,null,null,null,"No"]
[null,null,null,null,null,null,null,null,null,"No"]
[null,null,null,null,null,null,null,null,null,"No"]
[null,null,null,null,null,null,null,null,null,"No"]
[null,null,null,null,null,null,null,null,null,"No"]
[null,null,null,null,null,null,null,null,null,"No"]
[null,null,null,null,null,null,null,null,null,"No"]
[null,null,null,null,null,null,null,null,null,"No"]
[null,null,null,null,null,null,null,null,null,"No"]
[null,null,null,null,null,null,null,null,null,"No"]
[null,null,null,null,null,null,null,null,null,"No"]
[null,null,null,null,null,null,null,null,null,"No"]
[null,null,null,null,null,null,null,null,null,"No"]
[null,null,null,null,null,null,null,null,null,"No"]
[null,null,null,null,null,null,null,null,null,"No"]
[null,null,null,null,null,null,null,null,null,"No"]
[null,null,null,null,null,null,null,null,null,"No"]
[null,null,null,null,null,null,null,null,null,"No"]
[null,null,null,null,null,null,null,null,null,"No"]
[null,null,null,null,null,null,null,null,null,"No"]
[null,null,null,null,null,null,null,null,null,"No"]
[null,null,null,null,null,null,null,null,null,"No"]
[null,null,null,null,null,null,null,null,null,"No"]
[null,null,null,null,null,null,null,null,null,"No"]
[null,null,null,null,null,null,null,null,null,"No"]
[null,null,null,null,null,null,null,null,null,"No"]
[null,null,null,null,null,null,null,null,null,"No"]
[null,null,null,null,null,null,null,null,null,"No"]
[null,null,null,null,null,null,null,null,null,"No"]
[null,null,null,null,null,null,null,null,null,"No"]
[null,null,null,null,null,null,null,null,null,"No"]
[null,null,null,null,null,null,null,null,null,"No"]
[null,null,null,null,null,null,null,null,null,"No"]
[null,null,null,null,null,null,null,null,null,"No"]
[null,null,null,null,null,null,null,null,null,"No"]
[null,null,null,null,null,null,null,null,null,"No"]
[null,null,null,null,null,null,null,null,null,"No"]
[null,null,null,null,null,null,null,null,null,"No"]
[null,null,null,null,null,null,null,null,null,"No"]
[null,null,null,null,null,null,null,null,null,"No"]
[null,null,null,null,null,null,null,null,null,"No"]
[null,null,null,null,null,null,null,null,null,"No"]
[null,null,null,null,null,null,null,null,null,"No"]
[null,null,null,null,null,null,null,null,null,"No"]
[null,null,null,null,null,null,null,null,null,"No"]
[null,null,null,null,null,null,null,null,null,"No"]
[null,null,null,null,null,null,null,null,null,"No"]
[null,null,null,null,null,null,null,null,null,"No"]
[null,null,null,null,null,null,null,null,null,"No"]
[null,null,null,null,null,null,null,null,null,"No"]
[null,null,null,null,null,null,null,null,null,"No"]
[null,null,null,null,null,null,null,null,null,"No"]
[null,null,null,null,null,null,null,null,null,"No"]
[null,null,null,null,null,null,null,null,null,"No"]
[null,null,null,null,null,null,null,null,null,"No"]
[null,null,null,null,null,null,null,null,null,"No"]
[null,null,null,null,null,null,null,null,null,"No"]
[null,null,null,null,null,null,null,null,null,"No"]
[null,null,null,null,null,null,null,null,null,"No"]
[null,null,null,null,null,null,null,null,null,"No"]
[null,null,null,null,null,null,null,null,null,"No"]
[null,null,null,null,null,null,null,null,null,"No"]
[null,null,null,null,null,null,null,null,null,"No"]
[null,null,null,null,null,null,null,null,null,"No"]
[null,null,null,null,null,null,null,null,null,"No"]
[null,null,null,null,null,null,null,null,null,"No"]
[null,null,null,null,null,null,null,null,null,"No"]
[null,null,null,null,null,null,null,null,null,"No"]
[null,null,null,null,null,null,null,null,null,"No"]
[null,null,null,null,null,null,null,null,null,"No"]
[null,null,null,null,null,null,null,null,null,"No"]
[null,null,null,null,null,null,null,null,null,"No"]
[null,null,null,null,null,null,null,null,null,"No"]
[null,null,null,null,null,null,null,null,null,"No"]
[null,null,null,null,null,null,null,null,null,"No"]
[null,null,null,null,null,null,null,null,null,"No"]
[null,null,null,null,null,null,null,null,null,"No"]
[null,null,null,null,null,null,null,null,null,"No"]
[null,null,null,null,null,null,null,null,null,"No"]
[null,null,null,null,null,null,null,null,null,"No"]
[null,null,null,null,null,null,null,null,null,"No"]
[null,null,null,null,null,null,null,null,null,"No"]
[null,null,null,null,null,null,null,null,null,"No"]
[null,null,null,null,null,null,null,null,null,"No"]
[null,null,null,null,null,null,null,null,null,"No"]
[null,null,null,null,null,null,null,null,null,"No"]
[null,null,null,null,null,null,null,null,null,"No"]
[null,null,null,null,null,null,null,null,null,"No"]
[null,null,null,null,null,null,null,null,null,"No"]
[null,null,null,null,null,null,null,null,null,"No"]
[null,null,null,null,null,null,null,null,null,"No"]
[null,null,null,null,null,null,null,null,null,"No"]
[null,null,null,null,null,null,null,null,null,"No"]
[null,null,null,null,null,null,null,null,null,"No"]
[null,null,null,null,null,null,null,null,null,"No"]
[null,null,null,null,null,null,null,null,null,"No"]
[null,null,null,null,null,null,null,null,null,"No"]
[null,null,null,null,null,null,null,null,null,"No"]
[null,null,null,null,null,null,null,null,null,"No"]
[null,null,null,null,null,null,null,null,null,"No"]
[null,null,null,null,null,null,null,null,null,"No"]
[null,null,null,null,null,null,null,null,null,"No"]
[null,null,null,null,null,null,null,null,null,"No"]
[null,null,null,null,null,null,null,null,null,"No"]
[null,null,null,null,null,null,null,null,null,"No"]
[null,null,null,null,null,null,null,null,null,"No"]
[null,null,null,null,null,null,null,null,null,"No"]
[null,null,null,null,null,null,null,null,null,"No"]
[null,null,null,null,null,null,null,null,null,"No"]
[null,null,null,null,null,null,null,null,null,"No"]
[null,null,null,null,null,null,null,null,null,"No"]
[null,null,null,null,null,null,null,null,null,"No"]
[null,null,null,null,null,null,null,null,null,"No"]
[null,null,null,null,null,null,null,null,null,"No"]
[null,null,null,null,null,null,null,null,null,"No"]
[null,null,null,null,null,null,null,null,null,"No"]
[null,null,null,null,null,null,null,null,null,"No"]
[null,null,null,null,null,null,null,null,null,"No"]
[null,null,null,null,null,null,null,null,null,"No"]
[null,null,null,null,null,null,null,null,null,"No"]
[null,null,null,null,null,null,null,null,null,"No"]
[null,null,null,null,null,null,null,null,null,"No"]
[null,null,null,null,null,null,null,null,null,"No"]
[null,null,null,null,null,null,null,null,null,"No"]
[null,null,null,null,null,null,null,null,null,"No"]
[null,null,null,null,null,null,null,null,null,"No"]
[null,null,null,null,null,null,null,null,null,"No"]
[null,null,null,null,null,null,null,null,null,"No"]
[null,null,null,null,null,null,null,null,null,"No"]
[null,null,null,null,null,null,null,null,null,"No"]
[null,null,null,null,null,null,null,null,null,"No"]
[null,null,null,null,null,null,null,null,null,"No"]
[null,null,null,null,null,null,null,null,null,"No"]
[null,null,null,null,null,null,null,null,null,"No"]
[null,null,null,null,null,null,null,null,null,"No"]
[null,null,null,null,null,null,null,null,null,"No"]
[null,null,null,null,null,null,null,null,null,"No"]
[null,null,null,null,null,null,null,null,null,"No"]
[null,null,null,null,null,null,null,null,null,"No"]
[null,null,null,null,null,null,null,null,null,"No"]
[null,null,null,null,null,null,null,null,null,"No"]
[null,null,null,null,null,null,null,null,null,"No"]
[null,null,null,null,null,null,null,null,null,"No"]
[null,null,null,null,null,null,null,null,null,"No"]
[null,null,null,null,null,null,null,null,null,"No"]
[null,null,null,null,null,null,null,null,null,"No"]
[null,null,null,null,null,null,null,null,null,"No"]
[null,null,null,null,null,null,null,null,null,"No"]
[null,null,null,null,null,null,null,null,null,"No"]
[null,null,null,null,null,null,null,null,null,"No"]
[null,null,null,null,null,null,null,null,null,"No"]
[null,null,null,null,null,null,null,null,null,"No"]
[null,null,null,null,null,null,null,null,null,"No"]
[null,null,null,null,null,null,null,null,null,"No"]
[null,null,null,null,null,null,null,null,null,"No"]
[null,null,null,null,null,null,null,null,null,"No"]
[null,null,null,null,null,null,null,null,null,"No"]
[null,null,null,null,null,null,null,null,null,"No"]
[null,null,null,null,null,null,null,null,null,"No"]
[null,null,null,null,null,null,null,null,null,"No"]
[null,null,null,null,null,null,null,null,null,"No"]
[null,null,null,null,null,null,null,null,null,"No"]
[null,null,null,null,null,null,null,null,null,"No"]
[null,null,null,null,null,null,null,null,null,"No"]
[null,null,null,null,null,null,null,null,null,"No"]
[null,null,null,null,null,null,null,null,null,"No"]
[null,null,null,null,null,null,null,null,null,"No"]
[null,null,null,null,null,null,null,null,null,"No"]
[null,null,null,null,null,null,null,null,null,"No"]
[null,null,null,null,null,null,null,null,null,"No"]
[null,null,null,null,null,null,null,null,null,"No"]
[null,null,null,null,null,null,null,null,null,"No"]
[null,null,null,null,null,null,null,null,null,"No"]
[null,null,null,null,null,null,null,null,null,"No"]
[null,null,null,null,null,null,null,null,null,"No"]
[null,null,null,null,null,null,null,null,null,"No"]
[null,null,null,null,null,null,null,null,null,"No"]
[null,null,null,null,null,null,null,null,null,"No"]
[null,null,null,null,null,null,null,null,null,"No"]
[null,null,null,null,null,null,null,null,null,"No"]
[null,null,null,null,null,null,null,null,null,"No"]
[null,null,null,null,null,null,null,null,null,"No"]
[null,null,null,null,null,null,null,null,null,"No"]
[null,null,null,null,null,null,null,null,null,"No"]
[null,null,null,null,null,null,null,null,null,"No"]
[null,null,null,null,null,null,null,null,null,"No"]
[null,null,null,null,null,null,null,null,null,"No"]
[null,null,null,null,null,null,null,null,null,"No"]
[null,null,null,null,null,null,null,null,null,"No"]
[null,null,null,null,null,null,null,null,null,"No"]
[null,null,null,null,null,null,null,null,null,"No"]
[null,null,null,null,null,null,null,null,null,"No"]
[null,null,null,null,null,null,null,null,null,"No"]
[null,null,null,null,null,null,null,null,null,"No"]
[null,null,null,null,null,null,null,null,null,"No"]
[null,null,null,null,null,null,null,null,null,"No"]
[null,null,null,null,null,null,null,null,null,"No"]
[null,null,null,null,null,null,null,null,null,"No"]
[null,null,null,null,null,null,null,null,null,"No"]
[null,null,null,null,null,null,null,null,null,"No"]
[null,null,null,null,null,null,null,null,null,"No"]
[null,null,null,null,null,null,null,null,null,"No"]
[null,null,null,null,null,null,null,null,null,"No"]
[null,null,null,null,null,null,null,null,null,"No"]
[null,null,null,null,null,null,null,null,null,"No"]
[null,null,null,null,null,null,null,null,null,"No"]
[null,null,null,null,null,null,null,null,null,"No"]
[null,null,null,null,null,null,null,null,null,"No"]
[null,null,null,null,null,null,null,null,null,"No"]
[null,null,null,null,null,null,null,null,null,"No"]
[null,null,null,null,null,null,null,null,null,"No"]
[null,null,null,null,null,null,null,null,null,"No"]
[null,null,null,null,null,null,null,null,null,"No"]
[null,null,null,null,null,null,null,null,null,"No"]
[null,null,null,null,null,null,null,null,null,"No"]
[null,null,null,null,null,null,null,null,null,"No"]
[null,null,null,null,null,null,null,null,null,"No"]
[null,null,null,null,null,null,null,null,null,"No"]
[null,null,null,null,null,null,null,null,null,"No"]
[null,null,null,null,null,null,null,null,null,"No"]
[null,null,null,null,null,null,null,null,null,"No"]
[null,null,null,null,null,null,null,null,null,"No"]
[null,null,null,null,null,null,null,null,null,"No"]
[null,null,null,null,null,null,null,null,null,"No"]
[null,null,null,null,null,null,null,null,null,"No"]
[null,null,null,null,null,null,null,null,null,"No"]
[null,null,null,null,null,null,null,null,null,"No"]
[null,null,null,null,null,null,null,null,null,"No"]
[null,null,null,null,null,null,null,null,null,"No"]
[null,null,null,null,null,null,null,null,null,"No"]
[null,null,null,null,null,null,null,null,null,"No"]
[null,null,null,null,null,null,null,null,null,"No"]
[null,null,null,null,null,null,null,null,null,"No"]
[null,null,null,null,null,null,null,null,null,"No"]
[null,null,null,null,null,null,null,null,null,"No"]
[null,null,null,null,null,null,null,null,null,"No"]
[null,null,null,null,null,null,null,null,null,"No"]
[null,null,null,null,null,null,null,null,null,"No"]
[null,null,null,null,null,null,null,null,null,"No"]
[null,null,null,null,null,null,null,null,null,"No"]
[null,null,null,null,null,null,null,null,null,"No"]
[null,null,null,null,null,null,null,null,null,"No"]
[null,null,null,null,null,null,null,null,null,"No"]
[null,null,null,null,null,null,null,null,null,"No"]
[null,null,null,null,null,null,null,null,null,"No"]
[null,null,null,null,null,null,null,null,null,"No"]
[null,null,null,null,null,null,null,null,null,"No"]
[null,null,null,null,null,null,null,null,null,"No"]
[null,null,null,null,null,null,null,null,null,"No"]
[null,null,null,null,null,null,null,null,null,"No"]
[null,null,null,null,null,null,null,null,null,"No"]
[null,null,null,null,null,null,null,null,null,"No"]
[null,null,null,null,null,null,null,null,null,"No"]
[null,null,null,null,null,null,null,null,null,"No"]
[null,null,null,null,null,null,null,null,null,"No"]
[null,null,null,null,null,null,null,null,null,"No"]
[null,null,null,null,null,null,null,null,null,"No"]
[null,null,null,null,null,null,null,null,null,"No"]
[null,null,null,null,null,null,null,null,null,"No"]
[null,null,null,null,null,null,null,null,null,"No"]
[null,null,null,null,null,null,null,null,null,"No"]
[null,null,null,null,null,null,null,null,null,"No"]
[null,null,null,null,null,null,null,null,null,"No"]
[null,null,null,null,null,null,null,null,null,"No"]
[null,null,null,null,null,null,null,null,null,"No"]
[null,null,null,null,null,null,null,null,null,"No"]
[null,null,null,null,null,null,null,null,null,"No"]
[null,null,null,null,null,null,null,null,null,"No"]
[null,null,null,null,null,null,null,null,null,"No"]
[null,null,null,null,null,null,null,null,null,"No"]
[null,null,null,null,null,null,null,null,null,"No"]
[null,null,null,null,null,null,null,null,null,"No"]
[null,null,null,null,null,null,null,null,null,"No"]
[null,null,null,null,null,null,null,null,null,"No"]
[null,null,null,null,null,null,null,null,null,"No"]
[null,null,null,null,null,null,null,null,null,"No"]
[null,null,null,null,null,null,null,null,null,"No"]
[null,null,null,null,null,null,null,null,null,"No"]
[null,null,null,null,null,null,null,null,null,"No"]
[null,null,null,null,null,null,null,null,null,"No"]
[null,null,null,null,null,null,null,null,null,"No"]
[null,null,null,null,null,null,null,null,null,"No"]
[null,null,null,null,null,null,null,null,null,"No"]
[null,null,null,null,null,null,null,null,null,"No"]
[null,null,null,null,null,null,null,null,null,"No"]
[null,null,null,null,null,null,null,null,null,"No"]
[null,null,null,null,null,null,null,null,null,"No"]
[null,null,null,null,null,null,null,null,null,"No"]
[null,null,null,null,null,null,null,null,null,"No"]
[null,null,null,null,null,null,null,null,null,"No"]
[null,null,null,null,null,null,null,null,null,"No"]
[null,null,null,null,null,null,null,null,null,"No"]
[null,null,null,null,null,null,null,null,null,"No"]
[null,null,null,null,null,null,null,null,null,"No"]
[null,null,null,null,null,null,null,null,null,"No"]
[null,null,null,null,null,null,null,null,null,"No"]
[null,null,null,null,null,null,null,null,null,"No"]
[null,null,null,null,null,null,null,null,null,"No"]
[null,null,null,null,null,null,null,null,null,"No"]
[null,null,null,null,null,null,null,null,null,"No"]
[null,null,null,null,null,null,null,null,null,"No"]
[null,null,null,null,null,null,null,null,null,"No"]
[null,null,null,null,null,null,null,null,null,"No"]
[null,null,null,null,null,null,null,null,null,"No"]
[null,null,null,null,null,null,null,null,null,"No"]
[null,null,null,null,null,null,null,null,null,"No"]
[null,null,null,null,null,null,null,null,null,"No"]
[null,null,null,null,null,null,null,null,null,"No"]
[null,null,null,null,null,null,null,null,null,"No"]
[null,null,null,null,null,null,null,null,null,"No"]
[null,null,null,null,null,null,null,null,null,"No"]
[null,null,null,null,null,null,null,null,null,"No"]
[null,null,null,null,null,null,null,null,null,"No"]
[null,null,null,null,null,null,null,null,null,"No"]
[null,null,null,null,null,null,null,null,null,"No"]
[null,null,null,null,null,null,null,null,null,"No"]
[null,null,null,null,null,null,null,null,null,"No"]
[null,null,null,null,null,null,null,null,null,"No"]
[null,null,null,null,null,null,null,null,null,"No"]
[null,null,null,null,null,null,null,null,null,"No"]
[null,null,null,null,null,null,null,null,null,"No"]
[null,null,null,null,null,null,null,null,null,"No"]
[null,null,null,null,null,null,null,null,null,"No"]
[null,null,null,null,null,null,null,null,null,"No"]
[null,null,null,null,null,null,null,null,null,"No"]
[null,null,null,null,null,null,null,null,null,"No"]
[null,null,null,null,null,null,null,null,null,"No"]
[null,null,null,null,null,null,null,null,null,"No"]
[null,null,null,null,null,null,null,null,null,"No"]
[null,null,null,null,null,null,null,null,null,"No"]
[null,null,null,null,null,null,null,null,null,"No"]
[null,null,null,null,null,null,null,null,null,"No"]
[null,null,null,null,null,null,null,null,null,"No"]
[null,null,null,null,null,null,null,null,null,"No"]
[null,null,null,null,null,null,null,null,null,"No"]
[null,null,null,null,null,null,null,null,null,"No"]
[null,null,null,null,null,null,null,null,null,"No"]
[null,null,null,null,null,null,null,null,null,"No"]
[null,null,null,null,null,null,null,null,null,"No"]
[null,null,null,null,null,null,null,null,null,"No"]
[null,null,null,null,null,null,null,null,null,"No"]
[null,null,null,null,null,null,null,null,null,"No"]
[null,null,null,null,null,null,null,null,null,"No"]

{"sheet":"Rail Tunnel","index":8,"n_rows":1300,"n_cols":19,"rows_kept":1300,"cut":false,"hidden":false,"merged":[[18,0,18,7],[18,11,18,14],[0,11,0,15],[1,11,1,14],[2,11,2,14],[3,11,3,14],[4,10,4,13],[5,10,5,13]]}
[null,null,null,null,null,null,null,null,null,null,null,"Specified Thresholds",null,null,null,null,null,null,"Yes"]
[null,null,null,null,null,null,null,null,null,null,null,"Potentially Exposed Population",null,null,null,{"$f":"Thresholds!C32","v":302},null,null,"No"]
[null,null,null,null,null,null,null,null,null,null,null,"Property Loss",null,null,null,{"$f":"Thresholds!C33","v":503600863}]
[null,null,null,null,null,null,null,null,null,null,null,"Mission Importance",null,null,null,{"$f":"Thresholds!C34","v":50},null,null,"Steel"]
[null,null,null,null,null,null,null,null,null,null,null,null,null,null,null,null,null,null,"Concrete"]
[]
[]
[]
[]
[]
[]
[]
[]
[]
[]
[]
[]
[]
["TRANSIT/RAIL TUNNELS",null,null,null,null,null,null,null,null,null,null,"CRITICALITY"]
["Asset ID","Quantity","Max Car Occupancy","Replacement Cost Per Asset (Optional)","Length (ft)","% of Ridership Using Tunnel","Comments",null,null,"Manually mark as critical?",null,"Potentially Exposed Population","Property Loss","Mission Importance","Manual Override"]
["River Tunnel I",1,1200,4000000,10000,49,null,null,null,"No",null,"Y"]
["River Tunnel II",1,1200,4000000,10000,49,null,null,null,"No",null,"Y"]
["South Station Tunnel",1,1200,4000000,10000,49,null,null,null,"No",null,"Y"]
["Point Channel Tunnel",1,1200,4000000,10000,49,null,null,null,"No",null,"Y"]
[null,null,null,null,null,null,null,null,null,"No"]
[null,null,null,null,null,null,null,null,null,"No"]
[null,null,null,null,null,null,null,null,null,"No"]
[null,null,null,null,null,null,null,null,null,"No"]
[null,null,null,null,null,null,null,null,null,"No"]
[null,null,null,null,null,null,null,null,null,"No"]
[null,null,null,null,null,null,null,null,null,"No"]
[null,null,null,null,null,null,null,null,null,"No"]
[null,null,null,null,null,null,null,null,null,"No"]
[null,null,null,null,null,null,null,null,null,"No"]
[null,null,null,null,null,null,null,null,null,"No"]
[null,null,null,null,null,null,null,null,null,"No"]
[null,null,null,null,null,null,null,null,null,"No"]
[null,null,null,null,null,null,null,null,null,"No"]
[null,null,null,null,null,null,null,null,null,"No"]
[null,null,null,null,null,null,null,null,null,"No"]
[null,null,null,null,null,null,null,null,null,"No"]
[null,null,null,null,null,null,null,null,null,"No"]
[null,null,null,null,null,null,null,null,null,"No"]
[null,null,null,null,null,null,null,null,null,"No"]
[null,null,null,null,null,null,null,null,null,"No"]
[null,null,null,null,null,null,null,null,null,"No"]
[null,null,null,null,null,null,null,null,null,"No"]
[null,null,null,null,null,null,null,null,null,"No"]
[null,null,null,null,null,null,null,null,null,"No"]
[null,null,null,null,null,null,null,null,null,"No"]
[null,null,null,null,null,null,null,null,null,"No"]
[null,null,null,null,null,null,null,null,null,"No"]
[null,null,null,null,null,null,null,null,null,"No"]
[null,null,null,null,null,null,null,null,null,"No"]
[null,null,null,null,null,null,null,null,null,"No"]
[null,null,null,null,null,null,null,null,null,"No"]
[null,null,null,null,null,null,null,null,null,"No"]
[null,null,null,null,null,null,null,null,null,"No"]
[null,null,null,null,null,null,null,null,null,"No"]
[null,null,null,null,null,null,null,null,null,"No"]
[null,null,null,null,null,null,null,null,null,"No"]
[null,null,null,null,null,null,null,null,null,"No"]
[null,null,null,null,null,null,null,null,null,"No"]
[null,null,null,null,null,null,null,null,null,"No"]
[null,null,null,null,null,null,null,null,null,"No"]
[null,null,null,null,null,null,null,null,null,"No"]
[null,null,null,null,null,null,null,null,null,"No"]
[null,null,null,null,null,null,null,null,null,"No"]
[null,null,null,null,null,null,null,null,null,"No"]
[null,null,null,null,null,null,null,null,null,"No"]
[null,null,null,null,null,null,null,null,null,"No"]
[null,null,null,null,null,null,null,null,null,"No"]
[null,null,null,null,null,null,null,null,null,"No"]
[null,null,null,null,null,null,null,null,null,"No"]
[null,null,null,null,null,null,null,null,null,"No"]
[null,null,null,null,null,null,null,null,null,"No"]
[null,null,null,null,null,null,null,null,null,"No"]
[null,null,null,null,null,null,null,null,null,"No"]
[null,null,null,null,null,null,null,null,null,"No"]
[null,null,null,null,null,null,null,null,null,"No"]
[null,null,null,null,null,null,null,null,null,"No"]
[null,null,null,null,null,null,null,null,null,"No"]
[null,null,null,null,null,null,null,null,null,"No"]
[null,null,null,null,null,null,null,null,null,"No"]
[null,null,null,null,null,null,null,null,null,"No"]
[null,null,null,null,null,null,null,null,null,"No"]
[null,null,null,null,null,null,null,null,null,"No"]
[null,null,null,null,null,null,null,null,null,"No"]
[null,null,null,null,null,null,null,null,null,"No"]
[null,null,null,null,null,null,null,null,null,"No"]
[null,null,null,null,null,null,null,null,null,"No"]
[null,null,null,null,null,null,null,null,null,"No"]
[null,null,null,null,null,null,null,null,null,"No"]
[null,null,null,null,null,null,null,null,null,"No"]
[null,null,null,null,null,null,null,null,null,"No"]
[null,null,null,null,null,null,null,null,null,"No"]
[null,null,null,null,null,null,null,null,null,"No"]
[null,null,null,null,null,null,null,null,null,"No"]
[null,null,null,null,null,null,null,null,null,"No"]
[null,null,null,null,null,null,null,null,null,"No"]
[null,null,null,null,null,null,null,null,null,"No"]
[null,null,null,null,null,null,null,null,null,"No"]
[null,null,null,null,null,null,null,null,null,"No"]
[null,null,null,null,null,null,null,null,null,"No"]
[null,null,null,null,null,null,null,null,null,"No"]
[null,null,null,null,null,null,null,null,null,"No"]
[null,null,null,null,null,null,null,null,null,"No"]
[null,null,null,null,null,null,null,null,null,"No"]
[null,null,null,null,null,null,null,null,null,"No"]
[null,null,null,null,null,null,null,null,null,"No"]
[null,null,null,null,null,null,null,null,null,"No"]
[null,null,null,null,null,null,null,null,null,"No"]
[null,null,null,null,null,null,null,null,null,"No"]
[null,null,null,null,null,null,null,null,null,"No"]
[null,null,null,null,null,null,null,null,null,"No"]
[null,null,null,null,null,null,null,null,null,"No"]
[null,null,null,null,null,null,null,null,null,"No"]
[null,null,null,null,null,null,null,null,null,"No"]
[null,null,null,null,null,null,null,null,null,"No"]
[null,null,null,null,null,null,null,null,null,"No"]
[null,null,null,null,null,null,null,null,null,"No"]
[null,null,null,null,null,null,null,null,null,"No"]
[null,null,null,null,null,null,null,null,null,"No"]
[null,null,null,null,null,null,null,null,null,"No"]
[null,null,null,null,null,null,null,null,null,"No"]
[null,null,null,null,null,null,null,null,null,"No"]
[null,null,null,null,null,null,null,null,null,"No"]
[null,null,null,null,null,null,null,null,null,"No"]
[null,null,null,null,null,null,null,null,null,"No"]
[null,null,null,null,null,null,null,null,null,"No"]
[null,null,null,null,null,null,null,null,null,"No"]
[null,null,null,null,null,null,null,null,null,"No"]
[null,null,null,null,null,null,null,null,null,"No"]
[null,null,null,null,null,null,null,null,null,"No"]
[null,null,null,null,null,null,null,null,null,"No"]
[null,null,null,null,null,null,null,null,null,"No"]
[null,null,null,null,null,null,null,null,null,"No"]
[null,null,null,null,null,null,null,null,null,"No"]
[null,null,null,null,null,null,null,null,null,"No"]
[null,null,null,null,null,null,null,null,null,"No"]
[null,null,null,null,null,null,null,null,null,"No"]
[null,null,null,null,null,null,null,null,null,"No"]
[null,null,null,null,null,null,null,null,null,"No"]
[null,null,null,null,null,null,null,null,null,"No"]
[null,null,null,null,null,null,null,null,null,"No"]
[null,null,null,null,null,null,null,null,null,"No"]
[null,null,null,null,null,null,null,null,null,"No"]
[null,null,null,null,null,null,null,null,null,"No"]
[null,null,null,null,null,null,null,null,null,"No"]
[null,null,null,null,null,null,null,null,null,"No"]
[null,null,null,null,null,null,null,null,null,"No"]
[null,null,null,null,null,null,null,null,null,"No"]
[null,null,null,null,null,null,null,null,null,"No"]
[null,null,null,null,null,null,null,null,null,"No"]
[null,null,null,null,null,null,null,null,null,"No"]
[null,null,null,null,null,null,null,null,null,"No"]
[null,null,null,null,null,null,null,null,null,"No"]
[null,null,null,null,null,null,null,null,null,"No"]
[null,null,null,null,null,null,null,null,null,"No"]
[null,null,null,null,null,null,null,null,null,"No"]
[null,null,null,null,null,null,null,null,null,"No"]
[null,null,null,null,null,null,null,null,null,"No"]
[null,null,null,null,null,null,null,null,null,"No"]
[null,null,null,null,null,null,null,null,null,"No"]
[null,null,null,null,null,null,null,null,null,"No"]
[null,null,null,null,null,null,null,null,null,"No"]
[null,null,null,null,null,null,null,null,null,"No"]
[null,null,null,null,null,null,null,null,null,"No"]
[null,null,null,null,null,null,null,null,null,"No"]
[null,null,null,null,null,null,null,null,null,"No"]
[null,null,null,null,null,null,null,null,null,"No"]
[null,null,null,null,null,null,null,null,null,"No"]
[null,null,null,null,null,null,null,null,null,"No"]
[null,null,null,null,null,null,null,null,null,"No"]
[null,null,null,null,null,null,null,null,null,"No"]
[null,null,null,null,null,null,null,null,null,"No"]
[null,null,null,null,null,null,null,null,null,"No"]
[null,null,null,null,null,null,null,null,null,"No"]
[null,null,null,null,null,null,null,null,null,"No"]
[null,null,null,null,null,null,null,null,null,"No"]
[null,null,null,null,null,null,null,null,null,"No"]
[null,null,null,null,null,null,null,null,null,"No"]
[null,null,null,null,null,null,null,null,null,"No"]
[null,null,null,null,null,null,null,null,null,"No"]
[null,null,null,null,null,null,null,null,null,"No"]
[null,null,null,null,null,null,null,null,null,"No"]
[null,null,null,null,null,null,null,null,null,"No"]
[null,null,null,null,null,null,null,null,null,"No"]
[null,null,null,null,null,null,null,null,null,"No"]
[null,null,null,null,null,null,null,null,null,"No"]
[null,null,null,null,null,null,null,null,null,"No"]
[null,null,null,null,null,null,null,null,null,"No"]
[null,null,null,null,null,null,null,null,null,"No"]
[null,null,null,null,null,null,null,null,null,"No"]
[null,null,null,null,null,null,null,null,null,"No"]
[null,null,null,null,null,null,null,null,null,"No"]
[null,null,null,null,null,null,null,null,null,"No"]
[null,null,null,null,null,null,null,null,null,"No"]
[null,null,null,null,null,null,null,null,null,"No"]
[null,null,null,null,null,null,null,null,null,"No"]
[null,null,null,null,null,null,null,null,null,"No"]
[null,null,null,null,null,null,null,null,null,"No"]
[null,null,null,null,null,null,null,null,null,"No"]
[null,null,null,null,null,null,null,null,null,"No"]
[null,null,null,null,null,null,null,null,null,"No"]
[null,null,null,null,null,null,null,null,null,"No"]
[null,null,null,null,null,null,null,null,null,"No"]
[null,null,null,null,null,null,null,null,null,"No"]
[null,null,null,null,null,null,null,null,null,"No"]
[null,null,null,null,null,null,null,null,null,"No"]
[null,null,null,null,null,null,null,null,null,"No"]
[null,null,null,null,null,null,null,null,null,"No"]
[null,null,null,null,null,null,null,null,null,"No"]
[null,null,null,null,null,null,null,null,null,"No"]
[null,null,null,null,null,null,null,null,null,"No"]
[null,null,null,null,null,null,null,null,null,"No"]
[null,null,null,null,null,null,null,null,null,"No"]
[null,null,null,null,null,null,null,null,null,"No"]
[null,null,null,null,null,null,null,null,null,"No"]
[null,null,null,null,null,null,null,null,null,"No"]
[null,null,null,null,null,null,null,null,null,"No"]
[null,null,null,null,null,null,null,null,null,"No"]
[null,null,null,null,null,null,null,null,null,"No"]
[null,null,null,null,null,null,null,null,null,"No"]
[null,null,null,null,null,null,null,null,null,"No"]
[null,null,null,null,null,null,null,null,null,"No"]
[null,null,null,null,null,null,null,null,null,"No"]
[null,null,null,null,null,null,null,null,null,"No"]
[null,null,null,null,null,null,null,null,null,"No"]
[null,null,null,null,null,null,null,null,null,"No"]
[null,null,null,null,null,null,null,null,null,"No"]
[null,null,null,null,null,null,null,null,null,"No"]
[null,null,null,null,null,null,null,null,null,"No"]
[null,null,null,null,null,null,null,null,null,"No"]
[null,null,null,null,null,null,null,null,null,"No"]
[null,null,null,null,null,null,null,null,null,"No"]
[null,null,null,null,null,null,null,null,null,"No"]
[null,null,null,null,null,null,null,null,null,"No"]
[null,null,null,null,null,null,null,null,null,"No"]
[null,null,null,null,null,null,null,null,null,"No"]
[null,null,null,null,null,null,null,null,null,"No"]
[null,null,null,null,null,null,null,null,null,"No"]
[null,null,null,null,null,null,null,null,null,"No"]
[null,null,null,null,null,null,null,null,null,"No"]
[null,null,null,null,null,null,null,null,null,"No"]
[null,null,null,null,null,null,null,null,null,"No"]
[null,null,null,null,null,null,null,null,null,"No"]
[null,null,null,null,null,null,null,null,null,"No"]
[null,null,null,null,null,null,null,null,null,"No"]
[null,null,null,null,null,null,null,null,null,"No"]
[null,null,null,null,null,null,null,null,null,"No"]
[null,null,null,null,null,null,null,null,null,"No"]
[null,null,null,null,null,null,null,null,null,"No"]
[null,null,null,null,null,null,null,null,null,"No"]
[null,null,null,null,null,null,null,null,null,"No"]
[null,null,null,null,null,null,null,null,null,"No"]
[null,null,null,null,null,null,null,null,null,"No"]
[null,null,null,null,null,null,null,null,null,"No"]
[null,null,null,null,null,null,null,null,null,"No"]
[null,null,null,null,null,null,null,null,null,"No"]
[null,null,null,null,null,null,null,null,null,"No"]
[null,null,null,null,null,null,null,null,null,"No"]
[null,null,null,null,null,null,null,null,null,"No"]
[null,null,null,null,null,null,null,null,null,"No"]
[null,null,null,null,null,null,null,null,null,"No"]
[null,null,null,null,null,null,null,null,null,"No"]
[null,null,null,null,null,null,null,null,null,"No"]
[null,null,null,null,null,null,null,null,null,"No"]
[null,null,null,null,null,null,null,null,null,"No"]
[null,null,null,null,null,null,null,null,null,"No"]
[null,null,null,null,null,null,null,null,null,"No"]
[null,null,null,null,null,null,null,null,null,"No"]
[null,null,null,null,null,null,null,null,null,"No"]
[null,null,null,null,null,null,null,null,null,"No"]
[null,null,null,null,null,null,null,null,null,"No"]
[null,null,null,null,null,null,null,null,null,"No"]
[null,null,null,null,null,null,null,null,null,"No"]
[null,null,null,null,null,null,null,null,null,"No"]
[null,null,null,null,null,null,null,null,null,"No"]
[null,null,null,null,null,null,null,null,null,"No"]
[null,null,null,null,null,null,null,null,null,"No"]
[null,null,null,null,null,null,null,null,null,"No"]
[null,null,null,null,null,null,null,null,null,"No"]
[null,null,null,null,null,null,null,null,null,"No"]
[null,null,null,null,null,null,null,null,null,"No"]
[null,null,null,null,null,null,null,null,null,"No"]
[null,null,null,null,null,null,null,null,null,"No"]
[null,null,null,null,null,null,null,null,null,"No"]
[null,null,null,null,null,null,null,null,null,"No"]
[null,null,null,null,null,null,null,null,null,"No"]
[null,null,null,null,null,null,null,null,null,"No"]
[null,null,null,null,null,null,null,null,null,"No"]
[null,null,null,null,null,null,null,null,null,"No"]
[null,null,null,null,null,null,null,null,null,"No"]
[null,null,null,null,null,null,null,null,null,"No"]
[null,null,null,null,null,null,null,null,null,"No"]
[null,null,null,null,null,null,null,null,null,"No"]
[null,null,null,null,null,null,null,null,null,"No"]
[null,null,null,null,null,null,null,null,null,"No"]
[null,null,null,null,null,null,null,null,null,"No"]
[null,null,null,null,null,null,null,null,null,"No"]
[null,null,null,null,null,null,null,null,null,"No"]
[null,null,null,null,null,null,null,null,null,"No"]
[null,null,null,null,null,null,null,null,null,"No"]
[null,null,null,null,null,null,null,null,null,"No"]
[null,null,null,null,null,null,null,null,null,"No"]
[null,null,null,null,null,null,null,null,null,"No"]
[null,null,null,null,null,null,null,null,null,"No"]
[null,null,null,null,null,null,null,null,null,"No"]
[null,null,null,null,null,null,null,null,null,"No"]
[null,null,null,null,null,null,null,null,null,"No"]
[null,null,null,null,null,null,null,null,null,"No"]
[null,null,null,null,null,null,null,null,null,"No"]
[null,null,null,null,null,null,null,null,null,"No"]
[null,null,null,null,null,null,null,null,null,"No"]
[null,null,null,null,null,null,null,null,null,"No"]
[null,null,null,null,null,null,null,null,null,"No"]
[null,null,null,null,null,null,null,null,null,"No"]
[null,null,null,null,null,null,null,null,null,"No"]
[null,null,null,null,null,null,null,null,null,"No"]
[null,null,null,null,null,null,null,null,null,"No"]
[null,null,null,null,null,null,null,null,null,"No"]
[null,null,null,null,null,null,null,null,null,"No"]
[null,null,null,null,null,null,null,null,null,"No"]
[null,null,null,null,null,null,null,null,null,"No"]
[null,null,null,null,null,null,null,null,null,"No"]
[null,null,null,null,null,null,null,null,null,"No"]
[null,null,null,null,null,null,null,null,null,"No"]
[null,null,null,null,null,null,null,null,null,"No"]
[null,null,null,null,null,null,null,null,null,"No"]
[null,null,null,null,null,null,null,null,null,"No"]
[null,null,null,null,null,null,null,null,null,"No"]
[null,null,null,null,null,null,null,null,null,"No"]
[null,null,null,null,null,null,null,null,null,"No"]
[null,null,null,null,null,null,null,null,null,"No"]
[null,null,null,null,null,null,null,null,null,"No"]
[null,null,null,null,null,null,null,null,null,"No"]
[null,null,null,null,null,null,null,null,null,"No"]
[null,null,null,null,null,null,null,null,null,"No"]
[null,null,null,null,null,null,null,null,null,"No"]
[null,null,null,null,null,null,null,null,null,"No"]
[null,null,null,null,null,null,null,null,null,"No"]
[null,null,null,null,null,null,null,null,null,"No"]
[null,null,null,null,null,null,null,null,null,"No"]
[null,null,null,null,null,null,null,null,null,"No"]
[null,null,null,null,null,null,null,null,null,"No"]
[null,null,null,null,null,null,null,null,null,"No"]
[null,null,null,null,null,null,null,null,null,"No"]
[null,null,null,null,null,null,null,null,null,"No"]
[null,null,null,null,null,null,null,null,null,"No"]
[null,null,null,null,null,null,null,null,null,"No"]
[null,null,null,null,null,null,null,null,null,"No"]
[null,null,null,null,null,null,null,null,null,"No"]
[null,null,null,null,null,null,null,null,null,"No"]
[null,null,null,null,null,null,null,null,null,"No"]
[null,null,null,null,null,null,null,null,null,"No"]
[null,null,null,null,null,null,null,null,null,"No"]
[null,null,null,null,null,null,null,null,null,"No"]
[null,null,null,null,null,null,null,null,null,"No"]
[null,null,null,null,null,null,null,null,null,"No"]
[null,null,null,null,null,null,null,null,null,"No"]
[null,null,null,null,null,null,null,null,null,"No"]
[null,null,null,null,null,null,null,null,null,"No"]
[null,null,null,null,null,null,null,null,null,"No"]
[null,null,null,null,null,null,null,null,null,"No"]
[null,null,null,null,null,null,null,null,null,"No"]
[null,null,null,null,null,null,null,null,null,"No"]
[null,null,null,null,null,null,null,null,null,"No"]
[null,null,null,null,null,null,null,null,null,"No"]
[null,null,null,null,null,null,null,null,null,"No"]
[null,null,null,null,null,null,null,null,null,"No"]
[null,null,null,null,null,null,null,null,null,"No"]
[null,null,null,null,null,null,null,null,null,"No"]
[null,null,null,null,null,null,null,null,null,"No"]
[null,null,null,null,null,null,null,null,null,"No"]
[null,null,null,null,null,null,null,null,null,"No"]
[null,null,null,null,null,null,null,null,null,"No"]
[null,null,null,null,null,null,null,null,null,"No"]
[null,null,null,null,null,null,null,null,null,"No"]
[null,null,null,null,null,null,null,null,null,"No"]
[null,null,null,null,null,null,null,null,null,"No"]
[null,null,null,null,null,null,null,null,null,"No"]
[null,null,null,null,null,null,null,null,null,"No"]
[null,null,null,null,null,null,null,null,null,"No"]
[null,null,null,null,null,null,null,null,null,"No"]
[null,null,null,null,null,null,null,null,null,"No"]
[null,null,null,null,null,null,null,null,null,"No"]
[null,null,null,null,null,null,null,null,null,"No"]
[null,null,null,null,null,null,null,null,null,"No"]
[null,null,null,null,null,null,null,null,null,"No"]
[null,null,null,null,null,null,null,null,null,"No"]
[null,null,null,null,null,null,null,null,null,"No"]
[null,null,null,null,null,null,null,null,null,"No"]
[null,null,null,null,null,null,null,null,null,"No"]
[null,null,null,null,null,null,null,null,null,"No"]
[null,null,null,null,null,null,null,null,null,"No"]
[null,null,null,null,null,null,null,null,null,"No"]
[null,null,null,null,null,null,null,null,null,"No"]
[null,null,null,null,null,null,null,null,null,"No"]
[null,null,null,null,null,null,null,null,null,"No"]
[null,null,null,null,null,null,null,null,null,"No"]
[null,null,null,null,null,null,null,null,null,"No"]
[null,null,null,null,null,null,null,null,null,"No"]
[null,null,null,null,null,null,null,null,null,"No"]
[null,null,null,null,null,null,null,null,null,"No"]
[null,null,null,null,null,null,null,null,null,"No"]
[null,null,null,null,null,null,null,null,null,"No"]
[null,null,null,null,null,null,null,null,null,"No"]
[null,null,null,null,null,null,null,null,null,"No"]
[null,null,null,null,null,null,null,null,null,"No"]
[null,null,null,null,null,null,null,null,null,"No"]
[null,null,null,null,null,null,null,null,null,"No"]
[null,null,null,null,null,null,null,null,null,"No"]
[null,null,null,null,null,null,null,null,null,"No"]
[null,null,null,null,null,null,null,null,null,"No"]
[null,null,null,null,null,null,null,null,null,"No"]
[null,null,null,null,null,null,null,null,null,"No"]
[null,null,null,null,null,null,null,null,null,"No"]
[null,null,null,null,null,null,null,null,null,"No"]
[null,null,null,null,null,null,null,null,null,"No"]
[null,null,null,null,null,null,null,null,null,"No"]
[null,null,null,null,null,null,null,null,null,"No"]
[null,null,null,null,null,null,null,null,null,"No"]
[null,null,null,null,null,null,null,null,null,"No"]
[null,null,null,null,null,null,null,null,null,"No"]
[null,null,null,null,null,null,null,null,null,"No"]
[null,null,null,null,null,null,null,null,null,"No"]
[null,null,null,null,null,null,null,null,null,"No"]
[null,null,null,null,null,null,null,null,null,"No"]
[null,null,null,null,null,null,null,null,null,"No"]
[null,null,null,null,null,null,null,null,null,"No"]
[null,null,null,null,null,null,null,null,null,"No"]
[null,null,null,null,null,null,null,null,null,"No"]
[null,null,null,null,null,null,null,null,null,"No"]
[null,null,null,null,null,null,null,null,null,"No"]
[null,null,null,null,null,null,null,null,null,"No"]
[null,null,null,null,null,null,null,null,null,"No"]
[null,null,null,null,null,null,null,null,null,"No"]
[null,null,null,null,null,null,null,null,null,"No"]
[null,null,null,null,null,null,null,null,null,"No"]
[null,null,null,null,null,null,null,null,null,"No"]
[null,null,null,null,null,null,null,null,null,"No"]
[null,null,null,null,null,null,null,null,null,"No"]
[null,null,null,null,null,null,null,null,null,"No"]
[null,null,null,null,null,null,null,null,null,"No"]
[null,null,null,null,null,null,null,null,null,"No"]
[null,null,null,null,null,null,null,null,null,"No"]
[null,null,null,null,null,null,null,null,null,"No"]
[null,null,null,null,null,null,null,null,null,"No"]
[null,null,null,null,null,null,null,null,null,"No"]
[null,null,null,null,null,null,null,null,null,"No"]
[null,null,null,null,null,null,null,null,null,"No"]
[null,null,null,null,null,null,null,null,null,"No"]
[null,null,null,null,null,null,null,null,null,"No"]
[null,null,null,null,null,null,null,null,null,"No"]
[null,null,null,null,null,null,null,null,null,"No"]
[null,null,null,null,null,null,null,null,null,"No"]
[null,null,null,null,null,null,null,null,null,"No"]
[null,null,null,null,null,null,null,null,null,"No"]
[null,null,null,null,null,null,null,null,null,"No"]
[null,null,null,null,null,null,null,null,null,"No"]
[null,null,null,null,null,null,null,null,null,"No"]
[null,null,null,null,null,null,null,null,null,"No"]
[null,null,null,null,null,null,null,null,null,"No"]
[null,null,null,null,null,null,null,null,null,"No"]
[null,null,null,null,null,null,null,null,null,"No"]
[null,null,null,null,null,null,null,null,null,"No"]
[null,null,null,null,null,null,null,null,null,"No"]
[null,null,null,null,null,null,null,null,null,"No"]
[null,null,null,null,null,null,null,null,null,"No"]
[null,null,null,null,null,null,null,null,null,"No"]
[null,null,null,null,null,null,null,null,null,"No"]
[null,null,null,null,null,null,null,null,null,"No"]
[null,null,null,null,null,null,null,null,null,"No"]
[null,null,null,null,null,null,null,null,null,"No"]
[null,null,null,null,null,null,null,null,null,"No"]
[null,null,null,null,null,null,null,null,null,"No"]
[null,null,null,null,null,null,null,null,null,"No"]
[null,null,null,null,null,null,null,null,null,"No"]
[null,null,null,null,null,null,null,null,null,"No"]
[null,null,null,null,null,null,null,null,null,"No"]
[null,null,null,null,null,null,null,null,null,"No"]
[null,null,null,null,null,null,null,null,null,"No"]
[null,null,null,null,null,null,null,null,null,"No"]
[null,null,null,null,null,null,null,null,null,"No"]
[null,null,null,null,null,null,null,null,null,"No"]
[null,null,null,null,null,null,null,null,null,"No"]
[null,null,null,null,null,null,null,null,null,"No"]
[null,null,null,null,null,null,null,null,null,"No"]
[null,null,null,null,null,null,null,null,null,"No"]
[null,null,null,null,null,null,null,null,null,"No"]
[null,null,null,null,null,null,null,null,null,"No"]
[null,null,null,null,null,null,null,null,null,"No"]
[null,null,null,null,null,null,null,null,null,"No"]
[null,null,null,null,null,null,null,null,null,"No"]
[null,null,null,null,null,null,null,null,null,"No"]
[null,null,null,null,null,null,null,null,null,"No"]
[null,null,null,null,null,null,null,null,null,"No"]
[null,null,null,null,null,null,null,null,null,"No"]
[null,null,null,null,null,null,null,null,null,"No"]
[null,null,null,null,null,null,null,null,null,"No"]
[null,null,null,null,null,null,null,null,null,"No"]
[null,null,null,null,null,null,null,null,null,"No"]
[null,null,null,null,null,null,null,null,null,"No"]
[null,null,null,null,null,null,null,null,null,"No"]
[null,null,null,null,null,null,null,null,null,"No"]
[null,null,null,null,null,null,null,null,null,"No"]
[null,null,null,null,null,null,null,null,null,"No"]
[null,null,null,null,null,null,null,null,null,"No"]
[null,null,null,null,null,null,null,null,null,"No"]
[null,null,null,null,null,null,null,null,null,"No"]
[null,null,null,null,null,null,null,null,null,"No"]
[null,null,null,null,null,null,null,null,null,"No"]
[null,null,null,null,null,null,null,null,null,"No"]
[null,null,null,null,null,null,null,null,null,"No"]
[null,null,null,null,null,null,null,null,null,"No"]
[null,null,null,null,null,null,null,null,null,"No"]
[null,null,null,null,null,null,null,null,null,"No"]
[null,null,null,null,null,null,null,null,null,"No"]
[null,null,null,null,null,null,null,null,null,"No"]
[null,null,null,null,null,null,null,null,null,"No"]
[null,null,null,null,null,null,null,null,null,"No"]
[null,null,null,null,null,null,null,null,null,"No"]
[null,null,null,null,null,null,null,null,null,"No"]
[null,null,null,null,null,null,null,null,null,"No"]
[null,null,null,null,null,null,null,null,null,"No"]
[null,null,null,null,null,null,null,null,null,"No"]
[null,null,null,null,null,null,null,null,null,"No"]
[null,null,null,null,null,null,null,null,null,"No"]
[null,null,null,null,null,null,null,null,null,"No"]
[null,null,null,null,null,null,null,null,null,"No"]
[null,null,null,null,null,null,null,null,null,"No"]
[null,null,null,null,null,null,null,null,null,"No"]
[null,null,null,null,null,null,null,null,null,"No"]
[null,null,null,null,null,null,null,null,null,"No"]
[null,null,null,null,null,null,null,null,null,"No"]
[null,null,null,null,null,null,null,null,null,"No"]
[null,null,null,null,null,null,null,null,null,"No"]
[null,null,null,null,null,null,null,null,null,"No"]
[null,null,null,null,null,null,null,null,null,"No"]
[null,null,null,null,null,null,null,null,null,"No"]
[null,null,null,null,null,null,null,null,null,"No"]
[null,null,null,null,null,null,null,null,null,"No"]
[null,null,null,null,null,null,null,null,null,"No"]
[null,null,null,null,null,null,null,null,null,"No"]
[null,null,null,null,null,null,null,null,null,"No"]
[null,null,null,null,null,null,null,null,null,"No"]
[null,null,null,null,null,null,null,null,null,"No"]
[null,null,null,null,null,null,null,null,null,"No"]
[null,null,null,null,null,null,null,null,null,"No"]
[null,null,null,null,null,null,null,null,null,"No"]
[null,null,null,null,null,null,null,null,null,"No"]
[null,null,null,null,null,null,null,null,null,"No"]
[null,null,null,null,null,null,null,null,null,"No"]
[null,null,null,null,null,null,null,null,null,"No"]
[null,null,null,null,null,null,null,null,null,"No"]
[null,null,null,null,null,null,null,null,null,"No"]
[null,null,null,null,null,null,null,null,null,"No"]
[null,null,null,null,null,null,null,null,null,"No"]
[null,null,null,null,null,null,null,null,null,"No"]
[null,null,null,null,null,null,null,null,null,"No"]
[null,null,null,null,null,null,null,null,null,"No"]
[null,null,null,null,null,null,null,null,null,"No"]
[null,null,null,null,null,null,null,null,null,"No"]
[null,null,null,null,null,null,null,null,null,"No"]
[null,null,null,null,null,null,null,null,null,"No"]
[null,null,null,null,null,null,null,null,null,"No"]
[null,null,null,null,null,null,null,null,null,"No"]
[null,null,null,null,null,null,null,null,null,"No"]
[null,null,null,null,null,null,null,null,null,"No"]
[null,null,null,null,null,null,null,null,null,"No"]
[null,null,null,null,null,null,null,null,null,"No"]
[null,null,null,null,null,null,null,null,null,"No"]
[null,null,null,null,null,null,null,null,null,"No"]
[null,null,null,null,null,null,null,null,null,"No"]
[null,null,null,null,null,null,null,null,null,"No"]
[null,null,null,null,null,null,null,null,null,"No"]
[null,null,null,null,null,null,null,null,null,"No"]
[null,null,null,null,null,null,null,null,null,"No"]
[null,null,null,null,null,null,null,null,null,"No"]
[null,null,null,null,null,null,null,null,null,"No"]
[null,null,null,null,null,null,null,null,null,"No"]
[null,null,null,null,null,null,null,null,null,"No"]
[null,null,null,null,null,null,null,null,null,"No"]
[null,null,null,null,null,null,null,null,null,"No"]
[null,null,null,null,null,null,null,null,null,"No"]
[null,null,null,null,null,null,null,null,null,"No"]
[null,null,null,null,null,null,null,null,null,"No"]
[null,null,null,null,null,null,null,null,null,"No"]
[null,null,null,null,null,null,null,null,null,"No"]
[null,null,null,null,null,null,null,null,null,"No"]
[null,null,null,null,null,null,null,null,null,"No"]
[null,null,null,null,null,null,null,null,null,"No"]
[null,null,null,null,null,null,null,null,null,"No"]
[null,null,null,null,null,null,null,null,null,"No"]
[null,null,null,null,null,null,null,null,null,"No"]
[null,null,null,null,null,null,null,null,null,"No"]
[null,null,null,null,null,null,null,null,null,"No"]
[null,null,null,null,null,null,null,null,null,"No"]
[null,null,null,null,null,null,null,null,null,"No"]
[null,null,null,null,null,null,null,null,null,"No"]
[null,null,null,null,null,null,null,null,null,"No"]
[null,null,null,null,null,null,null,null,null,"No"]
[null,null,null,null,null,null,null,null,null,"No"]
[null,null,null,null,null,null,null,null,null,"No"]
[null,null,null,null,null,null,null,null,null,"No"]
[null,null,null,null,null,null,null,null,null,"No"]
[null,null,null,null,null,null,null,null,null,"No"]
[null,null,null,null,null,null,null,null,null,"No"]
[null,null,null,null,null,null,null,null,null,"No"]
[null,null,null,null,null,null,null,null,null,"No"]
[null,null,null,null,null,null,null,null,null,"No"]
[null,null,null,null,null,null,null,null,null,"No"]
[null,null,null,null,null,null,null,null,null,"No"]
[null,null,null,null,null,null,null,null,null,"No"]
[null,null,null,null,null,null,null,null,null,"No"]
[null,null,null,null,null,null,null,null,null,"No"]
[null,null,null,null,null,null,null,null,null,"No"]
[null,null,null,null,null,null,null,null,null,"No"]
[null,null,null,null,null,null,null,null,null,"No"]
[null,null,null,null,null,null,null,null,null,"No"]
[null,null,null,null,null,null,null,null,null,"No"]
[null,null,null,null,null,null,null,null,null,"No"]
[null,null,null,null,null,null,null,null,null,"No"]
[null,null,null,null,null,null,null,null,null,"No"]
[null,null,null,null,null,null,null,null,null,"No"]
[null,null,null,null,null,null,null,null,null,"No"]
[null,null,null,null,null,null,null,null,null,"No"]
[null,null,null,null,null,null,null,null,null,"No"]
[null,null,null,null,null,null,null,null,null,"No"]
[null,null,null,null,null,null,null,null,null,"No"]
[null,null,null,null,null,null,null,null,null,"No"]
[null,null,null,null,null,null,null,null,null,"No"]
[null,null,null,null,null,null,null,null,null,"No"]
[null,null,null,null,null,null,null,null,null,"No"]
[null,null,null,null,null,null,null,null,null,"No"]
[null,null,null,null,null,null,null,null,null,"No"]
[null,null,null,null,null,null,null,null,null,"No"]
[null,null,null,null,null,null,null,null,null,"No"]
[null,null,null,null,null,null,null,null,null,"No"]
[null,null,null,null,null,null,null,null,null,"No"]
[null,null,null,null,null,null,null,null,null,"No"]
[null,null,null,null,null,null,null,null,null,"No"]
[null,null,null,null,null,null,null,null,null,"No"]
[null,null,null,null,null,null,null,null,null,"No"]
[null,null,null,null,null,null,null,null,null,"No"]
[null,null,null,null,null,null,null,null,null,"No"]
[null,null,null,null,null,null,null,null,null,"No"]
[null,null,null,null,null,null,null,null,null,"No"]
[null,null,null,null,null,null,null,null,null,"No"]
[null,null,null,null,null,null,null,null,null,"No"]
[null,null,null,null,null,null,null,null,null,"No"]
[null,null,null,null,null,null,null,null,null,"No"]
[null,null,null,null,null,null,null,null,null,"No"]
[null,null,null,null,null,null,null,null,null,"No"]
[null,null,null,null,null,null,null,null,null,"No"]
[null,null,null,null,null,null,null,null,null,"No"]
[null,null,null,null,null,null,null,null,null,"No"]
[null,null,null,null,null,null,null,null,null,"No"]
[null,null,null,null,null,null,null,null,null,"No"]
[null,null,null,null,null,null,null,null,null,"No"]
[null,null,null,null,null,null,null,null,null,"No"]
[null,null,null,null,null,null,null,null,null,"No"]
[null,null,null,null,null,null,null,null,null,"No"]
[null,null,null,null,null,null,null,null,null,"No"]
[null,null,null,null,null,null,null,null,null,"No"]
[null,null,null,null,null,null,null,null,null,"No"]
[null,null,null,null,null,null,null,null,null,"No"]
[null,null,null,null,null,null,null,null,null,"No"]
[null,null,null,null,null,null,null,null,null,"No"]
[null,null,null,null,null,null,null,null,null,"No"]
[null,null,null,null,null,null,null,null,null,"No"]
[null,null,null,null,null,null,null,null,null,"No"]
[null,null,null,null,null,null,null,null,null,"No"]
[null,null,null,null,null,null,null,null,null,"No"]
[null,null,null,null,null,null,null,null,null,"No"]
[null,null,null,null,null,null,null,null,null,"No"]
[null,null,null,null,null,null,null,null,null,"No"]
[null,null,null,null,null,null,null,null,null,"No"]
[null,null,null,null,null,null,null,null,null,"No"]
[null,null,null,null,null,null,null,null,null,"No"]
[null,null,null,null,null,null,null,null,null,"No"]
[null,null,null,null,null,null,null,null,null,"No"]
[null,null,null,null,null,null,null,null,null,"No"]
[null,null,null,null,null,null,null,null,null,"No"]
[null,null,null,null,null,null,null,null,null,"No"]
[null,null,null,null,null,null,null,null,null,"No"]
[null,null,null,null,null,null,null,null,null,"No"]
[null,null,null,null,null,null,null,null,null,"No"]
[null,null,null,null,null,null,null,null,null,"No"]
[null,null,null,null,null,null,null,null,null,"No"]
[null,null,null,null,null,null,null,null,null,"No"]
[null,null,null,null,null,null,null,null,null,"No"]
[null,null,null,null,null,null,null,null,null,"No"]
[null,null,null,null,null,null,null,null,null,"No"]
[null,null,null,null,null,null,null,null,null,"No"]
[null,null,null,null,null,null,null,null,null,"No"]
[null,null,null,null,null,null,null,null,null,"No"]
[null,null,null,null,null,null,null,null,null,"No"]
[null,null,null,null,null,null,null,null,null,"No"]
[null,null,null,null,null,null,null,null,null,"No"]
[null,null,null,null,null,null,null,null,null,"No"]
[null,null,null,null,null,null,null,null,null,"No"]
[null,null,null,null,null,null,null,null,null,"No"]
[null,null,null,null,null,null,null,null,null,"No"]
[null,null,null,null,null,null,null,null,null,"No"]
[null,null,null,null,null,null,null,null,null,"No"]
[null,null,null,null,null,null,null,null,null,"No"]
[null,null,null,null,null,null,null,null,null,"No"]
[null,null,null,null,null,null,null,null,null,"No"]
[null,null,null,null,null,null,null,null,null,"No"]
[null,null,null,null,null,null,null,null,null,"No"]
[null,null,null,null,null,null,null,null,null,"No"]
[null,null,null,null,null,null,null,null,null,"No"]
[null,null,null,null,null,null,null,null,null,"No"]
[null,null,null,null,null,null,null,null,null,"No"]
[null,null,null,null,null,null,null,null,null,"No"]
[null,null,null,null,null,null,null,null,null,"No"]
[null,null,null,null,null,null,null,null,null,"No"]
[null,null,null,null,null,null,null,null,null,"No"]
[null,null,null,null,null,null,null,null,null,"No"]
[null,null,null,null,null,null,null,null,null,"No"]
[null,null,null,null,null,null,null,null,null,"No"]
[null,null,null,null,null,null,null,null,null,"No"]
[null,null,null,null,null,null,null,null,null,"No"]
[null,null,null,null,null,null,null,null,null,"No"]
[null,null,null,null,null,null,null,null,null,"No"]
[null,null,null,null,null,null,null,null,null,"No"]
[null,null,null,null,null,null,null,null,null,"No"]
[null,null,null,null,null,null,null,null,null,"No"]
[null,null,null,null,null,null,null,null,null,"No"]
[null,null,null,null,null,null,null,null,null,"No"]
[null,null,null,null,null,null,null,null,null,"No"]
[null,null,null,null,null,null,null,null,null,"No"]
[null,null,null,null,null,null,null,null,null,"No"]
[null,null,null,null,null,null,null,null,null,"No"]
[null,null,null,null,null,null,null,null,null,"No"]
[null,null,null,null,null,null,null,null,null,"No"]
[null,null,null,null,null,null,null,null,null,"No"]
[null,null,null,null,null,null,null,null,null,"No"]
[null,null,null,null,null,null,null,null,null,"No"]
[null,null,null,null,null,null,null,null,null,"No"]
[null,null,null,null,null,null,null,null,null,"No"]
[null,null,null,null,null,null,null,null,null,"No"]
[null,null,null,null,null,null,null,null,null,"No"]
[null,null,null,null,null,null,null,null,null,"No"]
[null,null,null,null,null,null,null,null,null,"No"]
[null,null,null,null,null,null,null,null,null,"No"]
[null,null,null,null,null,null,null,null,null,"No"]
[null,null,null,null,null,null,null,null,null,"No"]
[null,null,null,null,null,null,null,null,null,"No"]
[null,null,null,null,null,null,null,null,null,"No"]
[null,null,null,null,null,null,null,null,null,"No"]
[null,null,null,null,null,null,null,null,null,"No"]
[null,null,null,null,null,null,null,null,null,"No"]
[null,null,null,null,null,null,null,null,null,"No"]
[null,null,null,null,null,null,null,null,null,"No"]
[null,null,null,null,null,null,null,null,null,"No"]
[null,null,null,null,null,null,null,null,null,"No"]
[null,null,null,null,null,null,null,null,null,"No"]
[null,null,null,null,null,null,null,null,null,"No"]
[null,null,null,null,null,null,null,null,null,"No"]
[null,null,null,null,null,null,null,null,null,"No"]
[null,null,null,null,null,null,null,null,null,"No"]
[null,null,null,null,null,null,null,null,null,"No"]
[null,null,null,null,null,null,null,null,null,"No"]
[null,null,null,null,null,null,null,null,null,"No"]
[null,null,null,null,null,null,null,null,null,"No"]
[null,null,null,null,null,null,null,null,null,"No"]
[null,null,null,null,null,null,null,null,null,"No"]
[null,null,null,null,null,null,null,null,null,"No"]
[null,null,null,null,null,null,null,null,null,"No"]
[null,null,null,null,null,null,null,null,null,"No"]
[null,null,null,null,null,null,null,null,null,"No"]
[null,null,null,null,null,null,null,null,null,"No"]
[null,null,null,null,null,null,null,null,null,"No"]
[null,null,null,null,null,null,null,null,null,"No"]
[null,null,null,null,null,null,null,null,null,"No"]
[null,null,null,null,null,null,null,null,null,"No"]
[null,null,null,null,null,null,null,null,null,"No"]
[null,null,null,null,null,null,null,null,null,"No"]
[null,null,null,null,null,null,null,null,null,"No"]
[null,null,null,null,null,null,null,null,null,"No"]
[null,null,null,null,null,null,null,null,null,"No"]
[null,null,null,null,null,null,null,null,null,"No"]
[null,null,null,null,null,null,null,null,null,"No"]
[null,null,null,null,null,null,null,null,null,"No"]
[null,null,null,null,null,null,null,null,null,"No"]
[null,null,null,null,null,null,null,null,null,"No"]
[null,null,null,null,null,null,null,null,null,"No"]
[null,null,null,null,null,null,null,null,null,"No"]
[null,null,null,null,null,null,null,null,null,"No"]
[null,null,null,null,null,null,null,null,null,"No"]
[null,null,null,null,null,null,null,null,null,"No"]
[null,null,null,null,null,null,null,null,null,"No"]
[null,null,null,null,null,null,null,null,null,"No"]
[null,null,null,null,null,null,null,null,null,"No"]
[null,null,null,null,null,null,null,null,null,"No"]
[null,null,null,null,null,null,null,null,null,"No"]
[null,null,null,null,null,null,null,null,null,"No"]
[null,null,null,null,null,null,null,null,null,"No"]
[null,null,null,null,null,null,null,null,null,"No"]
[null,null,null,null,null,null,null,null,null,"No"]
[null,null,null,null,null,null,null,null,null,"No"]
[null,null,null,null,null,null,null,null,null,"No"]
[null,null,null,null,null,null,null,null,null,"No"]
[null,null,null,null,null,null,null,null,null,"No"]
[null,null,null,null,null,null,null,null,null,"No"]
[null,null,null,null,null,null,null,null,null,"No"]
[null,null,null,null,null,null,null,null,null,"No"]
[null,null,null,null,null,null,null,null,null,"No"]
[null,null,null,null,null,null,null,null,null,"No"]
[null,null,null,null,null,null,null,null,null,"No"]
[null,null,null,null,null,null,null,null,null,"No"]
[null,null,null,null,null,null,null,null,null,"No"]
[null,null,null,null,null,null,null,null,null,"No"]
[null,null,null,null,null,null,null,null,null,"No"]
[null,null,null,null,null,null,null,null,null,"No"]
[null,null,null,null,null,null,null,null,null,"No"]
[null,null,null,null,null,null,null,null,null,"No"]
[null,null,null,null,null,null,null,null,null,"No"]
[null,null,null,null,null,null,null,null,null,"No"]
[null,null,null,null,null,null,null,null,null,"No"]
[null,null,null,null,null,null,null,null,null,"No"]
[null,null,null,null,null,null,null,null,null,"No"]
[null,null,null,null,null,null,null,null,null,"No"]
[null,null,null,null,null,null,null,null,null,"No"]
[null,null,null,null,null,null,null,null,null,"No"]
[null,null,null,null,null,null,null,null,null,"No"]
[null,null,null,null,null,null,null,null,null,"No"]
[null,null,null,null,null,null,null,null,null,"No"]
[null,null,null,null,null,null,null,null,null,"No"]
[null,null,null,null,null,null,null,null,null,"No"]
[null,null,null,null,null,null,null,null,null,"No"]
[null,null,null,null,null,null,null,null,null,"No"]
[null,null,null,null,null,null,null,null,null,"No"]
[null,null,null,null,null,null,null,null,null,"No"]
[null,null,null,null,null,null,null,null,null,"No"]
[null,null,null,null,null,null,null,null,null,"No"]
[null,null,null,null,null,null,null,null,null,"No"]
[null,null,null,null,null,null,null,null,null,"No"]
[null,null,null,null,null,null,null,null,null,"No"]
[null,null,null,null,null,null,null,null,null,"No"]
[null,null,null,null,null,null,null,null,null,"No"]
[null,null,null,null,null,null,null,null,null,"No"]
[null,null,null,null,null,null,null,null,null,"No"]
[null,null,null,null,null,null,null,null,null,"No"]
[null,null,null,null,null,null,null,null,null,"No"]
[null,null,null,null,null,null,null,null,null,"No"]
[null,null,null,null,null,null,null,null,null,"No"]
[null,null,null,null,null,null,null,null,null,"No"]
[null,null,null,null,null,null,null,null,null,"No"]
[null,null,null,null,null,null,null,null,null,"No"]
[null,null,null,null,null,null,null,null,null,"No"]
[null,null,null,null,null,null,null,null,null,"No"]
[null,null,null,null,null,null,null,null,null,"No"]
[null,null,null,null,null,null,null,null,null,"No"]
[null,null,null,null,null,null,null,null,null,"No"]
[null,null,null,null,null,null,null,null,null,"No"]
[null,null,null,null,null,null,null,null,null,"No"]
[null,null,null,null,null,null,null,null,null,"No"]
[null,null,null,null,null,null,null,null,null,"No"]
[null,null,null,null,null,null,null,null,null,"No"]
[null,null,null,null,null,null,null,null,null,"No"]
[null,null,null,null,null,null,null,null,null,"No"]
[null,null,null,null,null,null,null,null,null,"No"]
[null,null,null,null,null,null,null,null,null,"No"]
[null,null,null,null,null,null,null,null,null,"No"]
[null,null,null,null,null,null,null,null,null,"No"]
[null,null,null,null,null,null,null,null,null,"No"]
[null,null,null,null,null,null,null,null,null,"No"]
[null,null,null,null,null,null,null,null,null,"No"]
[null,null,null,null,null,null,null,null,null,"No"]
[null,null,null,null,null,null,null,null,null,"No"]
[null,null,null,null,null,null,null,null,null,"No"]
[null,null,null,null,null,null,null,null,null,"No"]
[null,null,null,null,null,null,null,null,null,"No"]
[null,null,null,null,null,null,null,null,null,"No"]
[null,null,null,null,null,null,null,null,null,"No"]
[null,null,null,null,null,null,null,null,null,"No"]
[null,null,null,null,null,null,null,null,null,"No"]
[null,null,null,null,null,null,null,null,null,"No"]
[null,null,null,null,null,null,null,null,null,"No"]
[null,null,null,null,null,null,null,null,null,"No"]
[null,null,null,null,null,null,null,null,null,"No"]
[null,null,null,null,null,null,null,null,null,"No"]
[null,null,null,null,null,null,null,null,null,"No"]
[null,null,null,null,null,null,null,null,null,"No"]
[null,null,null,null,null,null,null,null,null,"No"]
[null,null,null,null,null,null,null,null,null,"No"]
[null,null,null,null,null,null,null,null,null,"No"]
[null,null,null,null,null,null,null,null,null,"No"]
[null,null,null,null,null,null,null,null,null,"No"]
[null,null,null,null,null,null,null,null,null,"No"]
[null,null,null,null,null,null,null,null,null,"No"]
[null,null,null,null,null,null,null,null,null,"No"]
[null,null,null,null,null,null,null,null,null,"No"]
[null,null,null,null,null,null,null,null,null,"No"]
[null,null,null,null,null,null,null,null,null,"No"]
[null,null,null,null,null,null,null,null,null,"No"]
[null,null,null,null,null,null,null,null,null,"No"]
[null,null,null,null,null,null,null,null,null,"No"]
[null,null,null,null,null,null,null,null,null,"No"]
[null,null,null,null,null,null,null,null,null,"No"]
[null,null,null,null,null,null,null,null,null,"No"]
[null,null,null,null,null,null,null,null,null,"No"]
[null,null,null,null,null,null,null,null,null,"No"]
[null,null,null,null,null,null,null,null,null,"No"]
[null,null,null,null,null,null,null,null,null,"No"]
[null,null,null,null,null,null,null,null,null,"No"]
[null,null,null,null,null,null,null,null,null,"No"]
[null,null,null,null,null,null,null,null,null,"No"]
[null,null,null,null,null,null,null,null,null,"No"]
[null,null,null,null,null,null,null,null,null,"No"]
[null,null,null,null,null,null,null,null,null,"No"]
[null,null,null,null,null,null,null,null,null,"No"]
[null,null,null,null,null,null,null,null,null,"No"]
[null,null,null,null,null,null,null,null,null,"No"]
[null,null,null,null,null,null,null,null,null,"No"]
[null,null,null,null,null,null,null,null,null,"No"]
[null,null,null,null,null,null,null,null,null,"No"]
[null,null,null,null,null,null,null,null,null,"No"]
[null,null,null,null,null,null,null,null,null,"No"]
[null,null,null,null,null,null,null,null,null,"No"]
[null,null,null,null,null,null,null,null,null,"No"]
[null,null,null,null,null,null,null,null,null,"No"]
[null,null,null,null,null,null,null,null,null,"No"]
[null,null,null,null,null,null,null,null,null,"No"]
[null,null,null,null,null,null,null,null,null,"No"]
[null,null,null,null,null,null,null,null,null,"No"]
[null,null,null,null,null,null,null,null,null,"No"]
[null,null,null,null,null,null,null,null,null,"No"]
[null,null,null,null,null,null,null,null,null,"No"]
[null,null,null,null,null,null,null,null,null,"No"]
[null,null,null,null,null,null,null,null,null,"No"]
[null,null,null,null,null,null,null,null,null,"No"]
[null,null,null,null,null,null,null,null,null,"No"]
[null,null,null,null,null,null,null,null,null,"No"]
[null,null,null,null,null,null,null,null,null,"No"]
[null,null,null,null,null,null,null,null,null,"No"]
[null,null,null,null,null,null,null,null,null,"No"]
[null,null,null,null,null,null,null,null,null,"No"]
[null,null,null,null,null,null,null,null,null,"No"]
[null,null,null,null,null,null,null,null,null,"No"]
[null,null,null,null,null,null,null,null,null,"No"]
[null,null,null,null,null,null,null,null,null,"No"]
[null,null,null,null,null,null,null,null,null,"No"]
[null,null,null,null,null,null,null,null,null,"No"]
[null,null,null,null,null,null,null,null,null,"No"]
[null,null,null,null,null,null,null,null,null,"No"]
[null,null,null,null,null,null,null,null,null,"No"]
[null,null,null,null,null,null,null,null,null,"No"]
[null,null,null,null,null,null,null,null,null,"No"]
[null,null,null,null,null,null,null,null,null,"No"]
[null,null,null,null,null,null,null,null,null,"No"]
[null,null,null,null,null,null,null,null,null,"No"]
[null,null,null,null,null,null,null,null,null,"No"]
[null,null,null,null,null,null,null,null,null,"No"]
[null,null,null,null,null,null,null,null,null,"No"]
[null,null,null,null,null,null,null,null,null,"No"]
[null,null,null,null,null,null,null,null,null,"No"]
[null,null,null,null,null,null,null,null,null,"No"]
[null,null,null,null,null,null,null,null,null,"No"]
[null,null,null,null,null,null,null,null,null,"No"]
[null,null,null,null,null,null,null,null,null,"No"]
[null,null,null,null,null,null,null,null,null,"No"]
[null,null,null,null,null,null,null,null,null,"No"]
[null,null,null,null,null,null,null,null,null,"No"]
[null,null,null,null,null,null,null,null,null,"No"]
[null,null,null,null,null,null,null,null,null,"No"]
[null,null,null,null,null,null,null,null,null,"No"]
[null,null,null,null,null,null,null,null,null,"No"]
[null,null,null,null,null,null,null,null,null,"No"]
[null,null,null,null,null,null,null,null,null,"No"]
[null,null,null,null,null,null,null,null,null,"No"]
[null,null,null,null,null,null,null,null,null,"No"]
[null,null,null,null,null,null,null,null,null,"No"]
[null,null,null,null,null,null,null,null,null,"No"]
[null,null,null,null,null,null,null,null,null,"No"]
[null,null,null,null,null,null,null,null,null,"No"]
[null,null,null,null,null,null,null,null,null,"No"]
[null,null,null,null,null,null,null,null,null,"No"]
[null,null,null,null,null,null,null,null,null,"No"]
[null,null,null,null,null,null,null,null,null,"No"]
[null,null,null,null,null,null,null,null,null,"No"]
[null,null,null,null,null,null,null,null,null,"No"]
[null,null,null,null,null,null,null,null,null,"No"]
[null,null,null,null,null,null,null,null,null,"No"]
[null,null,null,null,null,null,null,null,null,"No"]
[null,null,null,null,null,null,null,null,null,"No"]
[null,null,null,null,null,null,null,null,null,"No"]
[null,null,null,null,null,null,null,null,null,"No"]
[null,null,null,null,null,null,null,null,null,"No"]
[null,null,null,null,null,null,null,null,null,"No"]
[null,null,null,null,null,null,null,null,null,"No"]
[null,null,null,null,null,null,null,null,null,"No"]
[null,null,null,null,null,null,null,null,null,"No"]
[null,null,null,null,null,null,null,null,null,"No"]
[null,null,null,null,null,null,null,null,null,"No"]
[null,null,null,null,null,null,null,null,null,"No"]
[null,null,null,null,null,null,null,null,null,"No"]
[null,null,null,null,null,null,null,null,null,"No"]
[null,null,null,null,null,null,null,null,null,"No"]
[null,null,null,null,null,null,null,null,null,"No"]
[null,null,null,null,null,null,null,null,null,"No"]
[null,null,null,null,null,null,null,null,null,"No"]
[null,null,null,null,null,null,null,null,null,"No"]
[null,null,null,null,null,null,null,null,null,"No"]
[null,null,null,null,null,null,null,null,null,"No"]
[null,null,null,null,null,null,null,null,null,"No"]
[null,null,null,null,null,null,null,null,null,"No"]
[null,null,null,null,null,null,null,null,null,"No"]
[null,null,null,null,null,null,null,null,null,"No"]
[null,null,null,null,null,null,null,null,null,"No"]
[null,null,null,null,null,null,null,null,null,"No"]
[null,null,null,null,null,null,null,null,null,"No"]
[null,null,null,null,null,null,null,null,null,"No"]
[null,null,null,null,null,null,null,null,null,"No"]
[null,null,null,null,null,null,null,null,null,"No"]
[null,null,null,null,null,null,null,null,null,"No"]
[null,null,null,null,null,null,null,null,null,"No"]
[null,null,null,null,null,null,null,null,null,"No"]
[null,null,null,null,null,null,null,null,null,"No"]
[null,null,null,null,null,null,null,null,null,"No"]
[null,null,null,null,null,null,null,null,null,"No"]
[null,null,null,null,null,null,null,null,null,"No"]
[null,null,null,null,null,null,null,null,null,"No"]
[null,null,null,null,null,null,null,null,null,"No"]
[null,null,null,null,null,null,null,null,null,"No"]
[null,null,null,null,null,null,null,null,null,"No"]
[null,null,null,null,null,null,null,null,null,"No"]
[null,null,null,null,null,null,null,null,null,"No"]
[null,null,null,null,null,null,null,null,null,"No"]
[null,null,null,null,null,null,null,null,null,"No"]
[null,null,null,null,null,null,null,null,null,"No"]
[null,null,null,null,null,null,null,null,null,"No"]
[null,null,null,null,null,null,null,null,null,"No"]
[null,null,null,null,null,null,null,null,null,"No"]
[null,null,null,null,null,null,null,null,null,"No"]
[null,null,null,null,null,null,null,null,null,"No"]
[null,null,null,null,null,null,null,null,null,"No"]
[null,null,null,null,null,null,null,null,null,"No"]
[null,null,null,null,null,null,null,null,null,"No"]
[null,null,null,null,null,null,null,null,null,"No"]
[null,null,null,null,null,null,null,null,null,"No"]
[null,null,null,null,null,null,null,null,null,"No"]
[null,null,null,null,null,null,null,null,null,"No"]
[null,null,null,null,null,null,null,null,null,"No"]
[null,null,null,null,null,null,null,null,null,"No"]
[null,null,null,null,null,null,null,null,null,"No"]
[null,null,null,null,null,null,null,null,null,"No"]
[null,null,null,null,null,null,null,null,null,"No"]
[null,null,null,null,null,null,null,null,null,"No"]
[null,null,null,null,null,null,null,null,null,"No"]
[null,null,null,null,null,null,null,null,null,"No"]
[null,null,null,null,null,null,null,null,null,"No"]
[null,null,null,null,null,null,null,null,null,"No"]
[null,null,null,null,null,null,null,null,null,"No"]
[null,null,null,null,null,null,null,null,null,"No"]
[null,null,null,null,null,null,null,null,null,"No"]
[null,null,null,null,null,null,null,null,null,"No"]
[null,null,null,null,null,null,null,null,null,"No"]
[null,null,null,null,null,null,null,null,null,"No"]
[null,null,null,null,null,null,null,null,null,"No"]
[null,null,null,null,null,null,null,null,null,"No"]
[null,null,null,null,null,null,null,null,null,"No"]
[null,null,null,null,null,null,null,null,null,"No"]
[null,null,null,null,null,null,null,null,null,"No"]
[null,null,null,null,null,null,null,null,null,"No"]
[null,null,null,null,null,null,null,null,null,"No"]
[null,null,null,null,null,null,null,null,null,"No"]
[null,null,null,null,null,null,null,null,null,"No"]
[null,null,null,null,null,null,null,null,null,"No"]
[null,null,null,null,null,null,null,null,null,"No"]
[null,null,null,null,null,null,null,null,null,"No"]
[null,null,null,null,null,null,null,null,null,"No"]
[null,null,null,null,null,null,null,null,null,"No"]
[null,null,null,null,null,null,null,null,null,"No"]
[null,null,null,null,null,null,null,null,null,"No"]
[null,null,null,null,null,null,null,null,null,"No"]
[null,null,null,null,null,null,null,null,null,"No"]
[null,null,null,null,null,null,null,null,null,"No"]
[null,null,null,null,null,null,null,null,null,"No"]
[null,null,null,null,null,null,null,null,null,"No"]
[null,null,null,null,null,null,null,null,null,"No"]
[null,null,null,null,null,null,null,null,null,"No"]
[null,null,null,null,null,null,null,null,null,"No"]
[null,null,null,null,null,null,null,null,null,"No"]
[null,null,null,null,null,null,null,null,null,"No"]
[null,null,null,null,null,null,null,null,null,"No"]
[null,null,null,null,null,null,null,null,null,"No"]
[null,null,null,null,null,null,null,null,null,"No"]
[null,null,null,null,null,null,null,null,null,"No"]
[null,null,null,null,null,null,null,null,null,"No"]
[null,null,null,null,null,null,null,null,null,"No"]
[null,null,null,null,null,null,null,null,null,"No"]
[null,null,null,null,null,null,null,null,null,"No"]
[null,null,null,null,null,null,null,null,null,"No"]
[null,null,null,null,null,null,null,null,null,"No"]
[null,null,null,null,null,null,null,null,null,"No"]
[null,null,null,null,null,null,null,null,null,"No"]
[null,null,null,null,null,null,null,null,null,"No"]
[null,null,null,null,null,null,null,null,null,"No"]
[null,null,null,null,null,null,null,null,null,"No"]
[null,null,null,null,null,null,null,null,null,"No"]
[null,null,null,null,null,null,null,null,null,"No"]
[null,null,null,null,null,null,null,null,null,"No"]
[null,null,null,null,null,null,null,null,null,"No"]
[null,null,null,null,null,null,null,null,null,"No"]
[null,null,null,null,null,null,null,null,null,"No"]
[null,null,null,null,null,null,null,null,null,"No"]
[null,null,null,null,null,null,null,null,null,"No"]
[null,null,null,null,null,null,null,null,null,"No"]
[null,null,null,null,null,null,null,null,null,"No"]
[null,null,null,null,null,null,null,null,null,"No"]
[null,null,null,null,null,null,null,null,null,"No"]
[null,null,null,null,null,null,null,null,null,"No"]
[null,null,null,null,null,null,null,null,null,"No"]
[null,null,null,null,null,null,null,null,null,"No"]
[null,null,null,null,null,null,null,null,null,"No"]
[null,null,null,null,null,null,null,null,null,"No"]
[null,null,null,null,null,null,null,null,null,"No"]
[null,null,null,null,null,null,null,null,null,"No"]
[null,null,null,null,null,null,null,null,null,"No"]
[null,null,null,null,null,null,null,null,null,"No"]
[null,null,null,null,null,null,null,null,null,"No"]
[null,null,null,null,null,null,null,null,null,"No"]
[null,null,null,null,null,null,null,null,null,"No"]
[null,null,null,null,null,null,null,null,null,"No"]
[null,null,null,null,null,null,null,null,null,"No"]
[null,null,null,null,null,null,null,null,null,"No"]
[null,null,null,null,null,null,null,null,null,"No"]
[null,null,null,null,null,null,null,null,null,"No"]
[null,null,null,null,null,null,null,null,null,"No"]
[null,null,null,null,null,null,null,null,null,"No"]
[null,null,null,null,null,null,null,null,null,"No"]
[null,null,null,null,null,null,null,null,null,"No"]
[null,null,null,null,null,null,null,null,null,"No"]
[null,null,null,null,null,null,null,null,null,"No"]
[null,null,null,null,null,null,null,null,null,"No"]
[null,null,null,null,null,null,null,null,null,"No"]
[null,null,null,null,null,null,null,null,null,"No"]
[null,null,null,null,null,null,null,null,null,"No"]
[null,null,null,null,null,null,null,null,null,"No"]
[null,null,null,null,null,null,null,null,null,"No"]
[null,null,null,null,null,null,null,null,null,"No"]
[null,null,null,null,null,null,null,null,null,"No"]
[null,null,null,null,null,null,null,null,null,"No"]
[null,null,null,null,null,null,null,null,null,"No"]
[null,null,null,null,null,null,null,null,null,"No"]
[null,null,null,null,null,null,null,null,null,"No"]
[null,null,null,null,null,null,null,null,null,"No"]
[null,null,null,null,null,null,null,null,null,"No"]
[null,null,null,null,null,null,null,null,null,"No"]
[null,null,null,null,null,null,null,null,null,"No"]
[null,null,null,null,null,null,null,null,null,"No"]
[null,null,null,null,null,null,null,null,null,"No"]
[null,null,null,null,null,null,null,null,null,"No"]
[null,null,null,null,null,null,null,null,null,"No"]
[null,null,null,null,null,null,null,null,null,"No"]
[null,null,null,null,null,null,null,null,null,"No"]
[null,null,null,null,null,null,null,null,null,"No"]
[null,null,null,null,null,null,null,null,null,"No"]
[null,null,null,null,null,null,null,null,null,"No"]
[null,null,null,null,null,null,null,null,null,"No"]
[null,null,null,null,null,null,null,null,null,"No"]
[null,null,null,null,null,null,null,null,null,"No"]
[null,null,null,null,null,null,null,null,null,"No"]
[null,null,null,null,null,null,null,null,null,"No"]
[null,null,null,null,null,null,null,null,null,"No"]
[null,null,null,null,null,null,null,null,null,"No"]
[null,null,null,null,null,null,null,null,null,"No"]
[null,null,null,null,null,null,null,null,null,"No"]
[null,null,null,null,null,null,null,null,null,"No"]
[null,null,null,null,null,null,null,null,null,"No"]
[null,null,null,null,null,null,null,null,null,"No"]
[null,null,null,null,null,null,null,null,null,"No"]
[null,null,null,null,null,null,null,null,null,"No"]
[null,null,null,null,null,null,null,null,null,"No"]
[null,null,null,null,null,null,null,null,null,"No"]
[null,null,null,null,null,null,null,null,null,"No"]
[null,null,null,null,null,null,null,null,null,"No"]
[null,null,null,null,null,null,null,null,null,"No"]
[null,null,null,null,null,null,null,null,null,"No"]
[null,null,null,null,null,null,null,null,null,"No"]
[null,null,null,null,null,null,null,null,null,"No"]
[null,null,null,null,null,null,null,null,null,"No"]
[null,null,null,null,null,null,null,null,null,"No"]
[null,null,null,null,null,null,null,null,null,"No"]
[null,null,null,null,null,null,null,null,null,"No"]
[null,null,null,null,null,null,null,null,null,"No"]
[null,null,null,null,null,null,null,null,null,"No"]
[null,null,null,null,null,null,null,null,null,"No"]
[null,null,null,null,null,null,null,null,null,"No"]
[null,null,null,null,null,null,null,null,null,"No"]
[null,null,null,null,null,null,null,null,null,"No"]
[null,null,null,null,null,null,null,null,null,"No"]
[null,null,null,null,null,null,null,null,null,"No"]
[null,null,null,null,null,null,null,null,null,"No"]
[null,null,null,null,null,null,null,null,null,"No"]
[null,null,null,null,null,null,null,null,null,"No"]
[null,null,null,null,null,null,null,null,null,"No"]
[null,null,null,null,null,null,null,null,null,"No"]
[null,null,null,null,null,null,null,null,null,"No"]
[null,null,null,null,null,null,null,null,null,"No"]
[null,null,null,null,null,null,null,null,null,"No"]
[null,null,null,null,null,null,null,null,null,"No"]
[null,null,null,null,null,null,null,null,null,"No"]
[null,null,null,null,null,null,null,null,null,"No"]
[null,null,null,null,null,null,null,null,null,"No"]
[null,null,null,null,null,null,null,null,null,"No"]
[null,null,null,null,null,null,null,null,null,"No"]
[null,null,null,null,null,null,null,null,null,"No"]
[null,null,null,null,null,null,null,null,null,"No"]
[null,null,null,null,null,null,null,null,null,"No"]
[null,null,null,null,null,null,null,null,null,"No"]
[null,null,null,null,null,null,null,null,null,"No"]
[null,null,null,null,null,null,null,null,null,"No"]
[null,null,null,null,null,null,null,null,null,"No"]
[null,null,null,null,null,null,null,null,null,"No"]
[null,null,null,null,null,null,null,null,null,"No"]
[null,null,null,null,null,null,null,null,null,"No"]
[null,null,null,null,null,null,null,null,null,"No"]
[null,null,null,null,null,null,null,null,null,"No"]
[null,null,null,null,null,null,null,null,null,"No"]
[null,null,null,null,null,null,null,null,null,"No"]
[null,null,null,null,null,null,null,null,null,"No"]
[null,null,null,null,null,null,null,null,null,"No"]
[null,null,null,null,null,null,null,null,null,"No"]
[null,null,null,null,null,null,null,null,null,"No"]
[null,null,null,null,null,null,null,null,null,"No"]
[null,null,null,null,null,null,null,null,null,"No"]
[null,null,null,null,null,null,null,null,null,"No"]
[null,null,null,null,null,null,null,null,null,"No"]
[null,null,null,null,null,null,null,null,null,"No"]
[null,null,null,null,null,null,null,null,null,"No"]
[null,null,null,null,null,null,null,null,null,"No"]
[null,null,null,null,null,null,null,null,null,"No"]
[null,null,null,null,null,null,null,null,null,"No"]
[null,null,null,null,null,null,null,null,null,"No"]
[null,null,null,null,null,null,null,null,null,"No"]
[null,null,null,null,null,null,null,null,null,"No"]
[null,null,null,null,null,null,null,null,null,"No"]
[null,null,null,null,null,null,null,null,null,"No"]
[null,null,null,null,null,null,null,null,null,"No"]
[null,null,null,null,null,null,null,null,null,"No"]
[null,null,null,null,null,null,null,null,null,"No"]
[null,null,null,null,null,null,null,null,null,"No"]
[null,null,null,null,null,null,null,null,null,"No"]
[null,null,null,null,null,null,null,null,null,"No"]
[null,null,null,null,null,null,null,null,null,"No"]
[null,null,null,null,null,null,null,null,null,"No"]
[null,null,null,null,null,null,null,null,null,"No"]
[null,null,null,null,null,null,null,null,null,"No"]
[null,null,null,null,null,null,null,null,null,"No"]
[null,null,null,null,null,null,null,null,null,"No"]
[null,null,null,null,null,null,null,null,null,"No"]
[null,null,null,null,null,null,null,null,null,"No"]
[null,null,null,null,null,null,null,null,null,"No"]
[null,null,null,null,null,null,null,null,null,"No"]
[null,null,null,null,null,null,null,null,null,"No"]
[null,null,null,null,null,null,null,null,null,"No"]
[null,null,null,null,null,null,null,null,null,"No"]
[null,null,null,null,null,null,null,null,null,"No"]
[null,null,null,null,null,null,null,null,null,"No"]
[null,null,null,null,null,null,null,null,null,"No"]
[null,null,null,null,null,null,null,null,null,"No"]
[null,null,null,null,null,null,null,null,null,"No"]
[null,null,null,null,null,null,null,null,null,"No"]
[null,null,null,null,null,null,null,null,null,"No"]
[null,null,null,null,null,null,null,null,null,"No"]
[null,null,null,null,null,null,null,null,null,"No"]
[null,null,null,null,null,null,null,null,null,"No"]
[null,null,null,null,null,null,null,null,null,"No"]
[null,null,null,null,null,null,null,null,null,"No"]
[null,null,null,null,null,null,null,null,null,"No"]
[null,null,null,null,null,null,null,null,null,"No"]
[null,null,null,null,null,null,null,null,null,"No"]
[null,null,null,null,null,null,null,null,null,"No"]
[null,null,null,null,null,null,null,null,null,"No"]
[null,null,null,null,null,null,null,null,null,"No"]
[null,null,null,null,null,null,null,null,null,"No"]
[null,null,null,null,null,null,null,null,null,"No"]
[null,null,null,null,null,null,null,null,null,"No"]
[null,null,null,null,null,null,null,null,null,"No"]
[null,null,null,null,null,null,null,null,null,"No"]
[null,null,null,null,null,null,null,null,null,"No"]
[null,null,null,null,null,null,null,null,null,"No"]
[null,null,null,null,null,null,null,null,null,"No"]
[null,null,null,null,null,null,null,null,null,"No"]
[null,null,null,null,null,null,null,null,null,"No"]
[null,null,null,null,null,null,null,null,null,"No"]
[null,null,null,null,null,null,null,null,null,"No"]
[null,null,null,null,null,null,null,null,null,"No"]
[null,null,null,null,null,null,null,null,null,"No"]
[null,null,null,null,null,null,null,null,null,"No"]
[null,null,null,null,null,null,null,null,null,"No"]
[null,null,null,null,null,null,null,null,null,"No"]
[null,null,null,null,null,null,null,null,null,"No"]
[null,null,null,null,null,null,null,null,null,"No"]

{"sheet":"Facilities","index":9,"n_rows":1398,"n_cols":19,"rows_kept":1398,"cut":false,"hidden":false,"merged":[[18,0,18,7],[18,11,18,14],[0,11,0,15],[1,11,1,14],[2,11,2,14],[3,11,3,14],[4,10,4,13],[5,10,5,13]]}
[null,null,null,null,null,null,null,null,null,null,null,"Specified Thresholds",null,null,null,null,null,null,"Yes"]
[null,null,null,null,null,null,null,null,null,null,null,"Potentially Exposed Population",null,null,null,{"$f":"Thresholds!C36","v":303},null,null,"No"]
[null,null,null,null,null,null,null,null,null,null,null,"Property Loss",null,null,null,{"$f":"Thresholds!C37","v":111111111}]
[null,null,null,null,null,null,null,null,null,null,null,"Mission Importance",null,null,null,{"$f":"Thresholds!C38","v":"No"}]
[]
[]
[]
[]
[]
[]
[]
[]
[]
[]
[]
[]
[]
[]
["ADMIN & SUPPORT FACILITIES",null,null,null,null,null,null,null,null,null,null,"CRITICALITY"]
["Asset ID","Quantity","Sq. Footage","Replacement Cost Per Asset (Optional)","Occupancy (Optional)",null,"Comments",null,null,"Manually mark as critical?",null,"Potentially Exposed Population","Property Loss","Mission Importance","Manual Override"]
["Rail Tunnel Ventilation ",20,30000,1000000,0,null,null,null,"No","Yes",null,null,null,null,"Y"]
["Rail Tunnel Pump Stations",31,4000,1000000,0,null,null,null,"Yes","Yes",null,null,null,null,"Y"]
["South Station -Bus Terminal",1,10000,100000000,10000,null,null,null,"No","No",null,"Y"]
["Bus maintenance Facility",2,5000,50000000,2000,null,null,null,"No","No",null,"Y"]
["Fuel Storage Sites",5,10000,2000000,6,null,null,null,"No","Yes",null,null,null,null,"Y"]
["CNG Refueling Sites",6,10000,2000000,6,null,null,null,"No","Yes",null,null,null,null,"Y"]
["Police HQ",1,8000,40000000,200,null,null,null,"No","Yes",null,null,null,null,"Y"]
["Plaza Building",1,25000,50000000,5000,null,null,null,"No","No",null,"Y"]
["Operations Control Center",1,1000,60000000,250,null,null,null,"No","Yes",null,null,null,null,"Y"]
["Commuter rail CETC",1,1000,25000000,20,null,null,null,"No","No"]
["Parking garage",1,20000,25000000,600,null,null,null,"No","No",null,"Y"]
["Bulk Power Facility",1,12000,25000000,20,null,null,null,"No","No"]
[null,null,null,null,null,null,null,null,null,"No"]
[null,null,null,null,null,null,null,null,null,"No"]
[null,null,null,null,null,null,null,null,null,"No"]
[null,null,null,null,null,null,null,null,null,"No"]
[null,null,null,null,null,null,null,null,null,"No"]
[null,null,null,null,null,null,null,null,null,"No"]
[null,null,null,null,null,null,null,null,null,"No"]
[null,null,null,null,null,null,null,null,null,"No"]
[null,null,null,null,null,null,null,null,null,"No"]
[null,null,null,null,null,null,null,null,null,"No"]
[null,null,null,null,null,null,null,null,null,"No"]
[null,null,null,null,null,null,null,null,null,"No"]
[null,null,null,null,null,null,null,null,null,"No"]
[null,null,null,null,null,null,null,null,null,"No"]
[null,null,null,null,null,null,null,null,null,"No"]
[null,null,null,null,null,null,null,null,null,"No"]
[null,null,null,null,null,null,null,null,null,"No"]
[null,null,null,null,null,null,null,null,null,"No"]
[null,null,null,null,null,null,null,null,null,"No"]
[null,null,null,null,null,null,null,null,null,"No"]
[null,null,null,null,null,null,null,null,null,"No"]
[null,null,null,null,null,null,null,null,null,"No"]
[null,null,null,null,null,null,null,null,null,"No"]
[null,null,null,null,null,null,null,null,null,"No"]
[null,null,null,null,null,null,null,null,null,"No"]
[null,null,null,null,null,null,null,null,null,"No"]
[null,null,null,null,null,null,null,null,null,"No"]
[null,null,null,null,null,null,null,null,null,"No"]
[null,null,null,null,null,null,null,null,null,"No"]
[null,null,null,null,null,null,null,null,null,"No"]
[null,null,null,null,null,null,null,null,null,"No"]
[null,null,null,null,null,null,null,null,null,"No"]
[null,null,null,null,null,null,null,null,null,"No"]
[null,null,null,null,null,null,null,null,null,"No"]
[null,null,null,null,null,null,null,null,null,"No"]
[null,null,null,null,null,null,null,null,null,"No"]
[null,null,null,null,null,null,null,null,null,"No"]
[null,null,null,null,null,null,null,null,null,"No"]
[null,null,null,null,null,null,null,null,null,"No"]
[null,null,null,null,null,null,null,null,null,"No"]
[null,null,null,null,null,null,null,null,null,"No"]
[null,null,null,null,null,null,null,null,null,"No"]
[null,null,null,null,null,null,null,null,null,"No"]
[null,null,null,null,null,null,null,null,null,"No"]
[null,null,null,null,null,null,null,null,null,"No"]
[null,null,null,null,null,null,null,null,null,"No"]
[null,null,null,null,null,null,null,null,null,"No"]
[null,null,null,null,null,null,null,null,null,"No"]
[null,null,null,null,null,null,null,null,null,"No"]
[null,null,null,null,null,null,null,null,null,"No"]
[null,null,null,null,null,null,null,null,null,"No"]
[null,null,null,null,null,null,null,null,null,"No"]
[null,null,null,null,null,null,null,null,null,"No"]
[null,null,null,null,null,null,null,null,null,"No"]
[null,null,null,null,null,null,null,null,null,"No"]
[null,null,null,null,null,null,null,null,null,"No"]
[null,null,null,null,null,null,null,null,null,"No"]
[null,null,null,null,null,null,null,null,null,"No"]
[null,null,null,null,null,null,null,null,null,"No"]
[null,null,null,null,null,null,null,null,null,"No"]
[null,null,null,null,null,null,null,null,null,"No"]
[null,null,null,null,null,null,null,null,null,"No"]
[null,null,null,null,null,null,null,null,null,"No"]
[null,null,null,null,null,null,null,null,null,"No"]
[null,null,null,null,null,null,null,null,null,"No"]
[null,null,null,null,null,null,null,null,null,"No"]
[null,null,null,null,null,null,null,null,null,"No"]
[null,null,null,null,null,null,null,null,null,"No"]
[null,null,null,null,null,null,null,null,null,"No"]
[null,null,null,null,null,null,null,null,null,"No"]
[null,null,null,null,null,null,null,null,null,"No"]
[null,null,null,null,null,null,null,null,null,"No"]
[null,null,null,null,null,null,null,null,null,"No"]
[null,null,null,null,null,null,null,null,null,"No"]
[null,null,null,null,null,null,null,null,null,"No"]
[null,null,null,null,null,null,null,null,null,"No"]
[null,null,null,null,null,null,null,null,null,"No"]
[null,null,null,null,null,null,null,null,null,"No"]
[null,null,null,null,null,null,null,null,null,"No"]
[null,null,null,null,null,null,null,null,null,"No"]
[null,null,null,null,null,null,null,null,null,"No"]
[null,null,null,null,null,null,null,null,null,"No"]
[null,null,null,null,null,null,null,null,null,"No"]
[null,null,null,null,null,null,null,null,null,"No"]
[null,null,null,null,null,null,null,null,null,"No"]
[null,null,null,null,null,null,null,null,null,"No"]
[null,null,null,null,null,null,null,null,null,"No"]
[null,null,null,null,null,null,null,null,null,"No"]
[null,null,null,null,null,null,null,null,null,"No"]
[null,null,null,null,null,null,null,null,null,"No"]
[null,null,null,null,null,null,null,null,null,"No"]
[null,null,null,null,null,null,null,null,null,"No"]
[null,null,null,null,null,null,null,null,null,"No"]
[null,null,null,null,null,null,null,null,null,"No"]
[null,null,null,null,null,null,null,null,null,"No"]
[null,null,null,null,null,null,null,null,null,"No"]
[null,null,null,null,null,null,null,null,null,"No"]
[null,null,null,null,null,null,null,null,null,"No"]
[null,null,null,null,null,null,null,null,null,"No"]
[null,null,null,null,null,null,null,null,null,"No"]
[null,null,null,null,null,null,null,null,null,"No"]
[null,null,null,null,null,null,null,null,null,"No"]
[null,null,null,null,null,null,null,null,null,"No"]
[null,null,null,null,null,null,null,null,null,"No"]
[null,null,null,null,null,null,null,null,null,"No"]
[null,null,null,null,null,null,null,null,null,"No"]
[null,null,null,null,null,null,null,null,null,"No"]
[null,null,null,null,null,null,null,null,null,"No"]
[null,null,null,null,null,null,null,null,null,"No"]
[null,null,null,null,null,null,null,null,null,"No"]
[null,null,null,null,null,null,null,null,null,"No"]
[null,null,null,null,null,null,null,null,null,"No"]
[null,null,null,null,null,null,null,null,null,"No"]
[null,null,null,null,null,null,null,null,null,"No"]
[null,null,null,null,null,null,null,null,null,"No"]
[null,null,null,null,null,null,null,null,null,"No"]
[null,null,null,null,null,null,null,null,null,"No"]
[null,null,null,null,null,null,null,null,null,"No"]
[null,null,null,null,null,null,null,null,null,"No"]
[null,null,null,null,null,null,null,null,null,"No"]
[null,null,null,null,null,null,null,null,null,"No"]
[null,null,null,null,null,null,null,null,null,"No"]
[null,null,null,null,null,null,null,null,null,"No"]
[null,null,null,null,null,null,null,null,null,"No"]
[null,null,null,null,null,null,null,null,null,"No"]
[null,null,null,null,null,null,null,null,null,"No"]
[null,null,null,null,null,null,null,null,null,"No"]
[null,null,null,null,null,null,null,null,null,"No"]
[null,null,null,null,null,null,null,null,null,"No"]
[null,null,null,null,null,null,null,null,null,"No"]
[null,null,null,null,null,null,null,null,null,"No"]
[null,null,null,null,null,null,null,null,null,"No"]
[null,null,null,null,null,null,null,null,null,"No"]
[null,null,null,null,null,null,null,null,null,"No"]
[null,null,null,null,null,null,null,null,null,"No"]
[null,null,null,null,null,null,null,null,null,"No"]
[null,null,null,null,null,null,null,null,null,"No"]
[null,null,null,null,null,null,null,null,null,"No"]
[null,null,null,null,null,null,null,null,null,"No"]
[null,null,null,null,null,null,null,null,null,"No"]
[null,null,null,null,null,null,null,null,null,"No"]
[null,null,null,null,null,null,null,null,null,"No"]
[null,null,null,null,null,null,null,null,null,"No"]
[null,null,null,null,null,null,null,null,null,"No"]
[null,null,null,null,null,null,null,null,null,"No"]
[null,null,null,null,null,null,null,null,null,"No"]
[null,null,null,null,null,null,null,null,null,"No"]
[null,null,null,null,null,null,null,null,null,"No"]
[null,null,null,null,null,null,null,null,null,"No"]
[null,null,null,null,null,null,null,null,null,"No"]
[null,null,null,null,null,null,null,null,null,"No"]
[null,null,null,null,null,null,null,null,null,"No"]
[null,null,null,null,null,null,null,null,null,"No"]
[null,null,null,null,null,null,null,null,null,"No"]
[null,null,null,null,null,null,null,null,null,"No"]
[null,null,null,null,null,null,null,null,null,"No"]
[null,null,null,null,null,null,null,null,null,"No"]
[null,null,null,null,null,null,null,null,null,"No"]
[null,null,null,null,null,null,null,null,null,"No"]
[null,null,null,null,null,null,null,null,null,"No"]
[null,null,null,null,null,null,null,null,null,"No"]
[null,null,null,null,null,null,null,null,null,"No"]
[null,null,null,null,null,null,null,null,null,"No"]
[null,null,null,null,null,null,null,null,null,"No"]
[null,null,null,null,null,null,null,null,null,"No"]
[null,null,null,null,null,null,null,null,null,"No"]
[null,null,null,null,null,null,null,null,null,"No"]
[null,null,null,null,null,null,null,null,null,"No"]
[null,null,null,null,null,null,null,null,null,"No"]
[null,null,null,null,null,null,null,null,null,"No"]
[null,null,null,null,null,null,null,null,null,"No"]
[null,null,null,null,null,null,null,null,null,"No"]
[null,null,null,null,null,null,null,null,null,"No"]
[null,null,null,null,null,null,null,null,null,"No"]
[null,null,null,null,null,null,null,null,null,"No"]
[null,null,null,null,null,null,null,null,null,"No"]
[null,null,null,null,null,null,null,null,null,"No"]
[null,null,null,null,null,null,null,null,null,"No"]
[null,null,null,null,null,null,null,null,null,"No"]
[null,null,null,null,null,null,null,null,null,"No"]
[null,null,null,null,null,null,null,null,null,"No"]
[null,null,null,null,null,null,null,null,null,"No"]
[null,null,null,null,null,null,null,null,null,"No"]
[null,null,null,null,null,null,null,null,null,"No"]
[null,null,null,null,null,null,null,null,null,"No"]
[null,null,null,null,null,null,null,null,null,"No"]
[null,null,null,null,null,null,null,null,null,"No"]
[null,null,null,null,null,null,null,null,null,"No"]
[null,null,null,null,null,null,null,null,null,"No"]
[null,null,null,null,null,null,null,null,null,"No"]
[null,null,null,null,null,null,null,null,null,"No"]
[null,null,null,null,null,null,null,null,null,"No"]
[null,null,null,null,null,null,null,null,null,"No"]
[null,null,null,null,null,null,null,null,null,"No"]
[null,null,null,null,null,null,null,null,null,"No"]
[null,null,null,null,null,null,null,null,null,"No"]
[null,null,null,null,null,null,null,null,null,"No"]
[null,null,null,null,null,null,null,null,null,"No"]
[null,null,null,null,null,null,null,null,null,"No"]
[null,null,null,null,null,null,null,null,null,"No"]
[null,null,null,null,null,null,null,null,null,"No"]
[null,null,null,null,null,null,null,null,null,"No"]
[null,null,null,null,null,null,null,null,null,"No"]
[null,null,null,null,null,null,null,null,null,"No"]
[null,null,null,null,null,null,null,null,null,"No"]
[null,null,null,null,null,null,null,null,null,"No"]
[null,null,null,null,null,null,null,null,null,"No"]
[null,null,null,null,null,null,null,null,null,"No"]
[null,null,null,null,null,null,null,null,null,"No"]
[null,null,null,null,null,null,null,null,null,"No"]
[null,null,null,null,null,null,null,null,null,"No"]
[null,null,null,null,null,null,null,null,null,"No"]
[null,null,null,null,null,null,null,null,null,"No"]
[null,null,null,null,null,null,null,null,null,"No"]
[null,null,null,null,null,null,null,null,null,"No"]
[null,null,null,null,null,null,null,null,null,"No"]
[null,null,null,null,null,null,null,null,null,"No"]
[null,null,null,null,null,null,null,null,null,"No"]
[null,null,null,null,null,null,null,null,null,"No"]
[null,null,null,null,null,null,null,null,null,"No"]
[null,null,null,null,null,null,null,null,null,"No"]
[null,null,null,null,null,null,null,null,null,"No"]
[null,null,null,null,null,null,null,null,null,"No"]
[null,null,null,null,null,null,null,null,null,"No"]
[null,null,null,null,null,null,null,null,null,"No"]
[null,null,null,null,null,null,null,null,null,"No"]
[null,null,null,null,null,null,null,null,null,"No"]
[null,null,null,null,null,null,null,null,null,"No"]
[null,null,null,null,null,null,null,null,null,"No"]
[null,null,null,null,null,null,null,null,null,"No"]
[null,null,null,null,null,null,null,null,null,"No"]
[null,null,null,null,null,null,null,null,null,"No"]
[null,null,null,null,null,null,null,null,null,"No"]
[null,null,null,null,null,null,null,null,null,"No"]
[null,null,null,null,null,null,null,null,null,"No"]
[null,null,null,null,null,null,null,null,null,"No"]
[null,null,null,null,null,null,null,null,null,"No"]
[null,null,null,null,null,null,null,null,null,"No"]
[null,null,null,null,null,null,null,null,null,"No"]
[null,null,null,null,null,null,null,null,null,"No"]
[null,null,null,null,null,null,null,null,null,"No"]
[null,null,null,null,null,null,null,null,null,"No"]
[null,null,null,null,null,null,null,null,null,"No"]
[null,null,null,null,null,null,null,null,null,"No"]
[null,null,null,null,null,null,null,null,null,"No"]
[null,null,null,null,null,null,null,null,null,"No"]
[null,null,null,null,null,null,null,null,null,"No"]
[null,null,null,null,null,null,null,null,null,"No"]
[null,null,null,null,null,null,null,null,null,"No"]
[null,null,null,null,null,null,null,null,null,"No"]
[null,null,null,null,null,null,null,null,null,"No"]
[null,null,null,null,null,null,null,null,null,"No"]
[null,null,null,null,null,null,null,null,null,"No"]
[null,null,null,null,null,null,null,null,null,"No"]
[null,null,null,null,null,null,null,null,null,"No"]
[null,null,null,null,null,null,null,null,null,"No"]
[null,null,null,null,null,null,null,null,null,"No"]
[null,null,null,null,null,null,null,null,null,"No"]
[null,null,null,null,null,null,null,null,null,"No"]
[null,null,null,null,null,null,null,null,null,"No"]
[null,null,null,null,null,null,null,null,null,"No"]
[null,null,null,null,null,null,null,null,null,"No"]
[null,null,null,null,null,null,null,null,null,"No"]
[null,null,null,null,null,null,null,null,null,"No"]
[null,null,null,null,null,null,null,null,null,"No"]
[null,null,null,null,null,null,null,null,null,"No"]
[null,null,null,null,null,null,null,null,null,"No"]
[null,null,null,null,null,null,null,null,null,"No"]
[null,null,null,null,null,null,null,null,null,"No"]
[null,null,null,null,null,null,null,null,null,"No"]
[null,null,null,null,null,null,null,null,null,"No"]
[null,null,null,null,null,null,null,null,null,"No"]
[null,null,null,null,null,null,null,null,null,"No"]
[null,null,null,null,null,null,null,null,null,"No"]
[null,null,null,null,null,null,null,null,null,"No"]
[null,null,null,null,null,null,null,null,null,"No"]
[null,null,null,null,null,null,null,null,null,"No"]
[null,null,null,null,null,null,null,null,null,"No"]
[null,null,null,null,null,null,null,null,null,"No"]
[null,null,null,null,null,null,null,null,null,"No"]
[null,null,null,null,null,null,null,null,null,"No"]
[null,null,null,null,null,null,null,null,null,"No"]
[null,null,null,null,null,null,null,null,null,"No"]
[null,null,null,null,null,null,null,null,null,"No"]
[null,null,null,null,null,null,null,null,null,"No"]
[null,null,null,null,null,null,null,null,null,"No"]
[null,null,null,null,null,null,null,null,null,"No"]
[null,null,null,null,null,null,null,null,null,"No"]
[null,null,null,null,null,null,null,null,null,"No"]
[null,null,null,null,null,null,null,null,null,"No"]
[null,null,null,null,null,null,null,null,null,"No"]
[null,null,null,null,null,null,null,null,null,"No"]
[null,null,null,null,null,null,null,null,null,"No"]
[null,null,null,null,null,null,null,null,null,"No"]
[null,null,null,null,null,null,null,null,null,"No"]
[null,null,null,null,null,null,null,null,null,"No"]
[null,null,null,null,null,null,null,null,null,"No"]
[null,null,null,null,null,null,null,null,null,"No"]
[null,null,null,null,null,null,null,null,null,"No"]
[null,null,null,null,null,null,null,null,null,"No"]
[null,null,null,null,null,null,null,null,null,"No"]
[null,null,null,null,null,null,null,null,null,"No"]
[null,null,null,null,null,null,null,null,null,"No"]
[null,null,null,null,null,null,null,null,null,"No"]
[null,null,null,null,null,null,null,null,null,"No"]
[null,null,null,null,null,null,null,null,null,"No"]
[null,null,null,null,null,null,null,null,null,"No"]
[null,null,null,null,null,null,null,null,null,"No"]
[null,null,null,null,null,null,null,null,null,"No"]
[null,null,null,null,null,null,null,null,null,"No"]
[null,null,null,null,null,null,null,null,null,"No"]
[null,null,null,null,null,null,null,null,null,"No"]
[null,null,null,null,null,null,null,null,null,"No"]
[null,null,null,null,null,null,null,null,null,"No"]
[null,null,null,null,null,null,null,null,null,"No"]
[null,null,null,null,null,null,null,null,null,"No"]
[null,null,null,null,null,null,null,null,null,"No"]
[null,null,null,null,null,null,null,null,null,"No"]
[null,null,null,null,null,null,null,null,null,"No"]
[null,null,null,null,null,null,null,null,null,"No"]
[null,null,null,null,null,null,null,null,null,"No"]
[null,null,null,null,null,null,null,null,null,"No"]
[null,null,null,null,null,null,null,null,null,"No"]
[null,null,null,null,null,null,null,null,null,"No"]
[null,null,null,null,null,null,null,null,null,"No"]
[null,null,null,null,null,null,null,null,null,"No"]
[null,null,null,null,null,null,null,null,null,"No"]
[null,null,null,null,null,null,null,null,null,"No"]
[null,null,null,null,null,null,null,null,null,"No"]
[null,null,null,null,null,null,null,null,null,"No"]
[null,null,null,null,null,null,null,null,null,"No"]
[null,null,null,null,null,null,null,null,null,"No"]
[null,null,null,null,null,null,null,null,null,"No"]
[null,null,null,null,null,null,null,null,null,"No"]
[null,null,null,null,null,null,null,null,null,"No"]
[null,null,null,null,null,null,null,null,null,"No"]
[null,null,null,null,null,null,null,null,null,"No"]
[null,null,null,null,null,null,null,null,null,"No"]
[null,null,null,null,null,null,null,null,null,"No"]
[null,null,null,null,null,null,null,null,null,"No"]
[null,null,null,null,null,null,null,null,null,"No"]
[null,null,null,null,null,null,null,null,null,"No"]
[null,null,null,null,null,null,null,null,null,"No"]
[null,null,null,null,null,null,null,null,null,"No"]
[null,null,null,null,null,null,null,null,null,"No"]
[null,null,null,null,null,null,null,null,null,"No"]
[null,null,null,null,null,null,null,null,null,"No"]
[null,null,null,null,null,null,null,null,null,"No"]
[null,null,null,null,null,null,null,null,null,"No"]
[null,null,null,null,null,null,null,null,null,"No"]
[null,null,null,null,null,null,null,null,null,"No"]
[null,null,null,null,null,null,null,null,null,"No"]
[null,null,null,null,null,null,null,null,null,"No"]
[null,null,null,null,null,null,null,null,null,"No"]
[null,null,null,null,null,null,null,null,null,"No"]
[null,null,null,null,null,null,null,null,null,"No"]
[null,null,null,null,null,null,null,null,null,"No"]
[null,null,null,null,null,null,null,null,null,"No"]
[null,null,null,null,null,null,null,null,null,"No"]
[null,null,null,null,null,null,null,null,null,"No"]
[null,null,null,null,null,null,null,null,null,"No"]
[null,null,null,null,null,null,null,null,null,"No"]
[null,null,null,null,null,null,null,null,null,"No"]
[null,null,null,null,null,null,null,null,null,"No"]
[null,null,null,null,null,null,null,null,null,"No"]
[null,null,null,null,null,null,null,null,null,"No"]
[null,null,null,null,null,null,null,null,null,"No"]
[null,null,null,null,null,null,null,null,null,"No"]
[null,null,null,null,null,null,null,null,null,"No"]
[null,null,null,null,null,null,null,null,null,"No"]
[null,null,null,null,null,null,null,null,null,"No"]
[null,null,null,null,null,null,null,null,null,"No"]
[null,null,null,null,null,null,null,null,null,"No"]
[null,null,null,null,null,null,null,null,null,"No"]
[null,null,null,null,null,null,null,null,null,"No"]
[null,null,null,null,null,null,null,null,null,"No"]
[null,null,null,null,null,null,null,null,null,"No"]
[null,null,null,null,null,null,null,null,null,"No"]
[null,null,null,null,null,null,null,null,null,"No"]
[null,null,null,null,null,null,null,null,null,"No"]
[null,null,null,null,null,null,null,null,null,"No"]
[null,null,null,null,null,null,null,null,null,"No"]
[null,null,null,null,null,null,null,null,null,"No"]
[null,null,null,null,null,null,null,null,null,"No"]
[null,null,null,null,null,null,null,null,null,"No"]
[null,null,null,null,null,null,null,null,null,"No"]
[null,null,null,null,null,null,null,null,null,"No"]
[null,null,null,null,null,null,null,null,null,"No"]
[null,null,null,null,null,null,null,null,null,"No"]
[null,null,null,null,null,null,null,null,null,"No"]
[null,null,null,null,null,null,null,null,null,"No"]
[null,null,null,null,null,null,null,null,null,"No"]
[null,null,null,null,null,null,null,null,null,"No"]
[null,null,null,null,null,null,null,null,null,"No"]
[null,null,null,null,null,null,null,null,null,"No"]
[null,null,null,null,null,null,null,null,null,"No"]
[null,null,null,null,null,null,null,null,null,"No"]
[null,null,null,null,null,null,null,null,null,"No"]
[null,null,null,null,null,null,null,null,null,"No"]
[null,null,null,null,null,null,null,null,null,"No"]
[null,null,null,null,null,null,null,null,null,"No"]
[null,null,null,null,null,null,null,null,null,"No"]
[null,null,null,null,null,null,null,null,null,"No"]
[null,null,null,null,null,null,null,null,null,"No"]
[null,null,null,null,null,null,null,null,null,"No"]
[null,null,null,null,null,null,null,null,null,"No"]
[null,null,null,null,null,null,null,null,null,"No"]
[null,null,null,null,null,null,null,null,null,"No"]
[null,null,null,null,null,null,null,null,null,"No"]
[null,null,null,null,null,null,null,null,null,"No"]
[null,null,null,null,null,null,null,null,null,"No"]
[null,null,null,null,null,null,null,null,null,"No"]
[null,null,null,null,null,null,null,null,null,"No"]
[null,null,null,null,null,null,null,null,null,"No"]
[null,null,null,null,null,null,null,null,null,"No"]
[null,null,null,null,null,null,null,null,null,"No"]
[null,null,null,null,null,null,null,null,null,"No"]
[null,null,null,null,null,null,null,null,null,"No"]
[null,null,null,null,null,null,null,null,null,"No"]
[null,null,null,null,null,null,null,null,null,"No"]
[null,null,null,null,null,null,null,null,null,"No"]
[null,null,null,null,null,null,null,null,null,"No"]
[null,null,null,null,null,null,null,null,null,"No"]
[null,null,null,null,null,null,null,null,null,"No"]
[null,null,null,null,null,null,null,null,null,"No"]
[null,null,null,null,null,null,null,null,null,"No"]
[null,null,null,null,null,null,null,null,null,"No"]
[null,null,null,null,null,null,null,null,null,"No"]
[null,null,null,null,null,null,null,null,null,"No"]
[null,null,null,null,null,null,null,null,null,"No"]
[null,null,null,null,null,null,null,null,null,"No"]
[null,null,null,null,null,null,null,null,null,"No"]
[null,null,null,null,null,null,null,null,null,"No"]
[null,null,null,null,null,null,null,null,null,"No"]
[null,null,null,null,null,null,null,null,null,"No"]
[null,null,null,null,null,null,null,null,null,"No"]
[null,null,null,null,null,null,null,null,null,"No"]
[null,null,null,null,null,null,null,null,null,"No"]
[null,null,null,null,null,null,null,null,null,"No"]
[null,null,null,null,null,null,null,null,null,"No"]
[null,null,null,null,null,null,null,null,null,"No"]
[null,null,null,null,null,null,null,null,null,"No"]
[null,null,null,null,null,null,null,null,null,"No"]
[null,null,null,null,null,null,null,null,null,"No"]
[null,null,null,null,null,null,null,null,null,"No"]
[null,null,null,null,null,null,null,null,null,"No"]
[null,null,null,null,null,null,null,null,null,"No"]
[null,null,null,null,null,null,null,null,null,"No"]
[null,null,null,null,null,null,null,null,null,"No"]
[null,null,null,null,null,null,null,null,null,"No"]
[null,null,null,null,null,null,null,null,null,"No"]
[null,null,null,null,null,null,null,null,null,"No"]
[null,null,null,null,null,null,null,null,null,"No"]
[null,null,null,null,null,null,null,null,null,"No"]
[null,null,null,null,null,null,null,null,null,"No"]
[null,null,null,null,null,null,null,null,null,"No"]
[null,null,null,null,null,null,null,null,null,"No"]
[null,null,null,null,null,null,null,null,null,"No"]
[null,null,null,null,null,null,null,null,null,"No"]
[null,null,null,null,null,null,null,null,null,"No"]
[null,null,null,null,null,null,null,null,null,"No"]
[null,null,null,null,null,null,null,null,null,"No"]
[null,null,null,null,null,null,null,null,null,"No"]
[null,null,null,null,null,null,null,null,null,"No"]
[null,null,null,null,null,null,null,null,null,"No"]
[null,null,null,null,null,null,null,null,null,"No"]
[null,null,null,null,null,null,null,null,null,"No"]
[null,null,null,null,null,null,null,null,null,"No"]
[null,null,null,null,null,null,null,null,null,"No"]
[null,null,null,null,null,null,null,null,null,"No"]
[null,null,null,null,null,null,null,null,null,"No"]
[null,null,null,null,null,null,null,null,null,"No"]
[null,null,null,null,null,null,null,null,null,"No"]
[null,null,null,null,null,null,null,null,null,"No"]
[null,null,null,null,null,null,null,null,null,"No"]
[null,null,null,null,null,null,null,null,null,"No"]
[null,null,null,null,null,null,null,null,null,"No"]
[null,null,null,null,null,null,null,null,null,"No"]
[null,null,null,null,null,null,null,null,null,"No"]
[null,null,null,null,null,null,null,null,null,"No"]
[null,null,null,null,null,null,null,null,null,"No"]
[null,null,null,null,null,null,null,null,null,"No"]
[null,null,null,null,null,null,null,null,null,"No"]
[null,null,null,null,null,null,null,null,null,"No"]
[null,null,null,null,null,null,null,null,null,"No"]
[null,null,null,null,null,null,null,null,null,"No"]
[null,null,null,null,null,null,null,null,null,"No"]
[null,null,null,null,null,null,null,null,null,"No"]
[null,null,null,null,null,null,null,null,null,"No"]
[null,null,null,null,null,null,null,null,null,"No"]
[null,null,null,null,null,null,null,null,null,"No"]
[null,null,null,null,null,null,null,null,null,"No"]
[null,null,null,null,null,null,null,null,null,"No"]
[null,null,null,null,null,null,null,null,null,"No"]
[null,null,null,null,null,null,null,null,null,"No"]
[null,null,null,null,null,null,null,null,null,"No"]
[null,null,null,null,null,null,null,null,null,"No"]
[null,null,null,null,null,null,null,null,null,"No"]
[null,null,null,null,null,null,null,null,null,"No"]
[null,null,null,null,null,null,null,null,null,"No"]
[null,null,null,null,null,null,null,null,null,"No"]
[null,null,null,null,null,null,null,null,null,"No"]
[null,null,null,null,null,null,null,null,null,"No"]
[null,null,null,null,null,null,null,null,null,"No"]
[null,null,null,null,null,null,null,null,null,"No"]
[null,null,null,null,null,null,null,null,null,"No"]
[null,null,null,null,null,null,null,null,null,"No"]
[null,null,null,null,null,null,null,null,null,"No"]
[null,null,null,null,null,null,null,null,null,"No"]
[null,null,null,null,null,null,null,null,null,"No"]
[null,null,null,null,null,null,null,null,null,"No"]
[null,null,null,null,null,null,null,null,null,"No"]
[null,null,null,null,null,null,null,null,null,"No"]
[null,null,null,null,null,null,null,null,null,"No"]
[null,null,null,null,null,null,null,null,null,"No"]
[null,null,null,null,null,null,null,null,null,"No"]
[null,null,null,null,null,null,null,null,null,"No"]
[null,null,null,null,null,null,null,null,null,"No"]
[null,null,null,null,null,null,null,null,null,"No"]
[null,null,null,null,null,null,null,null,null,"No"]
[null,null,null,null,null,null,null,null,null,"No"]
[null,null,null,null,null,null,null,null,null,"No"]
[null,null,null,null,null,null,null,null,null,"No"]
[null,null,null,null,null,null,null,null,null,"No"]
[null,null,null,null,null,null,null,null,null,"No"]
[null,null,null,null,null,null,null,null,null,"No"]
[null,null,null,null,null,null,null,null,null,"No"]
[null,null,null,null,null,null,null,null,null,"No"]
[null,null,null,null,null,null,null,null,null,"No"]
[null,null,null,null,null,null,null,null,null,"No"]
[null,null,null,null,null,null,null,null,null,"No"]
[null,null,null,null,null,null,null,null,null,"No"]
[null,null,null,null,null,null,null,null,null,"No"]
[null,null,null,null,null,null,null,null,null,"No"]
[null,null,null,null,null,null,null,null,null,"No"]
[null,null,null,null,null,null,null,null,null,"No"]
[null,null,null,null,null,null,null,null,null,"No"]
[null,null,null,null,null,null,null,null,null,"No"]
[null,null,null,null,null,null,null,null,null,"No"]
[null,null,null,null,null,null,null,null,null,"No"]
[null,null,null,null,null,null,null,null,null,"No"]
[null,null,null,null,null,null,null,null,null,"No"]
[null,null,null,null,null,null,null,null,null,"No"]
[null,null,null,null,null,null,null,null,null,"No"]
[null,null,null,null,null,null,null,null,null,"No"]
[null,null,null,null,null,null,null,null,null,"No"]
[null,null,null,null,null,null,null,null,null,"No"]
[null,null,null,null,null,null,null,null,null,"No"]
[null,null,null,null,null,null,null,null,null,"No"]
[null,null,null,null,null,null,null,null,null,"No"]
[null,null,null,null,null,null,null,null,null,"No"]
[null,null,null,null,null,null,null,null,null,"No"]
[null,null,null,null,null,null,null,null,null,"No"]
[null,null,null,null,null,null,null,null,null,"No"]
[null,null,null,null,null,null,null,null,null,"No"]
[null,null,null,null,null,null,null,null,null,"No"]
[null,null,null,null,null,null,null,null,null,"No"]
[null,null,null,null,null,null,null,null,null,"No"]
[null,null,null,null,null,null,null,null,null,"No"]
[null,null,null,null,null,null,null,null,null,"No"]
[null,null,null,null,null,null,null,null,null,"No"]
[null,null,null,null,null,null,null,null,null,"No"]
[null,null,null,null,null,null,null,null,null,"No"]
[null,null,null,null,null,null,null,null,null,"No"]
[null,null,null,null,null,null,null,null,null,"No"]
[null,null,null,null,null,null,null,null,null,"No"]
[null,null,null,null,null,null,null,null,null,"No"]
[null,null,null,null,null,null,null,null,null,"No"]
[null,null,null,null,null,null,null,null,null,"No"]
[null,null,null,null,null,null,null,null,null,"No"]
[null,null,null,null,null,null,null,null,null,"No"]
[null,null,null,null,null,null,null,null,null,"No"]
[null,null,null,null,null,null,null,null,null,"No"]
[null,null,null,null,null,null,null,null,null,"No"]
[null,null,null,null,null,null,null,null,null,"No"]
[null,null,null,null,null,null,null,null,null,"No"]
[null,null,null,null,null,null,null,null,null,"No"]
[null,null,null,null,null,null,null,null,null,"No"]
[null,null,null,null,null,null,null,null,null,"No"]
[null,null,null,null,null,null,null,null,null,"No"]
[null,null,null,null,null,null,null,null,null,"No"]
[null,null,null,null,null,null,null,null,null,"No"]
[null,null,null,null,null,null,null,null,null,"No"]
[null,null,null,null,null,null,null,null,null,"No"]
[null,null,null,null,null,null,null,null,null,"No"]
[null,null,null,null,null,null,null,null,null,"No"]
[null,null,null,null,null,null,null,null,null,"No"]
[null,null,null,null,null,null,null,null,null,"No"]
[null,null,null,null,null,null,null,null,null,"No"]
[null,null,null,null,null,null,null,null,null,"No"]
[null,null,null,null,null,null,null,null,null,"No"]
[null,null,null,null,null,null,null,null,null,"No"]
[null,null,null,null,null,null,null,null,null,"No"]
[null,null,null,null,null,null,null,null,null,"No"]
[null,null,null,null,null,null,null,null,null,"No"]
[null,null,null,null,null,null,null,null,null,"No"]
[null,null,null,null,null,null,null,null,null,"No"]
[null,null,null,null,null,null,null,null,null,"No"]
[null,null,null,null,null,null,null,null,null,"No"]
[null,null,null,null,null,null,null,null,null,"No"]
[null,null,null,null,null,null,null,null,null,"No"]
[null,null,null,null,null,null,null,null,null,"No"]
[null,null,null,null,null,null,null,null,null,"No"]
[null,null,null,null,null,null,null,null,null,"No"]
[null,null,null,null,null,null,null,null,null,"No"]
[null,null,null,null,null,null,null,null,null,"No"]
[null,null,null,null,null,null,null,null,null,"No"]
[null,null,null,null,null,null,null,null,null,"No"]
[null,null,null,null,null,null,null,null,null,"No"]
[null,null,null,null,null,null,null,null,null,"No"]
[null,null,null,null,null,null,null,null,null,"No"]
[null,null,null,null,null,null,null,null,null,"No"]
[null,null,null,null,null,null,null,null,null,"No"]
[null,null,null,null,null,null,null,null,null,"No"]
[null,null,null,null,null,null,null,null,null,"No"]
[null,null,null,null,null,null,null,null,null,"No"]
[null,null,null,null,null,null,null,null,null,"No"]
[null,null,null,null,null,null,null,null,null,"No"]
[null,null,null,null,null,null,null,null,null,"No"]
[null,null,null,null,null,null,null,null,null,"No"]
[null,null,null,null,null,null,null,null,null,"No"]
[null,null,null,null,null,null,null,null,null,"No"]
[null,null,null,null,null,null,null,null,null,"No"]
[null,null,null,null,null,null,null,null,null,"No"]
[null,null,null,null,null,null,null,null,null,"No"]
[null,null,null,null,null,null,null,null,null,"No"]
[null,null,null,null,null,null,null,null,null,"No"]
[null,null,null,null,null,null,null,null,null,"No"]
[null,null,null,null,null,null,null,null,null,"No"]
[null,null,null,null,null,null,null,null,null,"No"]
[null,null,null,null,null,null,null,null,null,"No"]
[null,null,null,null,null,null,null,null,null,"No"]
[null,null,null,null,null,null,null,null,null,"No"]
[null,null,null,null,null,null,null,null,null,"No"]
[null,null,null,null,null,null,null,null,null,"No"]
[null,null,null,null,null,null,null,null,null,"No"]
[null,null,null,null,null,null,null,null,null,"No"]
[null,null,null,null,null,null,null,null,null,"No"]
[null,null,null,null,null,null,null,null,null,"No"]
[null,null,null,null,null,null,null,null,null,"No"]
[null,null,null,null,null,null,null,null,null,"No"]
[null,null,null,null,null,null,null,null,null,"No"]
[null,null,null,null,null,null,null,null,null,"No"]
[null,null,null,null,null,null,null,null,null,"No"]
[null,null,null,null,null,null,null,null,null,"No"]
[null,null,null,null,null,null,null,null,null,"No"]
[null,null,null,null,null,null,null,null,null,"No"]
[null,null,null,null,null,null,null,null,null,"No"]
[null,null,null,null,null,null,null,null,null,"No"]
[null,null,null,null,null,null,null,null,null,"No"]
[null,null,null,null,null,null,null,null,null,"No"]
[null,null,null,null,null,null,null,null,null,"No"]
[null,null,null,null,null,null,null,null,null,"No"]
[null,null,null,null,null,null,null,null,null,"No"]
[null,null,null,null,null,null,null,null,null,"No"]
[null,null,null,null,null,null,null,null,null,"No"]
[null,null,null,null,null,null,null,null,null,"No"]
[null,null,null,null,null,null,null,null,null,"No"]
[null,null,null,null,null,null,null,null,null,"No"]
[null,null,null,null,null,null,null,null,null,"No"]
[null,null,null,null,null,null,null,null,null,"No"]
[null,null,null,null,null,null,null,null,null,"No"]
[null,null,null,null,null,null,null,null,null,"No"]
[null,null,null,null,null,null,null,null,null,"No"]
[null,null,null,null,null,null,null,null,null,"No"]
[null,null,null,null,null,null,null,null,null,"No"]
[null,null,null,null,null,null,null,null,null,"No"]
[null,null,null,null,null,null,null,null,null,"No"]
[null,null,null,null,null,null,null,null,null,"No"]
[null,null,null,null,null,null,null,null,null,"No"]
[null,null,null,null,null,null,null,null,null,"No"]
[null,null,null,null,null,null,null,null,null,"No"]
[null,null,null,null,null,null,null,null,null,"No"]
[null,null,null,null,null,null,null,null,null,"No"]
[null,null,null,null,null,null,null,null,null,"No"]
[null,null,null,null,null,null,null,null,null,"No"]
[null,null,null,null,null,null,null,null,null,"No"]
[null,null,null,null,null,null,null,null,null,"No"]
[null,null,null,null,null,null,null,null,null,"No"]
[null,null,null,null,null,null,null,null,null,"No"]
[null,null,null,null,null,null,null,null,null,"No"]
[null,null,null,null,null,null,null,null,null,"No"]
[null,null,null,null,null,null,null,null,null,"No"]
[null,null,null,null,null,null,null,null,null,"No"]
[null,null,null,null,null,null,null,null,null,"No"]
[null,null,null,null,null,null,null,null,null,"No"]
[null,null,null,null,null,null,null,null,null,"No"]
[null,null,null,null,null,null,null,null,null,"No"]
[null,null,null,null,null,null,null,null,null,"No"]
[null,null,null,null,null,null,null,null,null,"No"]
[null,null,null,null,null,null,null,null,null,"No"]
[null,null,null,null,null,null,null,null,null,"No"]
[null,null,null,null,null,null,null,null,null,"No"]
[null,null,null,null,null,null,null,null,null,"No"]
[null,null,null,null,null,null,null,null,null,"No"]
[null,null,null,null,null,null,null,null,null,"No"]
[null,null,null,null,null,null,null,null,null,"No"]
[null,null,null,null,null,null,null,null,null,"No"]
[null,null,null,null,null,null,null,null,null,"No"]
[null,null,null,null,null,null,null,null,null,"No"]
[null,null,null,null,null,null,null,null,null,"No"]
[null,null,null,null,null,null,null,null,null,"No"]
[null,null,null,null,null,null,null,null,null,"No"]
[null,null,null,null,null,null,null,null,null,"No"]
[null,null,null,null,null,null,null,null,null,"No"]
[null,null,null,null,null,null,null,null,null,"No"]
[null,null,null,null,null,null,null,null,null,"No"]
[null,null,null,null,null,null,null,null,null,"No"]
[null,null,null,null,null,null,null,null,null,"No"]
[null,null,null,null,null,null,null,null,null,"No"]
[null,null,null,null,null,null,null,null,null,"No"]
[null,null,null,null,null,null,null,null,null,"No"]
[null,null,null,null,null,null,null,null,null,"No"]
[null,null,null,null,null,null,null,null,null,"No"]
[null,null,null,null,null,null,null,null,null,"No"]
[null,null,null,null,null,null,null,null,null,"No"]
[null,null,null,null,null,null,null,null,null,"No"]
[null,null,null,null,null,null,null,null,null,"No"]
[null,null,null,null,null,null,null,null,null,"No"]
[null,null,null,null,null,null,null,null,null,"No"]
[null,null,null,null,null,null,null,null,null,"No"]
[null,null,null,null,null,null,null,null,null,"No"]
[null,null,null,null,null,null,null,null,null,"No"]
[null,null,null,null,null,null,null,null,null,"No"]
[null,null,null,null,null,null,null,null,null,"No"]
[null,null,null,null,null,null,null,null,null,"No"]
[null,null,null,null,null,null,null,null,null,"No"]
[null,null,null,null,null,null,null,null,null,"No"]
[null,null,null,null,null,null,null,null,null,"No"]
[null,null,null,null,null,null,null,null,null,"No"]
[null,null,null,null,null,null,null,null,null,"No"]
[null,null,null,null,null,null,null,null,null,"No"]
[null,null,null,null,null,null,null,null,null,"No"]
[null,null,null,null,null,null,null,null,null,"No"]
[null,null,null,null,null,null,null,null,null,"No"]
[null,null,null,null,null,null,null,null,null,"No"]
[null,null,null,null,null,null,null,null,null,"No"]
[null,null,null,null,null,null,null,null,null,"No"]
[null,null,null,null,null,null,null,null,null,"No"]
[null,null,null,null,null,null,null,null,null,"No"]
[null,null,null,null,null,null,null,null,null,"No"]
[null,null,null,null,null,null,null,null,null,"No"]
[null,null,null,null,null,null,null,null,null,"No"]
[null,null,null,null,null,null,null,null,null,"No"]
[null,null,null,null,null,null,null,null,null,"No"]
[null,null,null,null,null,null,null,null,null,"No"]
[null,null,null,null,null,null,null,null,null,"No"]
[null,null,null,null,null,null,null,null,null,"No"]
[null,null,null,null,null,null,null,null,null,"No"]
[null,null,null,null,null,null,null,null,null,"No"]
[null,null,null,null,null,null,null,null,null,"No"]
[null,null,null,null,null,null,null,null,null,"No"]
[null,null,null,null,null,null,null,null,null,"No"]
[null,null,null,null,null,null,null,null,null,"No"]
[null,null,null,null,null,null,null,null,null,"No"]
[null,null,null,null,null,null,null,null,null,"No"]
[null,null,null,null,null,null,null,null,null,"No"]
[null,null,null,null,null,null,null,null,null,"No"]
[null,null,null,null,null,null,null,null,null,"No"]
[null,null,null,null,null,null,null,null,null,"No"]
[null,null,null,null,null,null,null,null,null,"No"]
[null,null,null,null,null,null,null,null,null,"No"]
[null,null,null,null,null,null,null,null,null,"No"]
[null,null,null,null,null,null,null,null,null,"No"]
[null,null,null,null,null,null,null,null,null,"No"]
[null,null,null,null,null,null,null,null,null,"No"]
[null,null,null,null,null,null,null,null,null,"No"]
[null,null,null,null,null,null,null,null,null,"No"]
[null,null,null,null,null,null,null,null,null,"No"]
[null,null,null,null,null,null,null,null,null,"No"]
[null,null,null,null,null,null,null,null,null,"No"]
[null,null,null,null,null,null,null,null,null,"No"]
[null,null,null,null,null,null,null,null,null,"No"]
[null,null,null,null,null,null,null,null,null,"No"]
[null,null,null,null,null,null,null,null,null,"No"]
[null,null,null,null,null,null,null,null,null,"No"]
[null,null,null,null,null,null,null,null,null,"No"]
[null,null,null,null,null,null,null,null,null,"No"]
[null,null,null,null,null,null,null,null,null,"No"]
[null,null,null,null,null,null,null,null,null,"No"]
[null,null,null,null,null,null,null,null,null,"No"]
[null,null,null,null,null,null,null,null,null,"No"]
[null,null,null,null,null,null,null,null,null,"No"]
[null,null,null,null,null,null,null,null,null,"No"]
[null,null,null,null,null,null,null,null,null,"No"]
[null,null,null,null,null,null,null,null,null,"No"]
[null,null,null,null,null,null,null,null,null,"No"]
[null,null,null,null,null,null,null,null,null,"No"]
[null,null,null,null,null,null,null,null,null,"No"]
[null,null,null,null,null,null,null,null,null,"No"]
[null,null,null,null,null,null,null,null,null,"No"]
[null,null,null,null,null,null,null,null,null,"No"]
[null,null,null,null,null,null,null,null,null,"No"]
[null,null,null,null,null,null,null,null,null,"No"]
[null,null,null,null,null,null,null,null,null,"No"]
[null,null,null,null,null,null,null,null,null,"No"]
[null,null,null,null,null,null,null,null,null,"No"]
[null,null,null,null,null,null,null,null,null,"No"]
[null,null,null,null,null,null,null,null,null,"No"]
[null,null,null,null,null,null,null,null,null,"No"]
[null,null,null,null,null,null,null,null,null,"No"]
[null,null,null,null,null,null,null,null,null,"No"]
[null,null,null,null,null,null,null,null,null,"No"]
[null,null,null,null,null,null,null,null,null,"No"]
[null,null,null,null,null,null,null,null,null,"No"]
[null,null,null,null,null,null,null,null,null,"No"]
[null,null,null,null,null,null,null,null,null,"No"]
[null,null,null,null,null,null,null,null,null,"No"]
[null,null,null,null,null,null,null,null,null,"No"]
[null,null,null,null,null,null,null,null,null,"No"]
[null,null,null,null,null,null,null,null,null,"No"]
[null,null,null,null,null,null,null,null,null,"No"]
[null,null,null,null,null,null,null,null,null,"No"]
[null,null,null,null,null,null,null,null,null,"No"]
[null,null,null,null,null,null,null,null,null,"No"]
[null,null,null,null,null,null,null,null,null,"No"]
[null,null,null,null,null,null,null,null,null,"No"]
[null,null,null,null,null,null,null,null,null,"No"]
[null,null,null,null,null,null,null,null,null,"No"]
[null,null,null,null,null,null,null,null,null,"No"]
[null,null,null,null,null,null,null,null,null,"No"]
[null,null,null,null,null,null,null,null,null,"No"]
[null,null,null,null,null,null,null,null,null,"No"]
[null,null,null,null,null,null,null,null,null,"No"]
[null,null,null,null,null,null,null,null,null,"No"]
[null,null,null,null,null,null,null,null,null,"No"]
[null,null,null,null,null,null,null,null,null,"No"]
[null,null,null,null,null,null,null,null,null,"No"]
[null,null,null,null,null,null,null,null,null,"No"]
[null,null,null,null,null,null,null,null,null,"No"]
[null,null,null,null,null,null,null,null,null,"No"]
[null,null,null,null,null,null,null,null,null,"No"]
[null,null,null,null,null,null,null,null,null,"No"]
[null,null,null,null,null,null,null,null,null,"No"]
[null,null,null,null,null,null,null,null,null,"No"]
[null,null,null,null,null,null,null,null,null,"No"]
[null,null,null,null,null,null,null,null,null,"No"]
[null,null,null,null,null,null,null,null,null,"No"]
[null,null,null,null,null,null,null,null,null,"No"]
[null,null,null,null,null,null,null,null,null,"No"]
[null,null,null,null,null,null,null,null,null,"No"]
[null,null,null,null,null,null,null,null,null,"No"]
[null,null,null,null,null,null,null,null,null,"No"]
[null,null,null,null,null,null,null,null,null,"No"]
[null,null,null,null,null,null,null,null,null,"No"]
[null,null,null,null,null,null,null,null,null,"No"]
[null,null,null,null,null,null,null,null,null,"No"]
[null,null,null,null,null,null,null,null,null,"No"]
[null,null,null,null,null,null,null,null,null,"No"]
[null,null,null,null,null,null,null,null,null,"No"]
[null,null,null,null,null,null,null,null,null,"No"]
[null,null,null,null,null,null,null,null,null,"No"]
[null,null,null,null,null,null,null,null,null,"No"]
[null,null,null,null,null,null,null,null,null,"No"]
[null,null,null,null,null,null,null,null,null,"No"]
[null,null,null,null,null,null,null,null,null,"No"]
[null,null,null,null,null,null,null,null,null,"No"]
[null,null,null,null,null,null,null,null,null,"No"]
[null,null,null,null,null,null,null,null,null,"No"]
[null,null,null,null,null,null,null,null,null,"No"]
[null,null,null,null,null,null,null,null,null,"No"]
[null,null,null,null,null,null,null,null,null,"No"]
[null,null,null,null,null,null,null,null,null,"No"]
[null,null,null,null,null,null,null,null,null,"No"]
[null,null,null,null,null,null,null,null,null,"No"]
[null,null,null,null,null,null,null,null,null,"No"]
[null,null,null,null,null,null,null,null,null,"No"]
[null,null,null,null,null,null,null,null,null,"No"]
[null,null,null,null,null,null,null,null,null,"No"]
[null,null,null,null,null,null,null,null,null,"No"]
[null,null,null,null,null,null,null,null,null,"No"]
[null,null,null,null,null,null,null,null,null,"No"]
[null,null,null,null,null,null,null,null,null,"No"]
[null,null,null,null,null,null,null,null,null,"No"]
[null,null,null,null,null,null,null,null,null,"No"]
[null,null,null,null,null,null,null,null,null,"No"]
[null,null,null,null,null,null,null,null,null,"No"]
[null,null,null,null,null,null,null,null,null,"No"]
[null,null,null,null,null,null,null,null,null,"No"]
[null,null,null,null,null,null,null,null,null,"No"]
[null,null,null,null,null,null,null,null,null,"No"]
[null,null,null,null,null,null,null,null,null,"No"]
[null,null,null,null,null,null,null,null,null,"No"]
[null,null,null,null,null,null,null,null,null,"No"]
[null,null,null,null,null,null,null,null,null,"No"]
[null,null,null,null,null,null,null,null,null,"No"]
[null,null,null,null,null,null,null,null,null,"No"]
[null,null,null,null,null,null,null,null,null,"No"]
[null,null,null,null,null,null,null,null,null,"No"]
[null,null,null,null,null,null,null,null,null,"No"]
[null,null,null,null,null,null,null,null,null,"No"]
[null,null,null,null,null,null,null,null,null,"No"]
[null,null,null,null,null,null,null,null,null,"No"]
[null,null,null,null,null,null,null,null,null,"No"]
[null,null,null,null,null,null,null,null,null,"No"]
[null,null,null,null,null,null,null,null,null,"No"]
[null,null,null,null,null,null,null,null,null,"No"]
[null,null,null,null,null,null,null,null,null,"No"]
[null,null,null,null,null,null,null,null,null,"No"]
[null,null,null,null,null,null,null,null,null,"No"]
[null,null,null,null,null,null,null,null,null,"No"]
[null,null,null,null,null,null,null,null,null,"No"]
[null,null,null,null,null,null,null,null,null,"No"]
[null,null,null,null,null,null,null,null,null,"No"]
[null,null,null,null,null,null,null,null,null,"No"]
[null,null,null,null,null,null,null,null,null,"No"]
[null,null,null,null,null,null,null,null,null,"No"]
[null,null,null,null,null,null,null,null,null,"No"]
[null,null,null,null,null,null,null,null,null,"No"]
[null,null,null,null,null,null,null,null,null,"No"]
[null,null,null,null,null,null,null,null,null,"No"]
[null,null,null,null,null,null,null,null,null,"No"]
[null,null,null,null,null,null,null,null,null,"No"]
[null,null,null,null,null,null,null,null,null,"No"]
[null,null,null,null,null,null,null,null,null,"No"]
[null,null,null,null,null,null,null,null,null,"No"]
[null,null,null,null,null,null,null,null,null,"No"]
[null,null,null,null,null,null,null,null,null,"No"]
[null,null,null,null,null,null,null,null,null,"No"]
[null,null,null,null,null,null,null,null,null,"No"]
[null,null,null,null,null,null,null,null,null,"No"]
[null,null,null,null,null,null,null,null,null,"No"]
[null,null,null,null,null,null,null,null,null,"No"]
[null,null,null,null,null,null,null,null,null,"No"]
[null,null,null,null,null,null,null,null,null,"No"]
[null,null,null,null,null,null,null,null,null,"No"]
[null,null,null,null,null,null,null,null,null,"No"]
[null,null,null,null,null,null,null,null,null,"No"]
[null,null,null,null,null,null,null,null,null,"No"]
[null,null,null,null,null,null,null,null,null,"No"]
[null,null,null,null,null,null,null,null,null,"No"]
[null,null,null,null,null,null,null,null,null,"No"]
[null,null,null,null,null,null,null,null,null,"No"]
[null,null,null,null,null,null,null,null,null,"No"]
[null,null,null,null,null,null,null,null,null,"No"]
[null,null,null,null,null,null,null,null,null,"No"]
[null,null,null,null,null,null,null,null,null,"No"]
[null,null,null,null,null,null,null,null,null,"No"]
[null,null,null,null,null,null,null,null,null,"No"]
[null,null,null,null,null,null,null,null,null,"No"]
[null,null,null,null,null,null,null,null,null,"No"]
[null,null,null,null,null,null,null,null,null,"No"]
[null,null,null,null,null,null,null,null,null,"No"]
[null,null,null,null,null,null,null,null,null,"No"]
[null,null,null,null,null,null,null,null,null,"No"]
[null,null,null,null,null,null,null,null,null,"No"]
[null,null,null,null,null,null,null,null,null,"No"]
[null,null,null,null,null,null,null,null,null,"No"]
[null,null,null,null,null,null,null,null,null,"No"]
[null,null,null,null,null,null,null,null,null,"No"]
[null,null,null,null,null,null,null,null,null,"No"]
[null,null,null,null,null,null,null,null,null,"No"]
[null,null,null,null,null,null,null,null,null,"No"]
[null,null,null,null,null,null,null,null,null,"No"]
[null,null,null,null,null,null,null,null,null,"No"]
[null,null,null,null,null,null,null,null,null,"No"]
[null,null,null,null,null,null,null,null,null,"No"]
[null,null,null,null,null,null,null,null,null,"No"]
[null,null,null,null,null,null,null,null,null,"No"]
[null,null,null,null,null,null,null,null,null,"No"]
[null,null,null,null,null,null,null,null,null,"No"]
[null,null,null,null,null,null,null,null,null,"No"]
[null,null,null,null,null,null,null,null,null,"No"]
[null,null,null,null,null,null,null,null,null,"No"]
[null,null,null,null,null,null,null,null,null,"No"]
[null,null,null,null,null,null,null,null,null,"No"]
[null,null,null,null,null,null,null,null,null,"No"]
[null,null,null,null,null,null,null,null,null,"No"]
[null,null,null,null,null,null,null,null,null,"No"]
[null,null,null,null,null,null,null,null,null,"No"]
[null,null,null,null,null,null,null,null,null,"No"]
[null,null,null,null,null,null,null,null,null,"No"]
[null,null,null,null,null,null,null,null,null,"No"]
[null,null,null,null,null,null,null,null,null,"No"]
[null,null,null,null,null,null,null,null,null,"No"]
[null,null,null,null,null,null,null,null,null,"No"]
[null,null,null,null,null,null,null,null,null,"No"]
[null,null,null,null,null,null,null,null,null,"No"]
[null,null,null,null,null,null,null,null,null,"No"]
[null,null,null,null,null,null,null,null,null,"No"]
[null,null,null,null,null,null,null,null,null,"No"]
[null,null,null,null,null,null,null,null,null,"No"]
[null,null,null,null,null,null,null,null,null,"No"]
[null,null,null,null,null,null,null,null,null,"No"]
[null,null,null,null,null,null,null,null,null,"No"]
[null,null,null,null,null,null,null,null,null,"No"]
[null,null,null,null,null,null,null,null,null,"No"]
[null,null,null,null,null,null,null,null,null,"No"]
[null,null,null,null,null,null,null,null,null,"No"]
[null,null,null,null,null,null,null,null,null,"No"]
[null,null,null,null,null,null,null,null,null,"No"]
[null,null,null,null,null,null,null,null,null,"No"]
[null,null,null,null,null,null,null,null,null,"No"]
[null,null,null,null,null,null,null,null,null,"No"]
[null,null,null,null,null,null,null,null,null,"No"]
[null,null,null,null,null,null,null,null,null,"No"]
[null,null,null,null,null,null,null,null,null,"No"]
[null,null,null,null,null,null,null,null,null,"No"]
[null,null,null,null,null,null,null,null,null,"No"]
[null,null,null,null,null,null,null,null,null,"No"]
[null,null,null,null,null,null,null,null,null,"No"]
[null,null,null,null,null,null,null,null,null,"No"]
[null,null,null,null,null,null,null,null,null,"No"]
[null,null,null,null,null,null,null,null,null,"No"]
[null,null,null,null,null,null,null,null,null,"No"]
[null,null,null,null,null,null,null,null,null,"No"]
[null,null,null,null,null,null,null,null,null,"No"]
[null,null,null,null,null,null,null,null,null,"No"]
[null,null,null,null,null,null,null,null,null,"No"]
[null,null,null,null,null,null,null,null,null,"No"]
[null,null,null,null,null,null,null,null,null,"No"]
[null,null,null,null,null,null,null,null,null,"No"]
[null,null,null,null,null,null,null,null,null,"No"]
[null,null,null,null,null,null,null,null,null,"No"]
[null,null,null,null,null,null,null,null,null,"No"]
[null,null,null,null,null,null,null,null,null,"No"]
[null,null,null,null,null,null,null,null,null,"No"]
[null,null,null,null,null,null,null,null,null,"No"]
[null,null,null,null,null,null,null,null,null,"No"]
[null,null,null,null,null,null,null,null,null,"No"]
[null,null,null,null,null,null,null,null,null,"No"]
[null,null,null,null,null,null,null,null,null,"No"]
[null,null,null,null,null,null,null,null,null,"No"]
[null,null,null,null,null,null,null,null,null,"No"]
[null,null,null,null,null,null,null,null,null,"No"]
[null,null,null,null,null,null,null,null,null,"No"]
[null,null,null,null,null,null,null,null,null,"No"]
[null,null,null,null,null,null,null,null,null,"No"]
[null,null,null,null,null,null,null,null,null,"No"]
[null,null,null,null,null,null,null,null,null,"No"]
[null,null,null,null,null,null,null,null,null,"No"]
[null,null,null,null,null,null,null,null,null,"No"]
[null,null,null,null,null,null,null,null,null,"No"]
[null,null,null,null,null,null,null,null,null,"No"]
[null,null,null,null,null,null,null,null,null,"No"]
[null,null,null,null,null,null,null,null,null,"No"]
[null,null,null,null,null,null,null,null,null,"No"]
[null,null,null,null,null,null,null,null,null,"No"]
[null,null,null,null,null,null,null,null,null,"No"]
[null,null,null,null,null,null,null,null,null,"No"]
[null,null,null,null,null,null,null,null,null,"No"]
[null,null,null,null,null,null,null,null,null,"No"]
[null,null,null,null,null,null,null,null,null,"No"]
[null,null,null,null,null,null,null,null,null,"No"]
[null,null,null,null,null,null,null,null,null,"No"]
[null,null,null,null,null,null,null,null,null,"No"]
[null,null,null,null,null,null,null,null,null,"No"]
[null,null,null,null,null,null,null,null,null,"No"]
[null,null,null,null,null,null,null,null,null,"No"]
[null,null,null,null,null,null,null,null,null,"No"]
[null,null,null,null,null,null,null,null,null,"No"]
[null,null,null,null,null,null,null,null,null,"No"]
[null,null,null,null,null,null,null,null,null,"No"]
[null,null,null,null,null,null,null,null,null,"No"]
[null,null,null,null,null,null,null,null,null,"No"]
[null,null,null,null,null,null,null,null,null,"No"]
[null,null,null,null,null,null,null,null,null,"No"]
[null,null,null,null,null,null,null,null,null,"No"]
[null,null,null,null,null,null,null,null,null,"No"]
[null,null,null,null,null,null,null,null,null,"No"]
[null,null,null,null,null,null,null,null,null,"No"]
[null,null,null,null,null,null,null,null,null,"No"]
[null,null,null,null,null,null,null,null,null,"No"]
[null,null,null,null,null,null,null,null,null,"No"]
[null,null,null,null,null,null,null,null,null,"No"]
[null,null,null,null,null,null,null,null,null,"No"]
[null,null,null,null,null,null,null,null,null,"No"]
[null,null,null,null,null,null,null,null,null,"No"]
[null,null,null,null,null,null,null,null,null,"No"]
[null,null,null,null,null,null,null,null,null,"No"]
[null,null,null,null,null,null,null,null,null,"No"]
[null,null,null,null,null,null,null,null,null,"No"]
[null,null,null,null,null,null,null,null,null,"No"]
[null,null,null,null,null,null,null,null,null,"No"]
[null,null,null,null,null,null,null,null,null,"No"]
[null,null,null,null,null,null,null,null,null,"No"]
[null,null,null,null,null,null,null,null,null,"No"]
[null,null,null,null,null,null,null,null,null,"No"]
[null,null,null,null,null,null,null,null,null,"No"]
[null,null,null,null,null,null,null,null,null,"No"]
[null,null,null,null,null,null,null,null,null,"No"]
[null,null,null,null,null,null,null,null,null,"No"]
[null,null,null,null,null,null,null,null,null,"No"]
[null,null,null,null,null,null,null,null,null,"No"]
[null,null,null,null,null,null,null,null,null,"No"]
[null,null,null,null,null,null,null,null,null,"No"]
[null,null,null,null,null,null,null,null,null,"No"]
[null,null,null,null,null,null,null,null,null,"No"]
[null,null,null,null,null,null,null,null,null,"No"]
[null,null,null,null,null,null,null,null,null,"No"]
[null,null,null,null,null,null,null,null,null,"No"]
[null,null,null,null,null,null,null,null,null,"No"]
[null,null,null,null,null,null,null,null,null,"No"]
[null,null,null,null,null,null,null,null,null,"No"]
[null,null,null,null,null,null,null,null,null,"No"]
[null,null,null,null,null,null,null,null,null,"No"]
[null,null,null,null,null,null,null,null,null,"No"]
[null,null,null,null,null,null,null,null,null,"No"]
[null,null,null,null,null,null,null,null,null,"No"]
[null,null,null,null,null,null,null,null,null,"No"]
[null,null,null,null,null,null,null,null,null,"No"]
[null,null,null,null,null,null,null,null,null,"No"]
[null,null,null,null,null,null,null,null,null,"No"]
[null,null,null,null,null,null,null,null,null,"No"]
[null,null,null,null,null,null,null,null,null,"No"]
[null,null,null,null,null,null,null,null,null,"No"]
[null,null,null,null,null,null,null,null,null,"No"]
[null,null,null,null,null,null,null,null,null,"No"]
[null,null,null,null,null,null,null,null,null,"No"]
[null,null,null,null,null,null,null,null,null,"No"]
[null,null,null,null,null,null,null,null,null,"No"]
[null,null,null,null,null,null,null,null,null,"No"]
[null,null,null,null,null,null,null,null,null,"No"]
[null,null,null,null,null,null,null,null,null,"No"]
[null,null,null,null,null,null,null,null,null,"No"]
[null,null,null,null,null,null,null,null,null,"No"]
[null,null,null,null,null,null,null,null,null,"No"]
[null,null,null,null,null,null,null,null,null,"No"]
[null,null,null,null,null,null,null,null,null,"No"]
[null,null,null,null,null,null,null,null,null,"No"]
[null,null,null,null,null,null,null,null,null,"No"]
[null,null,null,null,null,null,null,null,null,"No"]
[null,null,null,null,null,null,null,null,null,"No"]
[null,null,null,null,null,null,null,null,null,"No"]
[null,null,null,null,null,null,null,null,null,"No"]
[null,null,null,null,null,null,null,null,null,"No"]
[null,null,null,null,null,null,null,null,null,"No"]
[null,null,null,null,null,null,null,null,null,"No"]
[null,null,null,null,null,null,null,null,null,"No"]
[null,null,null,null,null,null,null,null,null,"No"]
[null,null,null,null,null,null,null,null,null,"No"]
[null,null,null,null,null,null,null,null,null,"No"]
[null,null,null,null,null,null,null,null,null,"No"]
[null,null,null,null,null,null,null,null,null,"No"]
[null,null,null,null,null,null,null,null,null,"No"]
[null,null,null,null,null,null,null,null,null,"No"]
[null,null,null,null,null,null,null,null,null,"No"]
[null,null,null,null,null,null,null,null,null,"No"]
[null,null,null,null,null,null,null,null,null,"No"]
[null,null,null,null,null,null,null,null,null,"No"]
[null,null,null,null,null,null,null,null,null,"No"]
[null,null,null,null,null,null,null,null,null,"No"]
[null,null,null,null,null,null,null,null,null,"No"]
[null,null,null,null,null,null,null,null,null,"No"]
[null,null,null,null,null,null,null,null,null,"No"]
[null,null,null,null,null,null,null,null,null,"No"]
[null,null,null,null,null,null,null,null,null,"No"]
[null,null,null,null,null,null,null,null,null,"No"]
[null,null,null,null,null,null,null,null,null,"No"]
[null,null,null,null,null,null,null,null,null,"No"]
[null,null,null,null,null,null,null,null,null,"No"]
[null,null,null,null,null,null,null,null,null,"No"]
[null,null,null,null,null,null,null,null,null,"No"]
[null,null,null,null,null,null,null,null,null,"No"]
[null,null,null,null,null,null,null,null,null,"No"]
[null,null,null,null,null,null,null,null,null,"No"]
[null,null,null,null,null,null,null,null,null,"No"]
[null,null,null,null,null,null,null,null,null,"No"]
[null,null,null,null,null,null,null,null,null,"No"]
[null,null,null,null,null,null,null,null,null,"No"]
[null,null,null,null,null,null,null,null,null,"No"]
[null,null,null,null,null,null,null,null,null,"No"]
[null,null,null,null,null,null,null,null,null,"No"]
[null,null,null,null,null,null,null,null,null,"No"]
[null,null,null,null,null,null,null,null,null,"No"]
[null,null,null,null,null,null,null,null,null,"No"]
[null,null,null,null,null,null,null,null,null,"No"]
[null,null,null,null,null,null,null,null,null,"No"]
[null,null,null,null,null,null,null,null,null,"No"]
[null,null,null,null,null,null,null,null,null,"No"]
[null,null,null,null,null,null,null,null,null,"No"]
[null,null,null,null,null,null,null,null,null,"No"]
[null,null,null,null,null,null,null,null,null,"No"]
[null,null,null,null,null,null,null,null,null,"No"]
[null,null,null,null,null,null,null,null,null,"No"]
[null,null,null,null,null,null,null,null,null,"No"]
[null,null,null,null,null,null,null,null,null,"No"]
[null,null,null,null,null,null,null,null,null,"No"]
[null,null,null,null,null,null,null,null,null,"No"]
[null,null,null,null,null,null,null,null,null,"No"]
[null,null,null,null,null,null,null,null,null,"No"]
[null,null,null,null,null,null,null,null,null,"No"]
[null,null,null,null,null,null,null,null,null,"No"]
[null,null,null,null,null,null,null,null,null,"No"]
[null,null,null,null,null,null,null,null,null,"No"]
[null,null,null,null,null,null,null,null,null,"No"]
[null,null,null,null,null,null,null,null,null,"No"]
[null,null,null,null,null,null,null,null,null,"No"]
[null,null,null,null,null,null,null,null,null,"No"]
[null,null,null,null,null,null,null,null,null,"No"]
[null,null,null,null,null,null,null,null,null,"No"]
[null,null,null,null,null,null,null,null,null,"No"]
[null,null,null,null,null,null,null,null,null,"No"]
[null,null,null,null,null,null,null,null,null,"No"]
[null,null,null,null,null,null,null,null,null,"No"]
[null,null,null,null,null,null,null,null,null,"No"]
[null,null,null,null,null,null,null,null,null,"No"]
[null,null,null,null,null,null,null,null,null,"No"]
[null,null,null,null,null,null,null,null,null,"No"]
[null,null,null,null,null,null,null,null,null,"No"]
[null,null,null,null,null,null,null,null,null,"No"]
[null,null,null,null,null,null,null,null,null,"No"]
[null,null,null,null,null,null,null,null,null,"No"]
[null,null,null,null,null,null,null,null,null,"No"]
[null,null,null,null,null,null,null,null,null,"No"]
[null,null,null,null,null,null,null,null,null,"No"]
[null,null,null,null,null,null,null,null,null,"No"]
[null,null,null,null,null,null,null,null,null,"No"]
[null,null,null,null,null,null,null,null,null,"No"]
[null,null,null,null,null,null,null,null,null,"No"]
[null,null,null,null,null,null,null,null,null,"No"]
[null,null,null,null,null,null,null,null,null,"No"]
[null,null,null,null,null,null,null,null,null,"No"]
[null,null,null,null,null,null,null,null,null,"No"]
[null,null,null,null,null,null,null,null,null,"No"]
[null,null,null,null,null,null,null,null,null,"No"]
[null,null,null,null,null,null,null,null,null,"No"]
[null,null,null,null,null,null,null,null,null,"No"]
[null,null,null,null,null,null,null,null,null,"No"]
[null,null,null,null,null,null,null,null,null,"No"]
[null,null,null,null,null,null,null,null,null,"No"]
[null,null,null,null,null,null,null,null,null,"No"]
[null,null,null,null,null,null,null,null,null,"No"]
[null,null,null,null,null,null,null,null,null,"No"]
[null,null,null,null,null,null,null,null,null,"No"]
[null,null,null,null,null,null,null,null,null,"No"]
[null,null,null,null,null,null,null,null,null,"No"]
[null,null,null,null,null,null,null,null,null,"No"]
[null,null,null,null,null,null,null,null,null,"No"]
[null,null,null,null,null,null,null,null,null,"No"]
[null,null,null,null,null,null,null,null,null,"No"]
[null,null,null,null,null,null,null,null,null,"No"]
[null,null,null,null,null,null,null,null,null,"No"]
[null,null,null,null,null,null,null,null,null,"No"]
[null,null,null,null,null,null,null,null,null,"No"]
[null,null,null,null,null,null,null,null,null,"No"]
[null,null,null,null,null,null,null,null,null,"No"]
[null,null,null,null,null,null,null,null,null,"No"]
[null,null,null,null,null,null,null,null,null,"No"]
[null,null,null,null,null,null,null,null,null,"No"]
[null,null,null,null,null,null,null,null,null,"No"]
[null,null,null,null,null,null,null,null,null,"No"]
[null,null,null,null,null,null,null,null,null,"No"]
[null,null,null,null,null,null,null,null,null,"No"]
[null,null,null,null,null,null,null,null,null,"No"]
[null,null,null,null,null,null,null,null,null,"No"]
[null,null,null,null,null,null,null,null,null,"No"]
[null,null,null,null,null,null,null,null,null,"No"]
[null,null,null,null,null,null,null,null,null,"No"]
[null,null,null,null,null,null,null,null,null,"No"]
[null,null,null,null,null,null,null,null,null,"No"]
[null,null,null,null,null,null,null,null,null,"No"]
[null,null,null,null,null,null,null,null,null,"No"]
[null,null,null,null,null,null,null,null,null,"No"]
[null,null,null,null,null,null,null,null,null,"No"]
[null,null,null,null,null,null,null,null,null,"No"]
[null,null,null,null,null,null,null,null,null,"No"]
[null,null,null,null,null,null,null,null,null,"No"]
[null,null,null,null,null,null,null,null,null,"No"]
[null,null,null,null,null,null,null,null,null,"No"]
[null,null,null,null,null,null,null,null,null,"No"]
[null,null,null,null,null,null,null,null,null,"No"]
[null,null,null,null,null,null,null,null,null,"No"]
[null,null,null,null,null,null,null,null,null,"No"]
[null,null,null,null,null,null,null,null,null,"No"]
[null,null,null,null,null,null,null,null,null,"No"]
[null,null,null,null,null,null,null,null,null,"No"]
[null,null,null,null,null,null,null,null,null,"No"]
[]
[]
[]
[]
[]
[]
[]
[]
[]
[]
[]
[]
[]
[]
[]
[]
[]
[]
[]
[]
[]
[]
[]
[]
[]
[]
[]
[]
[]
[]
[]
[]
[]
[]
[]
[]
[]
[]
[]
[]
[]
[]
[]
[]
[]
[]
[]
[]
[]
[]
[]
[]
[]
[]
[]
[]
[]
[]
[]
[]
[]
[]
[]
[]
[]
[]
[]
[]
[]
[]
[]
[]
[]
[]
[]
[]
[]
[]
[]
[]
[]
[]
[]
[]
[]
[]
[]
[]
[]
[]
[]
[]
[]
[]
[]
[]
[null,null,null,null,null,null,null,null,null,null,null,null,null,null,null,null,null,{"$f":"IF(A1397<>\"\",buildingexp(B1397,E1397),\"\")","v":""},{"$f":"IF(A1397<>\"\",buildingprop(B1397,D1397),\"\")","v":""}]
[null,null,null,null,null,null,null,null,null,null,null,null,null,null,null,null,null,{"$f":"IF(A1398<>\"\",buildingexp(B1398,E1398),\"\")","v":""},{"$f":"IF(A1398<>\"\",buildingprop(B1398,D1398),\"\")","v":""}]

{"sheet":"Ferry","index":10,"n_rows":1300,"n_cols":19,"rows_kept":1300,"cut":false,"hidden":false,"merged":[[18,0,18,7],[18,11,18,14],[0,11,0,15],[1,11,1,14],[2,11,2,14],[3,11,3,14],[4,10,4,13],[5,10,5,13]]}
[null,null,null,null,null,null,null,null,null,null,null,"Specified Thresholds",null,null,null,null,null,null,"Yes"]
[null,null,null,null,null,null,null,null,null,null,null,"Potentially Exposed Population",null,null,null,{"$f":"Thresholds!C40","v":302},null,null,"No"]
[null,null,null,null,null,null,null,null,null,null,null,"Property Loss",null,null,null,{"$f":"Thresholds!C41","v":100724172}]
[null,null,null,null,null,null,null,null,null,null,null,"Mission Importance",null,null,null,{"$f":"Thresholds!C42","v":"No"}]
[]
[]
[]
[]
[]
[]
[]
[]
[]
[]
[]
[]
[]
[]
["FERRY",null,null,null,null,null,null,null,null,null,null,"CRITICALITY"]
["Asset ID","Quantity","Max Occupancy","Replacement Cost Per Asset",null,null,"Comments",null,null,"Manually mark as critical?",null,"Potentially Exposed Population","Property Loss","Mission Importance","Manual Override"]
["Ferry Station - I",3,300,100,null,null,null,null,null,"No"]
["Ferry Station - II",null,300,100,null,null,null,null,null,"No"]
[null,null,null,null,null,null,null,null,null,"No"]
[null,null,null,null,null,null,null,null,null,"No"]
[null,null,null,null,null,null,null,null,null,"No"]
[null,null,null,null,null,null,null,null,null,"No"]
[null,null,null,null,null,null,null,null,null,"No"]
[null,null,null,null,null,null,null,null,null,"No"]
[null,null,null,null,null,null,null,null,null,"No"]
[null,null,null,null,null,null,null,null,null,"No"]
[null,null,null,null,null,null,null,null,null,"No"]
[null,null,null,null,null,null,null,null,null,"No"]
[null,null,null,null,null,null,null,null,null,"No"]
[null,null,null,null,null,null,null,null,null,"No"]
[null,null,null,null,null,null,null,null,null,"No"]
[null,null,null,null,null,null,null,null,null,"No"]
[null,null,null,null,null,null,null,null,null,"No"]
[null,null,null,null,null,null,null,null,null,"No"]
[null,null,null,null,null,null,null,null,null,"No"]
[null,null,null,null,null,null,null,null,null,"No"]
[null,null,null,null,null,null,null,null,null,"No"]
[null,null,null,null,null,null,null,null,null,"No"]
[null,null,null,null,null,null,null,null,null,"No"]
[null,null,null,null,null,null,null,null,null,"No"]
[null,null,null,null,null,null,null,null,null,"No"]
[null,null,null,null,null,null,null,null,null,"No"]
[null,null,null,null,null,null,null,null,null,"No"]
[null,null,null,null,null,null,null,null,null,"No"]
[null,null,null,null,null,null,null,null,null,"No"]
[null,null,null,null,null,null,null,null,null,"No"]
[null,null,null,null,null,null,null,null,null,"No"]
[null,null,null,null,null,null,null,null,null,"No"]
[null,null,null,null,null,null,null,null,null,"No"]
[null,null,null,null,null,null,null,null,null,"No"]
[null,null,null,null,null,null,null,null,null,"No"]
[null,null,null,null,null,null,null,null,null,"No"]
[null,null,null,null,null,null,null,null,null,"No"]
[null,null,null,null,null,null,null,null,null,"No"]
[null,null,null,null,null,null,null,null,null,"No"]
[null,null,null,null,null,null,null,null,null,"No"]
[null,null,null,null,null,null,null,null,null,"No"]
[null,null,null,null,null,null,null,null,null,"No"]
[null,null,null,null,null,null,null,null,null,"No"]
[null,null,null,null,null,null,null,null,null,"No"]
[null,null,null,null,null,null,null,null,null,"No"]
[null,null,null,null,null,null,null,null,null,"No"]
[null,null,null,null,null,null,null,null,null,"No"]
[null,null,null,null,null,null,null,null,null,"No"]
[null,null,null,null,null,null,null,null,null,"No"]
[null,null,null,null,null,null,null,null,null,"No"]
[null,null,null,null,null,null,null,null,null,"No"]
[null,null,null,null,null,null,null,null,null,"No"]
[null,null,null,null,null,null,null,null,null,"No"]
[null,null,null,null,null,null,null,null,null,"No"]
[null,null,null,null,null,null,null,null,null,"No"]
[null,null,null,null,null,null,null,null,null,"No"]
[null,null,null,null,null,null,null,null,null,"No"]
[null,null,null,null,null,null,null,null,null,"No"]
[null,null,null,null,null,null,null,null,null,"No"]
[null,null,null,null,null,null,null,null,null,"No"]
[null,null,null,null,null,null,null,null,null,"No"]
[null,null,null,null,null,null,null,null,null,"No"]
[null,null,null,null,null,null,null,null,null,"No"]
[null,null,null,null,null,null,null,null,null,"No"]
[null,null,null,null,null,null,null,null,null,"No"]
[null,null,null,null,null,null,null,null,null,"No"]
[null,null,null,null,null,null,null,null,null,"No"]
[null,null,null,null,null,null,null,null,null,"No"]
[null,null,null,null,null,null,null,null,null,"No"]
[null,null,null,null,null,null,null,null,null,"No"]
[null,null,null,null,null,null,null,null,null,"No"]
[null,null,null,null,null,null,null,null,null,"No"]
[null,null,null,null,null,null,null,null,null,"No"]
[null,null,null,null,null,null,null,null,null,"No"]
[null,null,null,null,null,null,null,null,null,"No"]
[null,null,null,null,null,null,null,null,null,"No"]
[null,null,null,null,null,null,null,null,null,"No"]
[null,null,null,null,null,null,null,null,null,"No"]
[null,null,null,null,null,null,null,null,null,"No"]
[null,null,null,null,null,null,null,null,null,"No"]
[null,null,null,null,null,null,null,null,null,"No"]
[null,null,null,null,null,null,null,null,null,"No"]
[null,null,null,null,null,null,null,null,null,"No"]
[null,null,null,null,null,null,null,null,null,"No"]
[null,null,null,null,null,null,null,null,null,"No"]
[null,null,null,null,null,null,null,null,null,"No"]
[null,null,null,null,null,null,null,null,null,"No"]
[null,null,null,null,null,null,null,null,null,"No"]
[null,null,null,null,null,null,null,null,null,"No"]
[null,null,null,null,null,null,null,null,null,"No"]
[null,null,null,null,null,null,null,null,null,"No"]
[null,null,null,null,null,null,null,null,null,"No"]
[null,null,null,null,null,null,null,null,null,"No"]
[null,null,null,null,null,null,null,null,null,"No"]
[null,null,null,null,null,null,null,null,null,"No"]
[null,null,null,null,null,null,null,null,null,"No"]
[null,null,null,null,null,null,null,null,null,"No"]
[null,null,null,null,null,null,null,null,null,"No"]
[null,null,null,null,null,null,null,null,null,"No"]
[null,null,null,null,null,null,null,null,null,"No"]
[null,null,null,null,null,null,null,null,null,"No"]
[null,null,null,null,null,null,null,null,null,"No"]
[null,null,null,null,null,null,null,null,null,"No"]
[null,null,null,null,null,null,null,null,null,"No"]
[null,null,null,null,null,null,null,null,null,"No"]
[null,null,null,null,null,null,null,null,null,"No"]
[null,null,null,null,null,null,null,null,null,"No"]
[null,null,null,null,null,null,null,null,null,"No"]
[null,null,null,null,null,null,null,null,null,"No"]
[null,null,null,null,null,null,null,null,null,"No"]
[null,null,null,null,null,null,null,null,null,"No"]
[null,null,null,null,null,null,null,null,null,"No"]
[null,null,null,null,null,null,null,null,null,"No"]
[null,null,null,null,null,null,null,null,null,"No"]
[null,null,null,null,null,null,null,null,null,"No"]
[null,null,null,null,null,null,null,null,null,"No"]
[null,null,null,null,null,null,null,null,null,"No"]
[null,null,null,null,null,null,null,null,null,"No"]
[null,null,null,null,null,null,null,null,null,"No"]
[null,null,null,null,null,null,null,null,null,"No"]
[null,null,null,null,null,null,null,null,null,"No"]
[null,null,null,null,null,null,null,null,null,"No"]
[null,null,null,null,null,null,null,null,null,"No"]
[null,null,null,null,null,null,null,null,null,"No"]
[null,null,null,null,null,null,null,null,null,"No"]
[null,null,null,null,null,null,null,null,null,"No"]
[null,null,null,null,null,null,null,null,null,"No"]
[null,null,null,null,null,null,null,null,null,"No"]
[null,null,null,null,null,null,null,null,null,"No"]
[null,null,null,null,null,null,null,null,null,"No"]
[null,null,null,null,null,null,null,null,null,"No"]
[null,null,null,null,null,null,null,null,null,"No"]
[null,null,null,null,null,null,null,null,null,"No"]
[null,null,null,null,null,null,null,null,null,"No"]
[null,null,null,null,null,null,null,null,null,"No"]
[null,null,null,null,null,null,null,null,null,"No"]
[null,null,null,null,null,null,null,null,null,"No"]
[null,null,null,null,null,null,null,null,null,"No"]
[null,null,null,null,null,null,null,null,null,"No"]
[null,null,null,null,null,null,null,null,null,"No"]
[null,null,null,null,null,null,null,null,null,"No"]
[null,null,null,null,null,null,null,null,null,"No"]
[null,null,null,null,null,null,null,null,null,"No"]
[null,null,null,null,null,null,null,null,null,"No"]
[null,null,null,null,null,null,null,null,null,"No"]
[null,null,null,null,null,null,null,null,null,"No"]
[null,null,null,null,null,null,null,null,null,"No"]
[null,null,null,null,null,null,null,null,null,"No"]
[null,null,null,null,null,null,null,null,null,"No"]
[null,null,null,null,null,null,null,null,null,"No"]
[null,null,null,null,null,null,null,null,null,"No"]
[null,null,null,null,null,null,null,null,null,"No"]
[null,null,null,null,null,null,null,null,null,"No"]
[null,null,null,null,null,null,null,null,null,"No"]
[null,null,null,null,null,null,null,null,null,"No"]
[null,null,null,null,null,null,null,null,null,"No"]
[null,null,null,null,null,null,null,null,null,"No"]
[null,null,null,null,null,null,null,null,null,"No"]
[null,null,null,null,null,null,null,null,null,"No"]
[null,null,null,null,null,null,null,null,null,"No"]
[null,null,null,null,null,null,null,null,null,"No"]
[null,null,null,null,null,null,null,null,null,"No"]
[null,null,null,null,null,null,null,null,null,"No"]
[null,null,null,null,null,null,null,null,null,"No"]
[null,null,null,null,null,null,null,null,null,"No"]
[null,null,null,null,null,null,null,null,null,"No"]
[null,null,null,null,null,null,null,null,null,"No"]
[null,null,null,null,null,null,null,null,null,"No"]
[null,null,null,null,null,null,null,null,null,"No"]
[null,null,null,null,null,null,null,null,null,"No"]
[null,null,null,null,null,null,null,null,null,"No"]
[null,null,null,null,null,null,null,null,null,"No"]
[null,null,null,null,null,null,null,null,null,"No"]
[null,null,null,null,null,null,null,null,null,"No"]
[null,null,null,null,null,null,null,null,null,"No"]
[null,null,null,null,null,null,null,null,null,"No"]
[null,null,null,null,null,null,null,null,null,"No"]
[null,null,null,null,null,null,null,null,null,"No"]
[null,null,null,null,null,null,null,null,null,"No"]
[null,null,null,null,null,null,null,null,null,"No"]
[null,null,null,null,null,null,null,null,null,"No"]
[null,null,null,null,null,null,null,null,null,"No"]
[null,null,null,null,null,null,null,null,null,"No"]
[null,null,null,null,null,null,null,null,null,"No"]
[null,null,null,null,null,null,null,null,null,"No"]
[null,null,null,null,null,null,null,null,null,"No"]
[null,null,null,null,null,null,null,null,null,"No"]
[null,null,null,null,null,null,null,null,null,"No"]
[null,null,null,null,null,null,null,null,null,"No"]
[null,null,null,null,null,null,null,null,null,"No"]
[null,null,null,null,null,null,null,null,null,"No"]
[null,null,null,null,null,null,null,null,null,"No"]
[null,null,null,null,null,null,null,null,null,"No"]
[null,null,null,null,null,null,null,null,null,"No"]
[null,null,null,null,null,null,null,null,null,"No"]
[null,null,null,null,null,null,null,null,null,"No"]
[null,null,null,null,null,null,null,null,null,"No"]
[null,null,null,null,null,null,null,null,null,"No"]
[null,null,null,null,null,null,null,null,null,"No"]
[null,null,null,null,null,null,null,null,null,"No"]
[null,null,null,null,null,null,null,null,null,"No"]
[null,null,null,null,null,null,null,null,null,"No"]
[null,null,null,null,null,null,null,null,null,"No"]
[null,null,null,null,null,null,null,null,null,"No"]
[null,null,null,null,null,null,null,null,null,"No"]
[null,null,null,null,null,null,null,null,null,"No"]
[null,null,null,null,null,null,null,null,null,"No"]
[null,null,null,null,null,null,null,null,null,"No"]
[null,null,null,null,null,null,null,null,null,"No"]
[null,null,null,null,null,null,null,null,null,"No"]
[null,null,null,null,null,null,null,null,null,"No"]
[null,null,null,null,null,null,null,null,null,"No"]
[null,null,null,null,null,null,null,null,null,"No"]
[null,null,null,null,null,null,null,null,null,"No"]
[null,null,null,null,null,null,null,null,null,"No"]
[null,null,null,null,null,null,null,null,null,"No"]
[null,null,null,null,null,null,null,null,null,"No"]
[null,null,null,null,null,null,null,null,null,"No"]
[null,null,null,null,null,null,null,null,null,"No"]
[null,null,null,null,null,null,null,null,null,"No"]
[null,null,null,null,null,null,null,null,null,"No"]
[null,null,null,null,null,null,null,null,null,"No"]
[null,null,null,null,null,null,null,null,null,"No"]
[null,null,null,null,null,null,null,null,null,"No"]
[null,null,null,null,null,null,null,null,null,"No"]
[null,null,null,null,null,null,null,null,null,"No"]
[null,null,null,null,null,null,null,null,null,"No"]
[null,null,null,null,null,null,null,null,null,"No"]
[null,null,null,null,null,null,null,null,null,"No"]
[null,null,null,null,null,null,null,null,null,"No"]
[null,null,null,null,null,null,null,null,null,"No"]
[null,null,null,null,null,null,null,null,null,"No"]
[null,null,null,null,null,null,null,null,null,"No"]
[null,null,null,null,null,null,null,null,null,"No"]
[null,null,null,null,null,null,null,null,null,"No"]
[null,null,null,null,null,null,null,null,null,"No"]
[null,null,null,null,null,null,null,null,null,"No"]
[null,null,null,null,null,null,null,null,null,"No"]
[null,null,null,null,null,null,null,null,null,"No"]
[null,null,null,null,null,null,null,null,null,"No"]
[null,null,null,null,null,null,null,null,null,"No"]
[null,null,null,null,null,null,null,null,null,"No"]
[null,null,null,null,null,null,null,null,null,"No"]
[null,null,null,null,null,null,null,null,null,"No"]
[null,null,null,null,null,null,null,null,null,"No"]
[null,null,null,null,null,null,null,null,null,"No"]
[null,null,null,null,null,null,null,null,null,"No"]
[null,null,null,null,null,null,null,null,null,"No"]
[null,null,null,null,null,null,null,null,null,"No"]
[null,null,null,null,null,null,null,null,null,"No"]
[null,null,null,null,null,null,null,null,null,"No"]
[null,null,null,null,null,null,null,null,null,"No"]
[null,null,null,null,null,null,null,null,null,"No"]
[null,null,null,null,null,null,null,null,null,"No"]
[null,null,null,null,null,null,null,null,null,"No"]
[null,null,null,null,null,null,null,null,null,"No"]
[null,null,null,null,null,null,null,null,null,"No"]
[null,null,null,null,null,null,null,null,null,"No"]
[null,null,null,null,null,null,null,null,null,"No"]
[null,null,null,null,null,null,null,null,null,"No"]
[null,null,null,null,null,null,null,null,null,"No"]
[null,null,null,null,null,null,null,null,null,"No"]
[null,null,null,null,null,null,null,null,null,"No"]
[null,null,null,null,null,null,null,null,null,"No"]
[null,null,null,null,null,null,null,null,null,"No"]
[null,null,null,null,null,null,null,null,null,"No"]
[null,null,null,null,null,null,null,null,null,"No"]
[null,null,null,null,null,null,null,null,null,"No"]
[null,null,null,null,null,null,null,null,null,"No"]
[null,null,null,null,null,null,null,null,null,"No"]
[null,null,null,null,null,null,null,null,null,"No"]
[null,null,null,null,null,null,null,null,null,"No"]
[null,null,null,null,null,null,null,null,null,"No"]
[null,null,null,null,null,null,null,null,null,"No"]
[null,null,null,null,null,null,null,null,null,"No"]
[null,null,null,null,null,null,null,null,null,"No"]
[null,null,null,null,null,null,null,null,null,"No"]
[null,null,null,null,null,null,null,null,null,"No"]
[null,null,null,null,null,null,null,null,null,"No"]
[null,null,null,null,null,null,null,null,null,"No"]
[null,null,null,null,null,null,null,null,null,"No"]
[null,null,null,null,null,null,null,null,null,"No"]
[null,null,null,null,null,null,null,null,null,"No"]
[null,null,null,null,null,null,null,null,null,"No"]
[null,null,null,null,null,null,null,null,null,"No"]
[null,null,null,null,null,null,null,null,null,"No"]
[null,null,null,null,null,null,null,null,null,"No"]
[null,null,null,null,null,null,null,null,null,"No"]
[null,null,null,null,null,null,null,null,null,"No"]
[null,null,null,null,null,null,null,null,null,"No"]
[null,null,null,null,null,null,null,null,null,"No"]
[null,null,null,null,null,null,null,null,null,"No"]
[null,null,null,null,null,null,null,null,null,"No"]
[null,null,null,null,null,null,null,null,null,"No"]
[null,null,null,null,null,null,null,null,null,"No"]
[null,null,null,null,null,null,null,null,null,"No"]
[null,null,null,null,null,null,null,null,null,"No"]
[null,null,null,null,null,null,null,null,null,"No"]
[null,null,null,null,null,null,null,null,null,"No"]
[null,null,null,null,null,null,null,null,null,"No"]
[null,null,null,null,null,null,null,null,null,"No"]
[null,null,null,null,null,null,null,null,null,"No"]
[null,null,null,null,null,null,null,null,null,"No"]
[null,null,null,null,null,null,null,null,null,"No"]
[null,null,null,null,null,null,null,null,null,"No"]
[null,null,null,null,null,null,null,null,null,"No"]
[null,null,null,null,null,null,null,null,null,"No"]
[null,null,null,null,null,null,null,null,null,"No"]
[null,null,null,null,null,null,null,null,null,"No"]
[null,null,null,null,null,null,null,null,null,"No"]
[null,null,null,null,null,null,null,null,null,"No"]
[null,null,null,null,null,null,null,null,null,"No"]
[null,null,null,null,null,null,null,null,null,"No"]
[null,null,null,null,null,null,null,null,null,"No"]
[null,null,null,null,null,null,null,null,null,"No"]
[null,null,null,null,null,null,null,null,null,"No"]
[null,null,null,null,null,null,null,null,null,"No"]
[null,null,null,null,null,null,null,null,null,"No"]
[null,null,null,null,null,null,null,null,null,"No"]
[null,null,null,null,null,null,null,null,null,"No"]
[null,null,null,null,null,null,null,null,null,"No"]
[null,null,null,null,null,null,null,null,null,"No"]
[null,null,null,null,null,null,null,null,null,"No"]
[null,null,null,null,null,null,null,null,null,"No"]
[null,null,null,null,null,null,null,null,null,"No"]
[null,null,null,null,null,null,null,null,null,"No"]
[null,null,null,null,null,null,null,null,null,"No"]
[null,null,null,null,null,null,null,null,null,"No"]
[null,null,null,null,null,null,null,null,null,"No"]
[null,null,null,null,null,null,null,null,null,"No"]
[null,null,null,null,null,null,null,null,null,"No"]
[null,null,null,null,null,null,null,null,null,"No"]
[null,null,null,null,null,null,null,null,null,"No"]
[null,null,null,null,null,null,null,null,null,"No"]
[null,null,null,null,null,null,null,null,null,"No"]
[null,null,null,null,null,null,null,null,null,"No"]
[null,null,null,null,null,null,null,null,null,"No"]
[null,null,null,null,null,null,null,null,null,"No"]
[null,null,null,null,null,null,null,null,null,"No"]
[null,null,null,null,null,null,null,null,null,"No"]
[null,null,null,null,null,null,null,null,null,"No"]
[null,null,null,null,null,null,null,null,null,"No"]
[null,null,null,null,null,null,null,null,null,"No"]
[null,null,null,null,null,null,null,null,null,"No"]
[null,null,null,null,null,null,null,null,null,"No"]
[null,null,null,null,null,null,null,null,null,"No"]
[null,null,null,null,null,null,null,null,null,"No"]
[null,null,null,null,null,null,null,null,null,"No"]
[null,null,null,null,null,null,null,null,null,"No"]
[null,null,null,null,null,null,null,null,null,"No"]
[null,null,null,null,null,null,null,null,null,"No"]
[null,null,null,null,null,null,null,null,null,"No"]
[null,null,null,null,null,null,null,null,null,"No"]
[null,null,null,null,null,null,null,null,null,"No"]
[null,null,null,null,null,null,null,null,null,"No"]
[null,null,null,null,null,null,null,null,null,"No"]
[null,null,null,null,null,null,null,null,null,"No"]
[null,null,null,null,null,null,null,null,null,"No"]
[null,null,null,null,null,null,null,null,null,"No"]
[null,null,null,null,null,null,null,null,null,"No"]
[null,null,null,null,null,null,null,null,null,"No"]
[null,null,null,null,null,null,null,null,null,"No"]
[null,null,null,null,null,null,null,null,null,"No"]
[null,null,null,null,null,null,null,null,null,"No"]
[null,null,null,null,null,null,null,null,null,"No"]
[null,null,null,null,null,null,null,null,null,"No"]
[null,null,null,null,null,null,null,null,null,"No"]
[null,null,null,null,null,null,null,null,null,"No"]
[null,null,null,null,null,null,null,null,null,"No"]
[null,null,null,null,null,null,null,null,null,"No"]
[null,null,null,null,null,null,null,null,null,"No"]
[null,null,null,null,null,null,null,null,null,"No"]
[null,null,null,null,null,null,null,null,null,"No"]
[null,null,null,null,null,null,null,null,null,"No"]
[null,null,null,null,null,null,null,null,null,"No"]
[null,null,null,null,null,null,null,null,null,"No"]
[null,null,null,null,null,null,null,null,null,"No"]
[null,null,null,null,null,null,null,null,null,"No"]
[null,null,null,null,null,null,null,null,null,"No"]
[null,null,null,null,null,null,null,null,null,"No"]
[null,null,null,null,null,null,null,null,null,"No"]
[null,null,null,null,null,null,null,null,null,"No"]
[null,null,null,null,null,null,null,null,null,"No"]
[null,null,null,null,null,null,null,null,null,"No"]
[null,null,null,null,null,null,null,null,null,"No"]
[null,null,null,null,null,null,null,null,null,"No"]
[null,null,null,null,null,null,null,null,null,"No"]
[null,null,null,null,null,null,null,null,null,"No"]
[null,null,null,null,null,null,null,null,null,"No"]
[null,null,null,null,null,null,null,null,null,"No"]
[null,null,null,null,null,null,null,null,null,"No"]
[null,null,null,null,null,null,null,null,null,"No"]
[null,null,null,null,null,null,null,null,null,"No"]
[null,null,null,null,null,null,null,null,null,"No"]
[null,null,null,null,null,null,null,null,null,"No"]
[null,null,null,null,null,null,null,null,null,"No"]
[null,null,null,null,null,null,null,null,null,"No"]
[null,null,null,null,null,null,null,null,null,"No"]
[null,null,null,null,null,null,null,null,null,"No"]
[null,null,null,null,null,null,null,null,null,"No"]
[null,null,null,null,null,null,null,null,null,"No"]
[null,null,null,null,null,null,null,null,null,"No"]
[null,null,null,null,null,null,null,null,null,"No"]
[null,null,null,null,null,null,null,null,null,"No"]
[null,null,null,null,null,null,null,null,null,"No"]
[null,null,null,null,null,null,null,null,null,"No"]
[null,null,null,null,null,null,null,null,null,"No"]
[null,null,null,null,null,null,null,null,null,"No"]
[null,null,null,null,null,null,null,null,null,"No"]
[null,null,null,null,null,null,null,null,null,"No"]
[null,null,null,null,null,null,null,null,null,"No"]
[null,null,null,null,null,null,null,null,null,"No"]
[null,null,null,null,null,null,null,null,null,"No"]
[null,null,null,null,null,null,null,null,null,"No"]
[null,null,null,null,null,null,null,null,null,"No"]
[null,null,null,null,null,null,null,null,null,"No"]
[null,null,null,null,null,null,null,null,null,"No"]
[null,null,null,null,null,null,null,null,null,"No"]
[null,null,null,null,null,null,null,null,null,"No"]
[null,null,null,null,null,null,null,null,null,"No"]
[null,null,null,null,null,null,null,null,null,"No"]
[null,null,null,null,null,null,null,null,null,"No"]
[null,null,null,null,null,null,null,null,null,"No"]
[null,null,null,null,null,null,null,null,null,"No"]
[null,null,null,null,null,null,null,null,null,"No"]
[null,null,null,null,null,null,null,null,null,"No"]
[null,null,null,null,null,null,null,null,null,"No"]
[null,null,null,null,null,null,null,null,null,"No"]
[null,null,null,null,null,null,null,null,null,"No"]
[null,null,null,null,null,null,null,null,null,"No"]
[null,null,null,null,null,null,null,null,null,"No"]
[null,null,null,null,null,null,null,null,null,"No"]
[null,null,null,null,null,null,null,null,null,"No"]
[null,null,null,null,null,null,null,null,null,"No"]
[null,null,null,null,null,null,null,null,null,"No"]
[null,null,null,null,null,null,null,null,null,"No"]
[null,null,null,null,null,null,null,null,null,"No"]
[null,null,null,null,null,null,null,null,null,"No"]
[null,null,null,null,null,null,null,null,null,"No"]
[null,null,null,null,null,null,null,null,null,"No"]
[null,null,null,null,null,null,null,null,null,"No"]
[null,null,null,null,null,null,null,null,null,"No"]
[null,null,null,null,null,null,null,null,null,"No"]
[null,null,null,null,null,null,null,null,null,"No"]
[null,null,null,null,null,null,null,null,null,"No"]
[null,null,null,null,null,null,null,null,null,"No"]
[null,null,null,null,null,null,null,null,null,"No"]
[null,null,null,null,null,null,null,null,null,"No"]
[null,null,null,null,null,null,null,null,null,"No"]
[null,null,null,null,null,null,null,null,null,"No"]
[null,null,null,null,null,null,null,null,null,"No"]
[null,null,null,null,null,null,null,null,null,"No"]
[null,null,null,null,null,null,null,null,null,"No"]
[null,null,null,null,null,null,null,null,null,"No"]
[null,null,null,null,null,null,null,null,null,"No"]
[null,null,null,null,null,null,null,null,null,"No"]
[null,null,null,null,null,null,null,null,null,"No"]
[null,null,null,null,null,null,null,null,null,"No"]
[null,null,null,null,null,null,null,null,null,"No"]
[null,null,null,null,null,null,null,null,null,"No"]
[null,null,null,null,null,null,null,null,null,"No"]
[null,null,null,null,null,null,null,null,null,"No"]
[null,null,null,null,null,null,null,null,null,"No"]
[null,null,null,null,null,null,null,null,null,"No"]
[null,null,null,null,null,null,null,null,null,"No"]
[null,null,null,null,null,null,null,null,null,"No"]
[null,null,null,null,null,null,null,null,null,"No"]
[null,null,null,null,null,null,null,null,null,"No"]
[null,null,null,null,null,null,null,null,null,"No"]
[null,null,null,null,null,null,null,null,null,"No"]
[null,null,null,null,null,null,null,null,null,"No"]
[null,null,null,null,null,null,null,null,null,"No"]
[null,null,null,null,null,null,null,null,null,"No"]
[null,null,null,null,null,null,null,null,null,"No"]
[null,null,null,null,null,null,null,null,null,"No"]
[null,null,null,null,null,null,null,null,null,"No"]
[null,null,null,null,null,null,null,null,null,"No"]
[null,null,null,null,null,null,null,null,null,"No"]
[null,null,null,null,null,null,null,null,null,"No"]
[null,null,null,null,null,null,null,null,null,"No"]
[null,null,null,null,null,null,null,null,null,"No"]
[null,null,null,null,null,null,null,null,null,"No"]
[null,null,null,null,null,null,null,null,null,"No"]
[null,null,null,null,null,null,null,null,null,"No"]
[null,null,null,null,null,null,null,null,null,"No"]
[null,null,null,null,null,null,null,null,null,"No"]
[null,null,null,null,null,null,null,null,null,"No"]
[null,null,null,null,null,null,null,null,null,"No"]
[null,null,null,null,null,null,null,null,null,"No"]
[null,null,null,null,null,null,null,null,null,"No"]
[null,null,null,null,null,null,null,null,null,"No"]
[null,null,null,null,null,null,null,null,null,"No"]
[null,null,null,null,null,null,null,null,null,"No"]
[null,null,null,null,null,null,null,null,null,"No"]
[null,null,null,null,null,null,null,null,null,"No"]
[null,null,null,null,null,null,null,null,null,"No"]
[null,null,null,null,null,null,null,null,null,"No"]
[null,null,null,null,null,null,null,null,null,"No"]
[null,null,null,null,null,null,null,null,null,"No"]
[null,null,null,null,null,null,null,null,null,"No"]
[null,null,null,null,null,null,null,null,null,"No"]
[null,null,null,null,null,null,null,null,null,"No"]
[null,null,null,null,null,null,null,null,null,"No"]
[null,null,null,null,null,null,null,null,null,"No"]
[null,null,null,null,null,null,null,null,null,"No"]
[null,null,null,null,null,null,null,null,null,"No"]
[null,null,null,null,null,null,null,null,null,"No"]
[null,null,null,null,null,null,null,null,null,"No"]
[null,null,null,null,null,null,null,null,null,"No"]
[null,null,null,null,null,null,null,null,null,"No"]
[null,null,null,null,null,null,null,null,null,"No"]
[null,null,null,null,null,null,null,null,null,"No"]
[null,null,null,null,null,null,null,null,null,"No"]
[null,null,null,null,null,null,null,null,null,"No"]
[null,null,null,null,null,null,null,null,null,"No"]
[null,null,null,null,null,null,null,null,null,"No"]
[null,null,null,null,null,null,null,null,null,"No"]
[null,null,null,null,null,null,null,null,null,"No"]
[null,null,null,null,null,null,null,null,null,"No"]
[null,null,null,null,null,null,null,null,null,"No"]
[null,null,null,null,null,null,null,null,null,"No"]
[null,null,null,null,null,null,null,null,null,"No"]
[null,null,null,null,null,null,null,null,null,"No"]
[null,null,null,null,null,null,null,null,null,"No"]
[null,null,null,null,null,null,null,null,null,"No"]
[null,null,null,null,null,null,null,null,null,"No"]
[null,null,null,null,null,null,null,null,null,"No"]
[null,null,null,null,null,null,null,null,null,"No"]
[null,null,null,null,null,null,null,null,null,"No"]
[null,null,null,null,null,null,null,null,null,"No"]
[null,null,null,null,null,null,null,null,null,"No"]
[null,null,null,null,null,null,null,null,null,"No"]
[null,null,null,null,null,null,null,null,null,"No"]
[null,null,null,null,null,null,null,null,null,"No"]
[null,null,null,null,null,null,null,null,null,"No"]
[null,null,null,null,null,null,null,null,null,"No"]
[null,null,null,null,null,null,null,null,null,"No"]
[null,null,null,null,null,null,null,null,null,"No"]
[null,null,null,null,null,null,null,null,null,"No"]
[null,null,null,null,null,null,null,null,null,"No"]
[null,null,null,null,null,null,null,null,null,"No"]
[null,null,null,null,null,null,null,null,null,"No"]
[null,null,null,null,null,null,null,null,null,"No"]
[null,null,null,null,null,null,null,null,null,"No"]
[null,null,null,null,null,null,null,null,null,"No"]
[null,null,null,null,null,null,null,null,null,"No"]
[null,null,null,null,null,null,null,null,null,"No"]
[null,null,null,null,null,null,null,null,null,"No"]
[null,null,null,null,null,null,null,null,null,"No"]
[null,null,null,null,null,null,null,null,null,"No"]
[null,null,null,null,null,null,null,null,null,"No"]
[null,null,null,null,null,null,null,null,null,"No"]
[null,null,null,null,null,null,null,null,null,"No"]
[null,null,null,null,null,null,null,null,null,"No"]
[null,null,null,null,null,null,null,null,null,"No"]
[null,null,null,null,null,null,null,null,null,"No"]
[null,null,null,null,null,null,null,null,null,"No"]
[null,null,null,null,null,null,null,null,null,"No"]
[null,null,null,null,null,null,null,null,null,"No"]
[null,null,null,null,null,null,null,null,null,"No"]
[null,null,null,null,null,null,null,null,null,"No"]
[null,null,null,null,null,null,null,null,null,"No"]
[null,null,null,null,null,null,null,null,null,"No"]
[null,null,null,null,null,null,null,null,null,"No"]
[null,null,null,null,null,null,null,null,null,"No"]
[null,null,null,null,null,null,null,null,null,"No"]
[null,null,null,null,null,null,null,null,null,"No"]
[null,null,null,null,null,null,null,null,null,"No"]
[null,null,null,null,null,null,null,null,null,"No"]
[null,null,null,null,null,null,null,null,null,"No"]
[null,null,null,null,null,null,null,null,null,"No"]
[null,null,null,null,null,null,null,null,null,"No"]
[null,null,null,null,null,null,null,null,null,"No"]
[null,null,null,null,null,null,null,null,null,"No"]
[null,null,null,null,null,null,null,null,null,"No"]
[null,null,null,null,null,null,null,null,null,"No"]
[null,null,null,null,null,null,null,null,null,"No"]
[null,null,null,null,null,null,null,null,null,"No"]
[null,null,null,null,null,null,null,null,null,"No"]
[null,null,null,null,null,null,null,null,null,"No"]
[null,null,null,null,null,null,null,null,null,"No"]
[null,null,null,null,null,null,null,null,null,"No"]
[null,null,null,null,null,null,null,null,null,"No"]
[null,null,null,null,null,null,null,null,null,"No"]
[null,null,null,null,null,null,null,null,null,"No"]
[null,null,null,null,null,null,null,null,null,"No"]
[null,null,null,null,null,null,null,null,null,"No"]
[null,null,null,null,null,null,null,null,null,"No"]
[null,null,null,null,null,null,null,null,null,"No"]
[null,null,null,null,null,null,null,null,null,"No"]
[null,null,null,null,null,null,null,null,null,"No"]
[null,null,null,null,null,null,null,null,null,"No"]
[null,null,null,null,null,null,null,null,null,"No"]
[null,null,null,null,null,null,null,null,null,"No"]
[null,null,null,null,null,null,null,null,null,"No"]
[null,null,null,null,null,null,null,null,null,"No"]
[null,null,null,null,null,null,null,null,null,"No"]
[null,null,null,null,null,null,null,null,null,"No"]
[null,null,null,null,null,null,null,null,null,"No"]
[null,null,null,null,null,null,null,null,null,"No"]
[null,null,null,null,null,null,null,null,null,"No"]
[null,null,null,null,null,null,null,null,null,"No"]
[null,null,null,null,null,null,null,null,null,"No"]
[null,null,null,null,null,null,null,null,null,"No"]
[null,null,null,null,null,null,null,null,null,"No"]
[null,null,null,null,null,null,null,null,null,"No"]
[null,null,null,null,null,null,null,null,null,"No"]
[null,null,null,null,null,null,null,null,null,"No"]
[null,null,null,null,null,null,null,null,null,"No"]
[null,null,null,null,null,null,null,null,null,"No"]
[null,null,null,null,null,null,null,null,null,"No"]
[null,null,null,null,null,null,null,null,null,"No"]
[null,null,null,null,null,null,null,null,null,"No"]
[null,null,null,null,null,null,null,null,null,"No"]
[null,null,null,null,null,null,null,null,null,"No"]
[null,null,null,null,null,null,null,null,null,"No"]
[null,null,null,null,null,null,null,null,null,"No"]
[null,null,null,null,null,null,null,null,null,"No"]
[null,null,null,null,null,null,null,null,null,"No"]
[null,null,null,null,null,null,null,null,null,"No"]
[null,null,null,null,null,null,null,null,null,"No"]
[null,null,null,null,null,null,null,null,null,"No"]
[null,null,null,null,null,null,null,null,null,"No"]
[null,null,null,null,null,null,null,null,null,"No"]
[null,null,null,null,null,null,null,null,null,"No"]
[null,null,null,null,null,null,null,null,null,"No"]
[null,null,null,null,null,null,null,null,null,"No"]
[null,null,null,null,null,null,null,null,null,"No"]
[null,null,null,null,null,null,null,null,null,"No"]
[null,null,null,null,null,null,null,null,null,"No"]
[null,null,null,null,null,null,null,null,null,"No"]
[null,null,null,null,null,null,null,null,null,"No"]
[null,null,null,null,null,null,null,null,null,"No"]
[null,null,null,null,null,null,null,null,null,"No"]
[null,null,null,null,null,null,null,null,null,"No"]
[null,null,null,null,null,null,null,null,null,"No"]
[null,null,null,null,null,null,null,null,null,"No"]
[null,null,null,null,null,null,null,null,null,"No"]
[null,null,null,null,null,null,null,null,null,"No"]
[null,null,null,null,null,null,null,null,null,"No"]
[null,null,null,null,null,null,null,null,null,"No"]
[null,null,null,null,null,null,null,null,null,"No"]
[null,null,null,null,null,null,null,null,null,"No"]
[null,null,null,null,null,null,null,null,null,"No"]
[null,null,null,null,null,null,null,null,null,"No"]
[null,null,null,null,null,null,null,null,null,"No"]
[null,null,null,null,null,null,null,null,null,"No"]
[null,null,null,null,null,null,null,null,null,"No"]
[null,null,null,null,null,null,null,null,null,"No"]
[null,null,null,null,null,null,null,null,null,"No"]
[null,null,null,null,null,null,null,null,null,"No"]
[null,null,null,null,null,null,null,null,null,"No"]
[null,null,null,null,null,null,null,null,null,"No"]
[null,null,null,null,null,null,null,null,null,"No"]
[null,null,null,null,null,null,null,null,null,"No"]
[null,null,null,null,null,null,null,null,null,"No"]
[null,null,null,null,null,null,null,null,null,"No"]
[null,null,null,null,null,null,null,null,null,"No"]
[null,null,null,null,null,null,null,null,null,"No"]
[null,null,null,null,null,null,null,null,null,"No"]
[null,null,null,null,null,null,null,null,null,"No"]
[null,null,null,null,null,null,null,null,null,"No"]
[null,null,null,null,null,null,null,null,null,"No"]
[null,null,null,null,null,null,null,null,null,"No"]
[null,null,null,null,null,null,null,null,null,"No"]
[null,null,null,null,null,null,null,null,null,"No"]
[null,null,null,null,null,null,null,null,null,"No"]
[null,null,null,null,null,null,null,null,null,"No"]
[null,null,null,null,null,null,null,null,null,"No"]
[null,null,null,null,null,null,null,null,null,"No"]
[null,null,null,null,null,null,null,null,null,"No"]
[null,null,null,null,null,null,null,null,null,"No"]
[null,null,null,null,null,null,null,null,null,"No"]
[null,null,null,null,null,null,null,null,null,"No"]
[null,null,null,null,null,null,null,null,null,"No"]
[null,null,null,null,null,null,null,null,null,"No"]
[null,null,null,null,null,null,null,null,null,"No"]
[null,null,null,null,null,null,null,null,null,"No"]
[null,null,null,null,null,null,null,null,null,"No"]
[null,null,null,null,null,null,null,null,null,"No"]
[null,null,null,null,null,null,null,null,null,"No"]
[null,null,null,null,null,null,null,null,null,"No"]
[null,null,null,null,null,null,null,null,null,"No"]
[null,null,null,null,null,null,null,null,null,"No"]
[null,null,null,null,null,null,null,null,null,"No"]
[null,null,null,null,null,null,null,null,null,"No"]
[null,null,null,null,null,null,null,null,null,"No"]
[null,null,null,null,null,null,null,null,null,"No"]
[null,null,null,null,null,null,null,null,null,"No"]
[null,null,null,null,null,null,null,null,null,"No"]
[null,null,null,null,null,null,null,null,null,"No"]
[null,null,null,null,null,null,null,null,null,"No"]
[null,null,null,null,null,null,null,null,null,"No"]
[null,null,null,null,null,null,null,null,null,"No"]
[null,null,null,null,null,null,null,null,null,"No"]
[null,null,null,null,null,null,null,null,null,"No"]
[null,null,null,null,null,null,null,null,null,"No"]
[null,null,null,null,null,null,null,null,null,"No"]
[null,null,null,null,null,null,null,null,null,"No"]
[null,null,null,null,null,null,null,null,null,"No"]
[null,null,null,null,null,null,null,null,null,"No"]
[null,null,null,null,null,null,null,null,null,"No"]
[null,null,null,null,null,null,null,null,null,"No"]
[null,null,null,null,null,null,null,null,null,"No"]
[null,null,null,null,null,null,null,null,null,"No"]
[null,null,null,null,null,null,null,null,null,"No"]
[null,null,null,null,null,null,null,null,null,"No"]
[null,null,null,null,null,null,null,null,null,"No"]
[null,null,null,null,null,null,null,null,null,"No"]
[null,null,null,null,null,null,null,null,null,"No"]
[null,null,null,null,null,null,null,null,null,"No"]
[null,null,null,null,null,null,null,null,null,"No"]
[null,null,null,null,null,null,null,null,null,"No"]
[null,null,null,null,null,null,null,null,null,"No"]
[null,null,null,null,null,null,null,null,null,"No"]
[null,null,null,null,null,null,null,null,null,"No"]
[null,null,null,null,null,null,null,null,null,"No"]
[null,null,null,null,null,null,null,null,null,"No"]
[null,null,null,null,null,null,null,null,null,"No"]
[null,null,null,null,null,null,null,null,null,"No"]
[null,null,null,null,null,null,null,null,null,"No"]
[null,null,null,null,null,null,null,null,null,"No"]
[null,null,null,null,null,null,null,null,null,"No"]
[null,null,null,null,null,null,null,null,null,"No"]
[null,null,null,null,null,null,null,null,null,"No"]
[null,null,null,null,null,null,null,null,null,"No"]
[null,null,null,null,null,null,null,null,null,"No"]
[null,null,null,null,null,null,null,null,null,"No"]
[null,null,null,null,null,null,null,null,null,"No"]
[null,null,null,null,null,null,null,null,null,"No"]
[null,null,null,null,null,null,null,null,null,"No"]
[null,null,null,null,null,null,null,null,null,"No"]
[null,null,null,null,null,null,null,null,null,"No"]
[null,null,null,null,null,null,null,null,null,"No"]
[null,null,null,null,null,null,null,null,null,"No"]
[null,null,null,null,null,null,null,null,null,"No"]
[null,null,null,null,null,null,null,null,null,"No"]
[null,null,null,null,null,null,null,null,null,"No"]
[null,null,null,null,null,null,null,null,null,"No"]
[null,null,null,null,null,null,null,null,null,"No"]
[null,null,null,null,null,null,null,null,null,"No"]
[null,null,null,null,null,null,null,null,null,"No"]
[null,null,null,null,null,null,null,null,null,"No"]
[null,null,null,null,null,null,null,null,null,"No"]
[null,null,null,null,null,null,null,null,null,"No"]
[null,null,null,null,null,null,null,null,null,"No"]
[null,null,null,null,null,null,null,null,null,"No"]
[null,null,null,null,null,null,null,null,null,"No"]
[null,null,null,null,null,null,null,null,null,"No"]
[null,null,null,null,null,null,null,null,null,"No"]
[null,null,null,null,null,null,null,null,null,"No"]
[null,null,null,null,null,null,null,null,null,"No"]
[null,null,null,null,null,null,null,null,null,"No"]
[null,null,null,null,null,null,null,null,null,"No"]
[null,null,null,null,null,null,null,null,null,"No"]
[null,null,null,null,null,null,null,null,null,"No"]
[null,null,null,null,null,null,null,null,null,"No"]
[null,null,null,null,null,null,null,null,null,"No"]
[null,null,null,null,null,null,null,null,null,"No"]
[null,null,null,null,null,null,null,null,null,"No"]
[null,null,null,null,null,null,null,null,null,"No"]
[null,null,null,null,null,null,null,null,null,"No"]
[null,null,null,null,null,null,null,null,null,"No"]
[null,null,null,null,null,null,null,null,null,"No"]
[null,null,null,null,null,null,null,null,null,"No"]
[null,null,null,null,null,null,null,null,null,"No"]
[null,null,null,null,null,null,null,null,null,"No"]
[null,null,null,null,null,null,null,null,null,"No"]
[null,null,null,null,null,null,null,null,null,"No"]
[null,null,null,null,null,null,null,null,null,"No"]
[null,null,null,null,null,null,null,null,null,"No"]
[null,null,null,null,null,null,null,null,null,"No"]
[null,null,null,null,null,null,null,null,null,"No"]
[null,null,null,null,null,null,null,null,null,"No"]
[null,null,null,null,null,null,null,null,null,"No"]
[null,null,null,null,null,null,null,null,null,"No"]
[null,null,null,null,null,null,null,null,null,"No"]
[null,null,null,null,null,null,null,null,null,"No"]
[null,null,null,null,null,null,null,null,null,"No"]
[null,null,null,null,null,null,null,null,null,"No"]
[null,null,null,null,null,null,null,null,null,"No"]
[null,null,null,null,null,null,null,null,null,"No"]
[null,null,null,null,null,null,null,null,null,"No"]
[null,null,null,null,null,null,null,null,null,"No"]
[null,null,null,null,null,null,null,null,null,"No"]
[null,null,null,null,null,null,null,null,null,"No"]
[null,null,null,null,null,null,null,null,null,"No"]
[null,null,null,null,null,null,null,null,null,"No"]
[null,null,null,null,null,null,null,null,null,"No"]
[null,null,null,null,null,null,null,null,null,"No"]
[null,null,null,null,null,null,null,null,null,"No"]
[null,null,null,null,null,null,null,null,null,"No"]
[null,null,null,null,null,null,null,null,null,"No"]
[null,null,null,null,null,null,null,null,null,"No"]
[null,null,null,null,null,null,null,null,null,"No"]
[null,null,null,null,null,null,null,null,null,"No"]
[null,null,null,null,null,null,null,null,null,"No"]
[null,null,null,null,null,null,null,null,null,"No"]
[null,null,null,null,null,null,null,null,null,"No"]
[null,null,null,null,null,null,null,null,null,"No"]
[null,null,null,null,null,null,null,null,null,"No"]
[null,null,null,null,null,null,null,null,null,"No"]
[null,null,null,null,null,null,null,null,null,"No"]
[null,null,null,null,null,null,null,null,null,"No"]
[null,null,null,null,null,null,null,null,null,"No"]
[null,null,null,null,null,null,null,null,null,"No"]
[null,null,null,null,null,null,null,null,null,"No"]
[null,null,null,null,null,null,null,null,null,"No"]
[null,null,null,null,null,null,null,null,null,"No"]
[null,null,null,null,null,null,null,null,null,"No"]
[null,null,null,null,null,null,null,null,null,"No"]
[null,null,null,null,null,null,null,null,null,"No"]
[null,null,null,null,null,null,null,null,null,"No"]
[null,null,null,null,null,null,null,null,null,"No"]
[null,null,null,null,null,null,null,null,null,"No"]
[null,null,null,null,null,null,null,null,null,"No"]
[null,null,null,null,null,null,null,null,null,"No"]
[null,null,null,null,null,null,null,null,null,"No"]
[null,null,null,null,null,null,null,null,null,"No"]
[null,null,null,null,null,null,null,null,null,"No"]
[null,null,null,null,null,null,null,null,null,"No"]
[null,null,null,null,null,null,null,null,null,"No"]
[null,null,null,null,null,null,null,null,null,"No"]
[null,null,null,null,null,null,null,null,null,"No"]
[null,null,null,null,null,null,null,null,null,"No"]
[null,null,null,null,null,null,null,null,null,"No"]
[null,null,null,null,null,null,null,null,null,"No"]
[null,null,null,null,null,null,null,null,null,"No"]
[null,null,null,null,null,null,null,null,null,"No"]
[null,null,null,null,null,null,null,null,null,"No"]
[null,null,null,null,null,null,null,null,null,"No"]
[null,null,null,null,null,null,null,null,null,"No"]
[null,null,null,null,null,null,null,null,null,"No"]
[null,null,null,null,null,null,null,null,null,"No"]
[null,null,null,null,null,null,null,null,null,"No"]
[null,null,null,null,null,null,null,null,null,"No"]
[null,null,null,null,null,null,null,null,null,"No"]
[null,null,null,null,null,null,null,null,null,"No"]
[null,null,null,null,null,null,null,null,null,"No"]
[null,null,null,null,null,null,null,null,null,"No"]
[null,null,null,null,null,null,null,null,null,"No"]
[null,null,null,null,null,null,null,null,null,"No"]
[null,null,null,null,null,null,null,null,null,"No"]
[null,null,null,null,null,null,null,null,null,"No"]
[null,null,null,null,null,null,null,null,null,"No"]
[null,null,null,null,null,null,null,null,null,"No"]
[null,null,null,null,null,null,null,null,null,"No"]
[null,null,null,null,null,null,null,null,null,"No"]
[null,null,null,null,null,null,null,null,null,"No"]
[null,null,null,null,null,null,null,null,null,"No"]
[null,null,null,null,null,null,null,null,null,"No"]
[null,null,null,null,null,null,null,null,null,"No"]
[null,null,null,null,null,null,null,null,null,"No"]
[null,null,null,null,null,null,null,null,null,"No"]
[null,null,null,null,null,null,null,null,null,"No"]
[null,null,null,null,null,null,null,null,null,"No"]
[null,null,null,null,null,null,null,null,null,"No"]
[null,null,null,null,null,null,null,null,null,"No"]
[null,null,null,null,null,null,null,null,null,"No"]
[null,null,null,null,null,null,null,null,null,"No"]
[null,null,null,null,null,null,null,null,null,"No"]
[null,null,null,null,null,null,null,null,null,"No"]
[null,null,null,null,null,null,null,null,null,"No"]
[null,null,null,null,null,null,null,null,null,"No"]
[null,null,null,null,null,null,null,null,null,"No"]
[null,null,null,null,null,null,null,null,null,"No"]
[null,null,null,null,null,null,null,null,null,"No"]
[null,null,null,null,null,null,null,null,null,"No"]
[null,null,null,null,null,null,null,null,null,"No"]
[null,null,null,null,null,null,null,null,null,"No"]
[null,null,null,null,null,null,null,null,null,"No"]
[null,null,null,null,null,null,null,null,null,"No"]
[null,null,null,null,null,null,null,null,null,"No"]
[null,null,null,null,null,null,null,null,null,"No"]
[null,null,null,null,null,null,null,null,null,"No"]
[null,null,null,null,null,null,null,null,null,"No"]
[null,null,null,null,null,null,null,null,null,"No"]
[null,null,null,null,null,null,null,null,null,"No"]
[null,null,null,null,null,null,null,null,null,"No"]
[null,null,null,null,null,null,null,null,null,"No"]
[null,null,null,null,null,null,null,null,null,"No"]
[null,null,null,null,null,null,null,null,null,"No"]
[null,null,null,null,null,null,null,null,null,"No"]
[null,null,null,null,null,null,null,null,null,"No"]
[null,null,null,null,null,null,null,null,null,"No"]
[null,null,null,null,null,null,null,null,null,"No"]
[null,null,null,null,null,null,null,null,null,"No"]
[null,null,null,null,null,null,null,null,null,"No"]
[null,null,null,null,null,null,null,null,null,"No"]
[null,null,null,null,null,null,null,null,null,"No"]
[null,null,null,null,null,null,null,null,null,"No"]
[null,null,null,null,null,null,null,null,null,"No"]
[null,null,null,null,null,null,null,null,null,"No"]
[null,null,null,null,null,null,null,null,null,"No"]
[null,null,null,null,null,null,null,null,null,"No"]
[null,null,null,null,null,null,null,null,null,"No"]
[null,null,null,null,null,null,null,null,null,"No"]
[null,null,null,null,null,null,null,null,null,"No"]
[null,null,null,null,null,null,null,null,null,"No"]
[null,null,null,null,null,null,null,null,null,"No"]
[null,null,null,null,null,null,null,null,null,"No"]
[null,null,null,null,null,null,null,null,null,"No"]
[null,null,null,null,null,null,null,null,null,"No"]
[null,null,null,null,null,null,null,null,null,"No"]
[null,null,null,null,null,null,null,null,null,"No"]
[null,null,null,null,null,null,null,null,null,"No"]
[null,null,null,null,null,null,null,null,null,"No"]
[null,null,null,null,null,null,null,null,null,"No"]
[null,null,null,null,null,null,null,null,null,"No"]
[null,null,null,null,null,null,null,null,null,"No"]
[null,null,null,null,null,null,null,null,null,"No"]
[null,null,null,null,null,null,null,null,null,"No"]
[null,null,null,null,null,null,null,null,null,"No"]
[null,null,null,null,null,null,null,null,null,"No"]
[null,null,null,null,null,null,null,null,null,"No"]
[null,null,null,null,null,null,null,null,null,"No"]
[null,null,null,null,null,null,null,null,null,"No"]
[null,null,null,null,null,null,null,null,null,"No"]
[null,null,null,null,null,null,null,null,null,"No"]
[null,null,null,null,null,null,null,null,null,"No"]
[null,null,null,null,null,null,null,null,null,"No"]
[null,null,null,null,null,null,null,null,null,"No"]
[null,null,null,null,null,null,null,null,null,"No"]
[null,null,null,null,null,null,null,null,null,"No"]
[null,null,null,null,null,null,null,null,null,"No"]
[null,null,null,null,null,null,null,null,null,"No"]
[null,null,null,null,null,null,null,null,null,"No"]
[null,null,null,null,null,null,null,null,null,"No"]
[null,null,null,null,null,null,null,null,null,"No"]
[null,null,null,null,null,null,null,null,null,"No"]
[null,null,null,null,null,null,null,null,null,"No"]
[null,null,null,null,null,null,null,null,null,"No"]
[null,null,null,null,null,null,null,null,null,"No"]
[null,null,null,null,null,null,null,null,null,"No"]
[null,null,null,null,null,null,null,null,null,"No"]
[null,null,null,null,null,null,null,null,null,"No"]
[null,null,null,null,null,null,null,null,null,"No"]
[null,null,null,null,null,null,null,null,null,"No"]
[null,null,null,null,null,null,null,null,null,"No"]
[null,null,null,null,null,null,null,null,null,"No"]
[null,null,null,null,null,null,null,null,null,"No"]
[null,null,null,null,null,null,null,null,null,"No"]
[null,null,null,null,null,null,null,null,null,"No"]
[null,null,null,null,null,null,null,null,null,"No"]
[null,null,null,null,null,null,null,null,null,"No"]
[null,null,null,null,null,null,null,null,null,"No"]
[null,null,null,null,null,null,null,null,null,"No"]
[null,null,null,null,null,null,null,null,null,"No"]
[null,null,null,null,null,null,null,null,null,"No"]
[null,null,null,null,null,null,null,null,null,"No"]
[null,null,null,null,null,null,null,null,null,"No"]
[null,null,null,null,null,null,null,null,null,"No"]
[null,null,null,null,null,null,null,null,null,"No"]
[null,null,null,null,null,null,null,null,null,"No"]
[null,null,null,null,null,null,null,null,null,"No"]
[null,null,null,null,null,null,null,null,null,"No"]
[null,null,null,null,null,null,null,null,null,"No"]
[null,null,null,null,null,null,null,null,null,"No"]
[null,null,null,null,null,null,null,null,null,"No"]
[null,null,null,null,null,null,null,null,null,"No"]
[null,null,null,null,null,null,null,null,null,"No"]
[null,null,null,null,null,null,null,null,null,"No"]
[null,null,null,null,null,null,null,null,null,"No"]
[null,null,null,null,null,null,null,null,null,"No"]
[null,null,null,null,null,null,null,null,null,"No"]
[null,null,null,null,null,null,null,null,null,"No"]
[null,null,null,null,null,null,null,null,null,"No"]
[null,null,null,null,null,null,null,null,null,"No"]
[null,null,null,null,null,null,null,null,null,"No"]
[null,null,null,null,null,null,null,null,null,"No"]
[null,null,null,null,null,null,null,null,null,"No"]
[null,null,null,null,null,null,null,null,null,"No"]
[null,null,null,null,null,null,null,null,null,"No"]
[null,null,null,null,null,null,null,null,null,"No"]
[null,null,null,null,null,null,null,null,null,"No"]
[null,null,null,null,null,null,null,null,null,"No"]
[null,null,null,null,null,null,null,null,null,"No"]
[null,null,null,null,null,null,null,null,null,"No"]
[null,null,null,null,null,null,null,null,null,"No"]
[null,null,null,null,null,null,null,null,null,"No"]
[null,null,null,null,null,null,null,null,null,"No"]
[null,null,null,null,null,null,null,null,null,"No"]
[null,null,null,null,null,null,null,null,null,"No"]
[null,null,null,null,null,null,null,null,null,"No"]
[null,null,null,null,null,null,null,null,null,"No"]
[null,null,null,null,null,null,null,null,null,"No"]
[null,null,null,null,null,null,null,null,null,"No"]
[null,null,null,null,null,null,null,null,null,"No"]
[null,null,null,null,null,null,null,null,null,"No"]
[null,null,null,null,null,null,null,null,null,"No"]
[null,null,null,null,null,null,null,null,null,"No"]
[null,null,null,null,null,null,null,null,null,"No"]
[null,null,null,null,null,null,null,null,null,"No"]
[null,null,null,null,null,null,null,null,null,"No"]
[null,null,null,null,null,null,null,null,null,"No"]
[null,null,null,null,null,null,null,null,null,"No"]
[null,null,null,null,null,null,null,null,null,"No"]
[null,null,null,null,null,null,null,null,null,"No"]
[null,null,null,null,null,null,null,null,null,"No"]
[null,null,null,null,null,null,null,null,null,"No"]
[null,null,null,null,null,null,null,null,null,"No"]
[null,null,null,null,null,null,null,null,null,"No"]
[null,null,null,null,null,null,null,null,null,"No"]
[null,null,null,null,null,null,null,null,null,"No"]
[null,null,null,null,null,null,null,null,null,"No"]
[null,null,null,null,null,null,null,null,null,"No"]
[null,null,null,null,null,null,null,null,null,"No"]
[null,null,null,null,null,null,null,null,null,"No"]
[null,null,null,null,null,null,null,null,null,"No"]
[null,null,null,null,null,null,null,null,null,"No"]
[null,null,null,null,null,null,null,null,null,"No"]
[null,null,null,null,null,null,null,null,null,"No"]
[null,null,null,null,null,null,null,null,null,"No"]
[null,null,null,null,null,null,null,null,null,"No"]
[null,null,null,null,null,null,null,null,null,"No"]
[null,null,null,null,null,null,null,null,null,"No"]
[null,null,null,null,null,null,null,null,null,"No"]
[null,null,null,null,null,null,null,null,null,"No"]
[null,null,null,null,null,null,null,null,null,"No"]
[null,null,null,null,null,null,null,null,null,"No"]
[null,null,null,null,null,null,null,null,null,"No"]
[null,null,null,null,null,null,null,null,null,"No"]
[null,null,null,null,null,null,null,null,null,"No"]
[null,null,null,null,null,null,null,null,null,"No"]
[null,null,null,null,null,null,null,null,null,"No"]
[null,null,null,null,null,null,null,null,null,"No"]
[null,null,null,null,null,null,null,null,null,"No"]
[null,null,null,null,null,null,null,null,null,"No"]
[null,null,null,null,null,null,null,null,null,"No"]
[null,null,null,null,null,null,null,null,null,"No"]
[null,null,null,null,null,null,null,null,null,"No"]
[null,null,null,null,null,null,null,null,null,"No"]
[null,null,null,null,null,null,null,null,null,"No"]
[null,null,null,null,null,null,null,null,null,"No"]
[null,null,null,null,null,null,null,null,null,"No"]
[null,null,null,null,null,null,null,null,null,"No"]
[null,null,null,null,null,null,null,null,null,"No"]
[null,null,null,null,null,null,null,null,null,"No"]
[null,null,null,null,null,null,null,null,null,"No"]
[null,null,null,null,null,null,null,null,null,"No"]
[null,null,null,null,null,null,null,null,null,"No"]
[null,null,null,null,null,null,null,null,null,"No"]
[null,null,null,null,null,null,null,null,null,"No"]
[null,null,null,null,null,null,null,null,null,"No"]
[null,null,null,null,null,null,null,null,null,"No"]
[null,null,null,null,null,null,null,null,null,"No"]
[null,null,null,null,null,null,null,null,null,"No"]
[null,null,null,null,null,null,null,null,null,"No"]
[null,null,null,null,null,null,null,null,null,"No"]
[null,null,null,null,null,null,null,null,null,"No"]
[null,null,null,null,null,null,null,null,null,"No"]
[null,null,null,null,null,null,null,null,null,"No"]
[null,null,null,null,null,null,null,null,null,"No"]
[null,null,null,null,null,null,null,null,null,"No"]
[null,null,null,null,null,null,null,null,null,"No"]
[null,null,null,null,null,null,null,null,null,"No"]
[null,null,null,null,null,null,null,null,null,"No"]
[null,null,null,null,null,null,null,null,null,"No"]
[null,null,null,null,null,null,null,null,null,"No"]
[null,null,null,null,null,null,null,null,null,"No"]
[null,null,null,null,null,null,null,null,null,"No"]
[null,null,null,null,null,null,null,null,null,"No"]
[null,null,null,null,null,null,null,null,null,"No"]
[null,null,null,null,null,null,null,null,null,"No"]
[null,null,null,null,null,null,null,null,null,"No"]
[null,null,null,null,null,null,null,null,null,"No"]
[null,null,null,null,null,null,null,null,null,"No"]
[null,null,null,null,null,null,null,null,null,"No"]
[null,null,null,null,null,null,null,null,null,"No"]
[null,null,null,null,null,null,null,null,null,"No"]
[null,null,null,null,null,null,null,null,null,"No"]
[null,null,null,null,null,null,null,null,null,"No"]
[null,null,null,null,null,null,null,null,null,"No"]
[null,null,null,null,null,null,null,null,null,"No"]
[null,null,null,null,null,null,null,null,null,"No"]
[null,null,null,null,null,null,null,null,null,"No"]
[null,null,null,null,null,null,null,null,null,"No"]
[null,null,null,null,null,null,null,null,null,"No"]
[null,null,null,null,null,null,null,null,null,"No"]
[null,null,null,null,null,null,null,null,null,"No"]
[null,null,null,null,null,null,null,null,null,"No"]
[null,null,null,null,null,null,null,null,null,"No"]
[null,null,null,null,null,null,null,null,null,"No"]
[null,null,null,null,null,null,null,null,null,"No"]
[null,null,null,null,null,null,null,null,null,"No"]
[null,null,null,null,null,null,null,null,null,"No"]
[null,null,null,null,null,null,null,null,null,"No"]
[null,null,null,null,null,null,null,null,null,"No"]
[null,null,null,null,null,null,null,null,null,"No"]
[null,null,null,null,null,null,null,null,null,"No"]
[null,null,null,null,null,null,null,null,null,"No"]
[null,null,null,null,null,null,null,null,null,"No"]
[null,null,null,null,null,null,null,null,null,"No"]
[null,null,null,null,null,null,null,null,null,"No"]
[null,null,null,null,null,null,null,null,null,"No"]
[null,null,null,null,null,null,null,null,null,"No"]
[null,null,null,null,null,null,null,null,null,"No"]
[null,null,null,null,null,null,null,null,null,"No"]
[null,null,null,null,null,null,null,null,null,"No"]
[null,null,null,null,null,null,null,null,null,"No"]
[null,null,null,null,null,null,null,null,null,"No"]
[null,null,null,null,null,null,null,null,null,"No"]
[null,null,null,null,null,null,null,null,null,"No"]
[null,null,null,null,null,null,null,null,null,"No"]
[null,null,null,null,null,null,null,null,null,"No"]
[null,null,null,null,null,null,null,null,null,"No"]
[null,null,null,null,null,null,null,null,null,"No"]
[null,null,null,null,null,null,null,null,null,"No"]
[null,null,null,null,null,null,null,null,null,"No"]
[null,null,null,null,null,null,null,null,null,"No"]
[null,null,null,null,null,null,null,null,null,"No"]
[null,null,null,null,null,null,null,null,null,"No"]
[null,null,null,null,null,null,null,null,null,"No"]
[null,null,null,null,null,null,null,null,null,"No"]
[null,null,null,null,null,null,null,null,null,"No"]
[null,null,null,null,null,null,null,null,null,"No"]
[null,null,null,null,null,null,null,null,null,"No"]
[null,null,null,null,null,null,null,null,null,"No"]
[null,null,null,null,null,null,null,null,null,"No"]
[null,null,null,null,null,null,null,null,null,"No"]
[null,null,null,null,null,null,null,null,null,"No"]
[null,null,null,null,null,null,null,null,null,"No"]
[null,null,null,null,null,null,null,null,null,"No"]
[null,null,null,null,null,null,null,null,null,"No"]
[null,null,null,null,null,null,null,null,null,"No"]
[null,null,null,null,null,null,null,null,null,"No"]
[null,null,null,null,null,null,null,null,null,"No"]
[null,null,null,null,null,null,null,null,null,"No"]
[null,null,null,null,null,null,null,null,null,"No"]
[null,null,null,null,null,null,null,null,null,"No"]
[null,null,null,null,null,null,null,null,null,"No"]
[null,null,null,null,null,null,null,null,null,"No"]
[null,null,null,null,null,null,null,null,null,"No"]
[null,null,null,null,null,null,null,null,null,"No"]
[null,null,null,null,null,null,null,null,null,"No"]
[null,null,null,null,null,null,null,null,null,"No"]
[null,null,null,null,null,null,null,null,null,"No"]
[null,null,null,null,null,null,null,null,null,"No"]
[null,null,null,null,null,null,null,null,null,"No"]
[null,null,null,null,null,null,null,null,null,"No"]
[null,null,null,null,null,null,null,null,null,"No"]
[null,null,null,null,null,null,null,null,null,"No"]
[null,null,null,null,null,null,null,null,null,"No"]
[null,null,null,null,null,null,null,null,null,"No"]
[null,null,null,null,null,null,null,null,null,"No"]
[null,null,null,null,null,null,null,null,null,"No"]
[null,null,null,null,null,null,null,null,null,"No"]
[null,null,null,null,null,null,null,null,null,"No"]
[null,null,null,null,null,null,null,null,null,"No"]
[null,null,null,null,null,null,null,null,null,"No"]
[null,null,null,null,null,null,null,null,null,"No"]
[null,null,null,null,null,null,null,null,null,"No"]
[null,null,null,null,null,null,null,null,null,"No"]
[null,null,null,null,null,null,null,null,null,"No"]
[null,null,null,null,null,null,null,null,null,"No"]
[null,null,null,null,null,null,null,null,null,"No"]
[null,null,null,null,null,null,null,null,null,"No"]
[null,null,null,null,null,null,null,null,null,"No"]
[null,null,null,null,null,null,null,null,null,"No"]
[null,null,null,null,null,null,null,null,null,"No"]
[null,null,null,null,null,null,null,null,null,"No"]
[null,null,null,null,null,null,null,null,null,"No"]
[null,null,null,null,null,null,null,null,null,"No"]
[null,null,null,null,null,null,null,null,null,"No"]
[null,null,null,null,null,null,null,null,null,"No"]
[null,null,null,null,null,null,null,null,null,"No"]
[null,null,null,null,null,null,null,null,null,"No"]
[null,null,null,null,null,null,null,null,null,"No"]
[null,null,null,null,null,null,null,null,null,"No"]
[null,null,null,null,null,null,null,null,null,"No"]
[null,null,null,null,null,null,null,null,null,"No"]
[null,null,null,null,null,null,null,null,null,"No"]
[null,null,null,null,null,null,null,null,null,"No"]
[null,null,null,null,null,null,null,null,null,"No"]
[null,null,null,null,null,null,null,null,null,"No"]
[null,null,null,null,null,null,null,null,null,"No"]
[null,null,null,null,null,null,null,null,null,"No"]
[null,null,null,null,null,null,null,null,null,"No"]
[null,null,null,null,null,null,null,null,null,"No"]
[null,null,null,null,null,null,null,null,null,"No"]
[null,null,null,null,null,null,null,null,null,"No"]
[null,null,null,null,null,null,null,null,null,"No"]
[null,null,null,null,null,null,null,null,null,"No"]
[null,null,null,null,null,null,null,null,null,"No"]
[null,null,null,null,null,null,null,null,null,"No"]
[null,null,null,null,null,null,null,null,null,"No"]
[null,null,null,null,null,null,null,null,null,"No"]
[null,null,null,null,null,null,null,null,null,"No"]
[null,null,null,null,null,null,null,null,null,"No"]
[null,null,null,null,null,null,null,null,null,"No"]
[null,null,null,null,null,null,null,null,null,"No"]
[null,null,null,null,null,null,null,null,null,"No"]
[null,null,null,null,null,null,null,null,null,"No"]
[null,null,null,null,null,null,null,null,null,"No"]
[null,null,null,null,null,null,null,null,null,"No"]
[null,null,null,null,null,null,null,null,null,"No"]
[null,null,null,null,null,null,null,null,null,"No"]
[null,null,null,null,null,null,null,null,null,"No"]
[null,null,null,null,null,null,null,null,null,"No"]
[null,null,null,null,null,null,null,null,null,"No"]
[null,null,null,null,null,null,null,null,null,"No"]
[null,null,null,null,null,null,null,null,null,"No"]
[null,null,null,null,null,null,null,null,null,"No"]
[null,null,null,null,null,null,null,null,null,"No"]
[null,null,null,null,null,null,null,null,null,"No"]
[null,null,null,null,null,null,null,null,null,"No"]
[null,null,null,null,null,null,null,null,null,"No"]
[null,null,null,null,null,null,null,null,null,"No"]
[null,null,null,null,null,null,null,null,null,"No"]
[null,null,null,null,null,null,null,null,null,"No"]
[null,null,null,null,null,null,null,null,null,"No"]
[null,null,null,null,null,null,null,null,null,"No"]
[null,null,null,null,null,null,null,null,null,"No"]
[null,null,null,null,null,null,null,null,null,"No"]
[null,null,null,null,null,null,null,null,null,"No"]
[null,null,null,null,null,null,null,null,null,"No"]
[null,null,null,null,null,null,null,null,null,"No"]
[null,null,null,null,null,null,null,null,null,"No"]
[null,null,null,null,null,null,null,null,null,"No"]
[null,null,null,null,null,null,null,null,null,"No"]
[null,null,null,null,null,null,null,null,null,"No"]
[null,null,null,null,null,null,null,null,null,"No"]
[null,null,null,null,null,null,null,null,null,"No"]
[null,null,null,null,null,null,null,null,null,"No"]
[null,null,null,null,null,null,null,null,null,"No"]
[null,null,null,null,null,null,null,null,null,"No"]
[null,null,null,null,null,null,null,null,null,"No"]
[null,null,null,null,null,null,null,null,null,"No"]
[null,null,null,null,null,null,null,null,null,"No"]
[null,null,null,null,null,null,null,null,null,"No"]
[null,null,null,null,null,null,null,null,null,"No"]
[null,null,null,null,null,null,null,null,null,"No"]
[null,null,null,null,null,null,null,null,null,"No"]
[null,null,null,null,null,null,null,null,null,"No"]
[null,null,null,null,null,null,null,null,null,"No"]
[null,null,null,null,null,null,null,null,null,"No"]
[null,null,null,null,null,null,null,null,null,"No"]
[null,null,null,null,null,null,null,null,null,"No"]
[null,null,null,null,null,null,null,null,null,"No"]
[null,null,null,null,null,null,null,null,null,"No"]
[null,null,null,null,null,null,null,null,null,"No"]
[null,null,null,null,null,null,null,null,null,"No"]
[null,null,null,null,null,null,null,null,null,"No"]
[null,null,null,null,null,null,null,null,null,"No"]
[null,null,null,null,null,null,null,null,null,"No"]
[null,null,null,null,null,null,null,null,null,"No"]
[null,null,null,null,null,null,null,null,null,"No"]
[null,null,null,null,null,null,null,null,null,"No"]
[null,null,null,null,null,null,null,null,null,"No"]
[null,null,null,null,null,null,null,null,null,"No"]
[null,null,null,null,null,null,null,null,null,"No"]
[null,null,null,null,null,null,null,null,null,"No"]
[null,null,null,null,null,null,null,null,null,"No"]
[null,null,null,null,null,null,null,null,null,"No"]
[null,null,null,null,null,null,null,null,null,"No"]
[null,null,null,null,null,null,null,null,null,"No"]
[null,null,null,null,null,null,null,null,null,"No"]
[null,null,null,null,null,null,null,null,null,"No"]
[null,null,null,null,null,null,null,null,null,"No"]
[null,null,null,null,null,null,null,null,null,"No"]
[null,null,null,null,null,null,null,null,null,"No"]
[null,null,null,null,null,null,null,null,null,"No"]
[null,null,null,null,null,null,null,null,null,"No"]
[null,null,null,null,null,null,null,null,null,"No"]
[null,null,null,null,null,null,null,null,null,"No"]
[null,null,null,null,null,null,null,null,null,"No"]
[null,null,null,null,null,null,null,null,null,"No"]
[null,null,null,null,null,null,null,null,null,"No"]
[null,null,null,null,null,null,null,null,null,"No"]
[null,null,null,null,null,null,null,null,null,"No"]
[null,null,null,null,null,null,null,null,null,"No"]
[null,null,null,null,null,null,null,null,null,"No"]
[null,null,null,null,null,null,null,null,null,"No"]
[null,null,null,null,null,null,null,null,null,"No"]
[null,null,null,null,null,null,null,null,null,"No"]
[null,null,null,null,null,null,null,null,null,"No"]
[null,null,null,null,null,null,null,null,null,"No"]
[null,null,null,null,null,null,null,null,null,"No"]
[null,null,null,null,null,null,null,null,null,"No"]
[null,null,null,null,null,null,null,null,null,"No"]

{"sheet":"Fleet","index":11,"n_rows":1300,"n_cols":19,"rows_kept":1300,"cut":false,"hidden":false,"merged":[[18,0,18,7],[18,11,18,14],[0,11,0,15],[1,11,1,14],[2,11,2,14],[3,11,3,14],[4,10,4,13],[5,10,5,13]]}
[null,null,null,null,null,null,null,null,null,null,null,"Specified Thresholds",null,null,null,null,null,null,"Yes"]
[null,null,null,null,null,null,null,null,null,null,null,"Potentially Exposed Population",null,null,null,{"$f":"Thresholds!C44","v":302},null,null,"No"]
[null,null,null,null,null,null,null,null,null,null,null,"Property Loss",null,null,null,{"$f":"Thresholds!C45","v":100724172}]
[null,null,null,null,null,null,null,null,null,null,null,"Mission Importance",null,null,null,{"$f":"Thresholds!C46","v":"No"}]
[]
[]
[]
[]
[]
[]
[]
[]
[]
[]
[]
[]
[]
[]
["FLEET",null,null,null,null,null,null,null,null,null,null,"CRITICALITY"]
["Asset ID","Quantity","Max Occupancy/ Vehicle","Avg Replacement Cost/Vehicle",null,null,"Comments",null,null,"Manually mark as critical?",null,"Potentially Exposed Population","Property Loss","Mission Importance","Manual Override"]
["Buses",100,100,100000,null,null,null,null,"No","No"]
["Red Line car",120,800,250000,null,null,null,null,"No","No",null,"Y"]
["Blue Line",120,800,250000,null,null,null,null,"No","No",null,"Y"]
["Orange Line car",120,800,250000,null,null,null,null,"No","No",null,"Y"]
["Silver Line tandems",80,125,300000,null,null,null,null,"No","No"]
["Heavy rail  passenger",240,400,500000,null,null,null,null,"No","No",null,"Y","Y"]
["Heavy Rail control car",42,400,500000,null,null,null,null,"Yes","Yes",null,"Y",null,null,"Y"]
["Diesel Engine",40,2,600000,null,null,null,null,"No","No"]
[null,null,null,null,null,null,null,null,null,"No"]
[null,null,null,null,null,null,null,null,null,"No"]
[null,null,null,null,null,null,null,null,null,"No"]
[null,null,null,null,null,null,null,null,null,"No"]
[null,null,null,null,null,null,null,null,null,"No"]
[null,null,null,null,null,null,null,null,null,"No"]
[null,null,null,null,null,null,null,null,null,"No"]
[null,null,null,null,null,null,null,null,null,"No"]
[null,null,null,null,null,null,null,null,null,"No"]
[null,null,null,null,null,null,null,null,null,"No"]
[null,null,null,null,null,null,null,null,null,"No"]
[null,null,null,null,null,null,null,null,null,"No"]
[null,null,null,null,null,null,null,null,null,"No"]
[null,null,null,null,null,null,null,null,null,"No"]
[null,null,null,null,null,null,null,null,null,"No"]
[null,null,null,null,null,null,null,null,null,"No"]
[null,null,null,null,null,null,null,null,null,"No"]
[null,null,null,null,null,null,null,null,null,"No"]
[null,null,null,null,null,null,null,null,null,"No"]
[null,null,null,null,null,null,null,null,null,"No"]
[null,null,null,null,null,null,null,null,null,"No"]
[null,null,null,null,null,null,null,null,null,"No"]
[null,null,null,null,null,null,null,null,null,"No"]
[null,null,null,null,null,null,null,null,null,"No"]
[null,null,null,null,null,null,null,null,null,"No"]
[null,null,null,null,null,null,null,null,null,"No"]
[null,null,null,null,null,null,null,null,null,"No"]
[null,null,null,null,null,null,null,null,null,"No"]
[null,null,null,null,null,null,null,null,null,"No"]
[null,null,null,null,null,null,null,null,null,"No"]
[null,null,null,null,null,null,null,null,null,"No"]
[null,null,null,null,null,null,null,null,null,"No"]
[null,null,null,null,null,null,null,null,null,"No"]
[null,null,null,null,null,null,null,null,null,"No"]
[null,null,null,null,null,null,null,null,null,"No"]
[null,null,null,null,null,null,null,null,null,"No"]
[null,null,null,null,null,null,null,null,null,"No"]
[null,null,null,null,null,null,null,null,null,"No"]
[null,null,null,null,null,null,null,null,null,"No"]
[null,null,null,null,null,null,null,null,null,"No"]
[null,null,null,null,null,null,null,null,null,"No"]
[null,null,null,null,null,null,null,null,null,"No"]
[null,null,null,null,null,null,null,null,null,"No"]
[null,null,null,null,null,null,null,null,null,"No"]
[null,null,null,null,null,null,null,null,null,"No"]
[null,null,null,null,null,null,null,null,null,"No"]
[null,null,null,null,null,null,null,null,null,"No"]
[null,null,null,null,null,null,null,null,null,"No"]
[null,null,null,null,null,null,null,null,null,"No"]
[null,null,null,null,null,null,null,null,null,"No"]
[null,null,null,null,null,null,null,null,null,"No"]
[null,null,null,null,null,null,null,null,null,"No"]
[null,null,null,null,null,null,null,null,null,"No"]
[null,null,null,null,null,null,null,null,null,"No"]
[null,null,null,null,null,null,null,null,null,"No"]
[null,null,null,null,null,null,null,null,null,"No"]
[null,null,null,null,null,null,null,null,null,"No"]
[null,null,null,null,null,null,null,null,null,"No"]
[null,null,null,null,null,null,null,null,null,"No"]
[null,null,null,null,null,null,null,null,null,"No"]
[null,null,null,null,null,null,null,null,null,"No"]
[null,null,null,null,null,null,null,null,null,"No"]
[null,null,null,null,null,null,null,null,null,"No"]
[null,null,null,null,null,null,null,null,null,"No"]
[null,null,null,null,null,null,null,null,null,"No"]
[null,null,null,null,null,null,null,null,null,"No"]
[null,null,null,null,null,null,null,null,null,"No"]
[null,null,null,null,null,null,null,null,null,"No"]
[null,null,null,null,null,null,null,null,null,"No"]
[null,null,null,null,null,null,null,null,null,"No"]
[null,null,null,null,null,null,null,null,null,"No"]
[null,null,null,null,null,null,null,null,null,"No"]
[null,null,null,null,null,null,null,null,null,"No"]
[null,null,null,null,null,null,null,null,null,"No"]
[null,null,null,null,null,null,null,null,null,"No"]
[null,null,null,null,null,null,null,null,null,"No"]
[null,null,null,null,null,null,null,null,null,"No"]
[null,null,null,null,null,null,null,null,null,"No"]
[null,null,null,null,null,null,null,null,null,"No"]
[null,null,null,null,null,null,null,null,null,"No"]
[null,null,null,null,null,null,null,null,null,"No"]
[null,null,null,null,null,null,null,null,null,"No"]
[null,null,null,null,null,null,null,null,null,"No"]
[null,null,null,null,null,null,null,null,null,"No"]
[null,null,null,null,null,null,null,null,null,"No"]
[null,null,null,null,null,null,null,null,null,"No"]
[null,null,null,null,null,null,null,null,null,"No"]
[null,null,null,null,null,null,null,null,null,"No"]
[null,null,null,null,null,null,null,null,null,"No"]
[null,null,null,null,null,null,null,null,null,"No"]
[null,null,null,null,null,null,null,null,null,"No"]
[null,null,null,null,null,null,null,null,null,"No"]
[null,null,null,null,null,null,null,null,null,"No"]
[null,null,null,null,null,null,null,null,null,"No"]
[null,null,null,null,null,null,null,null,null,"No"]
[null,null,null,null,null,null,null,null,null,"No"]
[null,null,null,null,null,null,null,null,null,"No"]
[null,null,null,null,null,null,null,null,null,"No"]
[null,null,null,null,null,null,null,null,null,"No"]
[null,null,null,null,null,null,null,null,null,"No"]
[null,null,null,null,null,null,null,null,null,"No"]
[null,null,null,null,null,null,null,null,null,"No"]
[null,null,null,null,null,null,null,null,null,"No"]
[null,null,null,null,null,null,null,null,null,"No"]
[null,null,null,null,null,null,null,null,null,"No"]
[null,null,null,null,null,null,null,null,null,"No"]
[null,null,null,null,null,null,null,null,null,"No"]
[null,null,null,null,null,null,null,null,null,"No"]
[null,null,null,null,null,null,null,null,null,"No"]
[null,null,null,null,null,null,null,null,null,"No"]
[null,null,null,null,null,null,null,null,null,"No"]
[null,null,null,null,null,null,null,null,null,"No"]
[null,null,null,null,null,null,null,null,null,"No"]
[null,null,null,null,null,null,null,null,null,"No"]
[null,null,null,null,null,null,null,null,null,"No"]
[null,null,null,null,null,null,null,null,null,"No"]
[null,null,null,null,null,null,null,null,null,"No"]
[null,null,null,null,null,null,null,null,null,"No"]
[null,null,null,null,null,null,null,null,null,"No"]
[null,null,null,null,null,null,null,null,null,"No"]
[null,null,null,null,null,null,null,null,null,"No"]
[null,null,null,null,null,null,null,null,null,"No"]
[null,null,null,null,null,null,null,null,null,"No"]
[null,null,null,null,null,null,null,null,null,"No"]
[null,null,null,null,null,null,null,null,null,"No"]
[null,null,null,null,null,null,null,null,null,"No"]
[null,null,null,null,null,null,null,null,null,"No"]
[null,null,null,null,null,null,null,null,null,"No"]
[null,null,null,null,null,null,null,null,null,"No"]
[null,null,null,null,null,null,null,null,null,"No"]
[null,null,null,null,null,null,null,null,null,"No"]
[null,null,null,null,null,null,null,null,null,"No"]
[null,null,null,null,null,null,null,null,null,"No"]
[null,null,null,null,null,null,null,null,null,"No"]
[null,null,null,null,null,null,null,null,null,"No"]
[null,null,null,null,null,null,null,null,null,"No"]
[null,null,null,null,null,null,null,null,null,"No"]
[null,null,null,null,null,null,null,null,null,"No"]
[null,null,null,null,null,null,null,null,null,"No"]
[null,null,null,null,null,null,null,null,null,"No"]
[null,null,null,null,null,null,null,null,null,"No"]
[null,null,null,null,null,null,null,null,null,"No"]
[null,null,null,null,null,null,null,null,null,"No"]
[null,null,null,null,null,null,null,null,null,"No"]
[null,null,null,null,null,null,null,null,null,"No"]
[null,null,null,null,null,null,null,null,null,"No"]
[null,null,null,null,null,null,null,null,null,"No"]
[null,null,null,null,null,null,null,null,null,"No"]
[null,null,null,null,null,null,null,null,null,"No"]
[null,null,null,null,null,null,null,null,null,"No"]
[null,null,null,null,null,null,null,null,null,"No"]
[null,null,null,null,null,null,null,null,null,"No"]
[null,null,null,null,null,null,null,null,null,"No"]
[null,null,null,null,null,null,null,null,null,"No"]
[null,null,null,null,null,null,null,null,null,"No"]
[null,null,null,null,null,null,null,null,null,"No"]
[null,null,null,null,null,null,null,null,null,"No"]
[null,null,null,null,null,null,null,null,null,"No"]
[null,null,null,null,null,null,null,null,null,"No"]
[null,null,null,null,null,null,null,null,null,"No"]
[null,null,null,null,null,null,null,null,null,"No"]
[null,null,null,null,null,null,null,null,null,"No"]
[null,null,null,null,null,null,null,null,null,"No"]
[null,null,null,null,null,null,null,null,null,"No"]
[null,null,null,null,null,null,null,null,null,"No"]
[null,null,null,null,null,null,null,null,null,"No"]
[null,null,null,null,null,null,null,null,null,"No"]
[null,null,null,null,null,null,null,null,null,"No"]
[null,null,null,null,null,null,null,null,null,"No"]
[null,null,null,null,null,null,null,null,null,"No"]
[null,null,null,null,null,null,null,null,null,"No"]
[null,null,null,null,null,null,null,null,null,"No"]
[null,null,null,null,null,null,null,null,null,"No"]
[null,null,null,null,null,null,null,null,null,"No"]
[null,null,null,null,null,null,null,null,null,"No"]
[null,null,null,null,null,null,null,null,null,"No"]
[null,null,null,null,null,null,null,null,null,"No"]
[null,null,null,null,null,null,null,null,null,"No"]
[null,null,null,null,null,null,null,null,null,"No"]
[null,null,null,null,null,null,null,null,null,"No"]
[null,null,null,null,null,null,null,null,null,"No"]
[null,null,null,null,null,null,null,null,null,"No"]
[null,null,null,null,null,null,null,null,null,"No"]
[null,null,null,null,null,null,null,null,null,"No"]
[null,null,null,null,null,null,null,null,null,"No"]
[null,null,null,null,null,null,null,null,null,"No"]
[null,null,null,null,null,null,null,null,null,"No"]
[null,null,null,null,null,null,null,null,null,"No"]
[null,null,null,null,null,null,null,null,null,"No"]
[null,null,null,null,null,null,null,null,null,"No"]
[null,null,null,null,null,null,null,null,null,"No"]
[null,null,null,null,null,null,null,null,null,"No"]
[null,null,null,null,null,null,null,null,null,"No"]
[null,null,null,null,null,null,null,null,null,"No"]
[null,null,null,null,null,null,null,null,null,"No"]
[null,null,null,null,null,null,null,null,null,"No"]
[null,null,null,null,null,null,null,null,null,"No"]
[null,null,null,null,null,null,null,null,null,"No"]
[null,null,null,null,null,null,null,null,null,"No"]
[null,null,null,null,null,null,null,null,null,"No"]
[null,null,null,null,null,null,null,null,null,"No"]
[null,null,null,null,null,null,null,null,null,"No"]
[null,null,null,null,null,null,null,null,null,"No"]
[null,null,null,null,null,null,null,null,null,"No"]
[null,null,null,null,null,null,null,null,null,"No"]
[null,null,null,null,null,null,null,null,null,"No"]
[null,null,null,null,null,null,null,null,null,"No"]
[null,null,null,null,null,null,null,null,null,"No"]
[null,null,null,null,null,null,null,null,null,"No"]
[null,null,null,null,null,null,null,null,null,"No"]
[null,null,null,null,null,null,null,null,null,"No"]
[null,null,null,null,null,null,null,null,null,"No"]
[null,null,null,null,null,null,null,null,null,"No"]
[null,null,null,null,null,null,null,null,null,"No"]
[null,null,null,null,null,null,null,null,null,"No"]
[null,null,null,null,null,null,null,null,null,"No"]
[null,null,null,null,null,null,null,null,null,"No"]
[null,null,null,null,null,null,null,null,null,"No"]
[null,null,null,null,null,null,null,null,null,"No"]
[null,null,null,null,null,null,null,null,null,"No"]
[null,null,null,null,null,null,null,null,null,"No"]
[null,null,null,null,null,null,null,null,null,"No"]
[null,null,null,null,null,null,null,null,null,"No"]
[null,null,null,null,null,null,null,null,null,"No"]
[null,null,null,null,null,null,null,null,null,"No"]
[null,null,null,null,null,null,null,null,null,"No"]
[null,null,null,null,null,null,null,null,null,"No"]
[null,null,null,null,null,null,null,null,null,"No"]
[null,null,null,null,null,null,null,null,null,"No"]
[null,null,null,null,null,null,null,null,null,"No"]
[null,null,null,null,null,null,null,null,null,"No"]
[null,null,null,null,null,null,null,null,null,"No"]
[null,null,null,null,null,null,null,null,null,"No"]
[null,null,null,null,null,null,null,null,null,"No"]
[null,null,null,null,null,null,null,null,null,"No"]
[null,null,null,null,null,null,null,null,null,"No"]
[null,null,null,null,null,null,null,null,null,"No"]
[null,null,null,null,null,null,null,null,null,"No"]
[null,null,null,null,null,null,null,null,null,"No"]
[null,null,null,null,null,null,null,null,null,"No"]
[null,null,null,null,null,null,null,null,null,"No"]
[null,null,null,null,null,null,null,null,null,"No"]
[null,null,null,null,null,null,null,null,null,"No"]
[null,null,null,null,null,null,null,null,null,"No"]
[null,null,null,null,null,null,null,null,null,"No"]
[null,null,null,null,null,null,null,null,null,"No"]
[null,null,null,null,null,null,null,null,null,"No"]
[null,null,null,null,null,null,null,null,null,"No"]
[null,null,null,null,null,null,null,null,null,"No"]
[null,null,null,null,null,null,null,null,null,"No"]
[null,null,null,null,null,null,null,null,null,"No"]
[null,null,null,null,null,null,null,null,null,"No"]
[null,null,null,null,null,null,null,null,null,"No"]
[null,null,null,null,null,null,null,null,null,"No"]
[null,null,null,null,null,null,null,null,null,"No"]
[null,null,null,null,null,null,null,null,null,"No"]
[null,null,null,null,null,null,null,null,null,"No"]
[null,null,null,null,null,null,null,null,null,"No"]
[null,null,null,null,null,null,null,null,null,"No"]
[null,null,null,null,null,null,null,null,null,"No"]
[null,null,null,null,null,null,null,null,null,"No"]
[null,null,null,null,null,null,null,null,null,"No"]
[null,null,null,null,null,null,null,null,null,"No"]
[null,null,null,null,null,null,null,null,null,"No"]
[null,null,null,null,null,null,null,null,null,"No"]
[null,null,null,null,null,null,null,null,null,"No"]
[null,null,null,null,null,null,null,null,null,"No"]
[null,null,null,null,null,null,null,null,null,"No"]
[null,null,null,null,null,null,null,null,null,"No"]
[null,null,null,null,null,null,null,null,null,"No"]
[null,null,null,null,null,null,null,null,null,"No"]
[null,null,null,null,null,null,null,null,null,"No"]
[null,null,null,null,null,null,null,null,null,"No"]
[null,null,null,null,null,null,null,null,null,"No"]
[null,null,null,null,null,null,null,null,null,"No"]
[null,null,null,null,null,null,null,null,null,"No"]
[null,null,null,null,null,null,null,null,null,"No"]
[null,null,null,null,null,null,null,null,null,"No"]
[null,null,null,null,null,null,null,null,null,"No"]
[null,null,null,null,null,null,null,null,null,"No"]
[null,null,null,null,null,null,null,null,null,"No"]
[null,null,null,null,null,null,null,null,null,"No"]
[null,null,null,null,null,null,null,null,null,"No"]
[null,null,null,null,null,null,null,null,null,"No"]
[null,null,null,null,null,null,null,null,null,"No"]
[null,null,null,null,null,null,null,null,null,"No"]
[null,null,null,null,null,null,null,null,null,"No"]
[null,null,null,null,null,null,null,null,null,"No"]
[null,null,null,null,null,null,null,null,null,"No"]
[null,null,null,null,null,null,null,null,null,"No"]
[null,null,null,null,null,null,null,null,null,"No"]
[null,null,null,null,null,null,null,null,null,"No"]
[null,null,null,null,null,null,null,null,null,"No"]
[null,null,null,null,null,null,null,null,null,"No"]
[null,null,null,null,null,null,null,null,null,"No"]
[null,null,null,null,null,null,null,null,null,"No"]
[null,null,null,null,null,null,null,null,null,"No"]
[null,null,null,null,null,null,null,null,null,"No"]
[null,null,null,null,null,null,null,null,null,"No"]
[null,null,null,null,null,null,null,null,null,"No"]
[null,null,null,null,null,null,null,null,null,"No"]
[null,null,null,null,null,null,null,null,null,"No"]
[null,null,null,null,null,null,null,null,null,"No"]
[null,null,null,null,null,null,null,null,null,"No"]
[null,null,null,null,null,null,null,null,null,"No"]
[null,null,null,null,null,null,null,null,null,"No"]
[null,null,null,null,null,null,null,null,null,"No"]
[null,null,null,null,null,null,null,null,null,"No"]
[null,null,null,null,null,null,null,null,null,"No"]
[null,null,null,null,null,null,null,null,null,"No"]
[null,null,null,null,null,null,null,null,null,"No"]
[null,null,null,null,null,null,null,null,null,"No"]
[null,null,null,null,null,null,null,null,null,"No"]
[null,null,null,null,null,null,null,null,null,"No"]
[null,null,null,null,null,null,null,null,null,"No"]
[null,null,null,null,null,null,null,null,null,"No"]
[null,null,null,null,null,null,null,null,null,"No"]
[null,null,null,null,null,null,null,null,null,"No"]
[null,null,null,null,null,null,null,null,null,"No"]
[null,null,null,null,null,null,null,null,null,"No"]
[null,null,null,null,null,null,null,null,null,"No"]
[null,null,null,null,null,null,null,null,null,"No"]
[null,null,null,null,null,null,null,null,null,"No"]
[null,null,null,null,null,null,null,null,null,"No"]
[null,null,null,null,null,null,null,null,null,"No"]
[null,null,null,null,null,null,null,null,null,"No"]
[null,null,null,null,null,null,null,null,null,"No"]
[null,null,null,null,null,null,null,null,null,"No"]
[null,null,null,null,null,null,null,null,null,"No"]
[null,null,null,null,null,null,null,null,null,"No"]
[null,null,null,null,null,null,null,null,null,"No"]
[null,null,null,null,null,null,null,null,null,"No"]
[null,null,null,null,null,null,null,null,null,"No"]
[null,null,null,null,null,null,null,null,null,"No"]
[null,null,null,null,null,null,null,null,null,"No"]
[null,null,null,null,null,null,null,null,null,"No"]
[null,null,null,null,null,null,null,null,null,"No"]
[null,null,null,null,null,null,null,null,null,"No"]
[null,null,null,null,null,null,null,null,null,"No"]
[null,null,null,null,null,null,null,null,null,"No"]
[null,null,null,null,null,null,null,null,null,"No"]
[null,null,null,null,null,null,null,null,null,"No"]
[null,null,null,null,null,null,null,null,null,"No"]
[null,null,null,null,null,null,null,null,null,"No"]
[null,null,null,null,null,null,null,null,null,"No"]
[null,null,null,null,null,null,null,null,null,"No"]
[null,null,null,null,null,null,null,null,null,"No"]
[null,null,null,null,null,null,null,null,null,"No"]
[null,null,null,null,null,null,null,null,null,"No"]
[null,null,null,null,null,null,null,null,null,"No"]
[null,null,null,null,null,null,null,null,null,"No"]
[null,null,null,null,null,null,null,null,null,"No"]
[null,null,null,null,null,null,null,null,null,"No"]
[null,null,null,null,null,null,null,null,null,"No"]
[null,null,null,null,null,null,null,null,null,"No"]
[null,null,null,null,null,null,null,null,null,"No"]
[null,null,null,null,null,null,null,null,null,"No"]
[null,null,null,null,null,null,null,null,null,"No"]
[null,null,null,null,null,null,null,null,null,"No"]
[null,null,null,null,null,null,null,null,null,"No"]
[null,null,null,null,null,null,null,null,null,"No"]
[null,null,null,null,null,null,null,null,null,"No"]
[null,null,null,null,null,null,null,null,null,"No"]
[null,null,null,null,null,null,null,null,null,"No"]
[null,null,null,null,null,null,null,null,null,"No"]
[null,null,null,null,null,null,null,null,null,"No"]
[null,null,null,null,null,null,null,null,null,"No"]
[null,null,null,null,null,null,null,null,null,"No"]
[null,null,null,null,null,null,null,null,null,"No"]
[null,null,null,null,null,null,null,null,null,"No"]
[null,null,null,null,null,null,null,null,null,"No"]
[null,null,null,null,null,null,null,null,null,"No"]
[null,null,null,null,null,null,null,null,null,"No"]
[null,null,null,null,null,null,null,null,null,"No"]
[null,null,null,null,null,null,null,null,null,"No"]
[null,null,null,null,null,null,null,null,null,"No"]
[null,null,null,null,null,null,null,null,null,"No"]
[null,null,null,null,null,null,null,null,null,"No"]
[null,null,null,null,null,null,null,null,null,"No"]
[null,null,null,null,null,null,null,null,null,"No"]
[null,null,null,null,null,null,null,null,null,"No"]
[null,null,null,null,null,null,null,null,null,"No"]
[null,null,null,null,null,null,null,null,null,"No"]
[null,null,null,null,null,null,null,null,null,"No"]
[null,null,null,null,null,null,null,null,null,"No"]
[null,null,null,null,null,null,null,null,null,"No"]
[null,null,null,null,null,null,null,null,null,"No"]
[null,null,null,null,null,null,null,null,null,"No"]
[null,null,null,null,null,null,null,null,null,"No"]
[null,null,null,null,null,null,null,null,null,"No"]
[null,null,null,null,null,null,null,null,null,"No"]
[null,null,null,null,null,null,null,null,null,"No"]
[null,null,null,null,null,null,null,null,null,"No"]
[null,null,null,null,null,null,null,null,null,"No"]
[null,null,null,null,null,null,null,null,null,"No"]
[null,null,null,null,null,null,null,null,null,"No"]
[null,null,null,null,null,null,null,null,null,"No"]
[null,null,null,null,null,null,null,null,null,"No"]
[null,null,null,null,null,null,null,null,null,"No"]
[null,null,null,null,null,null,null,null,null,"No"]
[null,null,null,null,null,null,null,null,null,"No"]
[null,null,null,null,null,null,null,null,null,"No"]
[null,null,null,null,null,null,null,null,null,"No"]
[null,null,null,null,null,null,null,null,null,"No"]
[null,null,null,null,null,null,null,null,null,"No"]
[null,null,null,null,null,null,null,null,null,"No"]
[null,null,null,null,null,null,null,null,null,"No"]
[null,null,null,null,null,null,null,null,null,"No"]
[null,null,null,null,null,null,null,null,null,"No"]
[null,null,null,null,null,null,null,null,null,"No"]
[null,null,null,null,null,null,null,null,null,"No"]
[null,null,null,null,null,null,null,null,null,"No"]
[null,null,null,null,null,null,null,null,null,"No"]
[null,null,null,null,null,null,null,null,null,"No"]
[null,null,null,null,null,null,null,null,null,"No"]
[null,null,null,null,null,null,null,null,null,"No"]
[null,null,null,null,null,null,null,null,null,"No"]
[null,null,null,null,null,null,null,null,null,"No"]
[null,null,null,null,null,null,null,null,null,"No"]
[null,null,null,null,null,null,null,null,null,"No"]
[null,null,null,null,null,null,null,null,null,"No"]
[null,null,null,null,null,null,null,null,null,"No"]
[null,null,null,null,null,null,null,null,null,"No"]
[null,null,null,null,null,null,null,null,null,"No"]
[null,null,null,null,null,null,null,null,null,"No"]
[null,null,null,null,null,null,null,null,null,"No"]
[null,null,null,null,null,null,null,null,null,"No"]
[null,null,null,null,null,null,null,null,null,"No"]
[null,null,null,null,null,null,null,null,null,"No"]
[null,null,null,null,null,null,null,null,null,"No"]
[null,null,null,null,null,null,null,null,null,"No"]
[null,null,null,null,null,null,null,null,null,"No"]
[null,null,null,null,null,null,null,null,null,"No"]
[null,null,null,null,null,null,null,null,null,"No"]
[null,null,null,null,null,null,null,null,null,"No"]
[null,null,null,null,null,null,null,null,null,"No"]
[null,null,null,null,null,null,null,null,null,"No"]
[null,null,null,null,null,null,null,null,null,"No"]
[null,null,null,null,null,null,null,null,null,"No"]
[null,null,null,null,null,null,null,null,null,"No"]
[null,null,null,null,null,null,null,null,null,"No"]
[null,null,null,null,null,null,null,null,null,"No"]
[null,null,null,null,null,null,null,null,null,"No"]
[null,null,null,null,null,null,null,null,null,"No"]
[null,null,null,null,null,null,null,null,null,"No"]
[null,null,null,null,null,null,null,null,null,"No"]
[null,null,null,null,null,null,null,null,null,"No"]
[null,null,null,null,null,null,null,null,null,"No"]
[null,null,null,null,null,null,null,null,null,"No"]
[null,null,null,null,null,null,null,null,null,"No"]
[null,null,null,null,null,null,null,null,null,"No"]
[null,null,null,null,null,null,null,null,null,"No"]
[null,null,null,null,null,null,null,null,null,"No"]
[null,null,null,null,null,null,null,null,null,"No"]
[null,null,null,null,null,null,null,null,null,"No"]
[null,null,null,null,null,null,null,null,null,"No"]
[null,null,null,null,null,null,null,null,null,"No"]
[null,null,null,null,null,null,null,null,null,"No"]
[null,null,null,null,null,null,null,null,null,"No"]
[null,null,null,null,null,null,null,null,null,"No"]
[null,null,null,null,null,null,null,null,null,"No"]
[null,null,null,null,null,null,null,null,null,"No"]
[null,null,null,null,null,null,null,null,null,"No"]
[null,null,null,null,null,null,null,null,null,"No"]
[null,null,null,null,null,null,null,null,null,"No"]
[null,null,null,null,null,null,null,null,null,"No"]
[null,null,null,null,null,null,null,null,null,"No"]
[null,null,null,null,null,null,null,null,null,"No"]
[null,null,null,null,null,null,null,null,null,"No"]
[null,null,null,null,null,null,null,null,null,"No"]
[null,null,null,null,null,null,null,null,null,"No"]
[null,null,null,null,null,null,null,null,null,"No"]
[null,null,null,null,null,null,null,null,null,"No"]
[null,null,null,null,null,null,null,null,null,"No"]
[null,null,null,null,null,null,null,null,null,"No"]
[null,null,null,null,null,null,null,null,null,"No"]
[null,null,null,null,null,null,null,null,null,"No"]
[null,null,null,null,null,null,null,null,null,"No"]
[null,null,null,null,null,null,null,null,null,"No"]
[null,null,null,null,null,null,null,null,null,"No"]
[null,null,null,null,null,null,null,null,null,"No"]
[null,null,null,null,null,null,null,null,null,"No"]
[null,null,null,null,null,null,null,null,null,"No"]
[null,null,null,null,null,null,null,null,null,"No"]
[null,null,null,null,null,null,null,null,null,"No"]
[null,null,null,null,null,null,null,null,null,"No"]
[null,null,null,null,null,null,null,null,null,"No"]
[null,null,null,null,null,null,null,null,null,"No"]
[null,null,null,null,null,null,null,null,null,"No"]
[null,null,null,null,null,null,null,null,null,"No"]
[null,null,null,null,null,null,null,null,null,"No"]
[null,null,null,null,null,null,null,null,null,"No"]
[null,null,null,null,null,null,null,null,null,"No"]
[null,null,null,null,null,null,null,null,null,"No"]
[null,null,null,null,null,null,null,null,null,"No"]
[null,null,null,null,null,null,null,null,null,"No"]
[null,null,null,null,null,null,null,null,null,"No"]
[null,null,null,null,null,null,null,null,null,"No"]
[null,null,null,null,null,null,null,null,null,"No"]
[null,null,null,null,null,null,null,null,null,"No"]
[null,null,null,null,null,null,null,null,null,"No"]
[null,null,null,null,null,null,null,null,null,"No"]
[null,null,null,null,null,null,null,null,null,"No"]
[null,null,null,null,null,null,null,null,null,"No"]
[null,null,null,null,null,null,null,null,null,"No"]
[null,null,null,null,null,null,null,null,null,"No"]
[null,null,null,null,null,null,null,null,null,"No"]
[null,null,null,null,null,null,null,null,null,"No"]
[null,null,null,null,null,null,null,null,null,"No"]
[null,null,null,null,null,null,null,null,null,"No"]
[null,null,null,null,null,null,null,null,null,"No"]
[null,null,null,null,null,null,null,null,null,"No"]
[null,null,null,null,null,null,null,null,null,"No"]
[null,null,null,null,null,null,null,null,null,"No"]
[null,null,null,null,null,null,null,null,null,"No"]
[null,null,null,null,null,null,null,null,null,"No"]
[null,null,null,null,null,null,null,null,null,"No"]
[null,null,null,null,null,null,null,null,null,"No"]
[null,null,null,null,null,null,null,null,null,"No"]
[null,null,null,null,null,null,null,null,null,"No"]
[null,null,null,null,null,null,null,null,null,"No"]
[null,null,null,null,null,null,null,null,null,"No"]
[null,null,null,null,null,null,null,null,null,"No"]
[null,null,null,null,null,null,null,null,null,"No"]
[null,null,null,null,null,null,null,null,null,"No"]
[null,null,null,null,null,null,null,null,null,"No"]
[null,null,null,null,null,null,null,null,null,"No"]
[null,null,null,null,null,null,null,null,null,"No"]
[null,null,null,null,null,null,null,null,null,"No"]
[null,null,null,null,null,null,null,null,null,"No"]
[null,null,null,null,null,null,null,null,null,"No"]
[null,null,null,null,null,null,null,null,null,"No"]
[null,null,null,null,null,null,null,null,null,"No"]
[null,null,null,null,null,null,null,null,null,"No"]
[null,null,null,null,null,null,null,null,null,"No"]
[null,null,null,null,null,null,null,null,null,"No"]
[null,null,null,null,null,null,null,null,null,"No"]
[null,null,null,null,null,null,null,null,null,"No"]
[null,null,null,null,null,null,null,null,null,"No"]
[null,null,null,null,null,null,null,null,null,"No"]
[null,null,null,null,null,null,null,null,null,"No"]
[null,null,null,null,null,null,null,null,null,"No"]
[null,null,null,null,null,null,null,null,null,"No"]
[null,null,null,null,null,null,null,null,null,"No"]
[null,null,null,null,null,null,null,null,null,"No"]
[null,null,null,null,null,null,null,null,null,"No"]
[null,null,null,null,null,null,null,null,null,"No"]
[null,null,null,null,null,null,null,null,null,"No"]
[null,null,null,null,null,null,null,null,null,"No"]
[null,null,null,null,null,null,null,null,null,"No"]
[null,null,null,null,null,null,null,null,null,"No"]
[null,null,null,null,null,null,null,null,null,"No"]
[null,null,null,null,null,null,null,null,null,"No"]
[null,null,null,null,null,null,null,null,null,"No"]
[null,null,null,null,null,null,null,null,null,"No"]
[null,null,null,null,null,null,null,null,null,"No"]
[null,null,null,null,null,null,null,null,null,"No"]
[null,null,null,null,null,null,null,null,null,"No"]
[null,null,null,null,null,null,null,null,null,"No"]
[null,null,null,null,null,null,null,null,null,"No"]
[null,null,null,null,null,null,null,null,null,"No"]
[null,null,null,null,null,null,null,null,null,"No"]
[null,null,null,null,null,null,null,null,null,"No"]
[null,null,null,null,null,null,null,null,null,"No"]
[null,null,null,null,null,null,null,null,null,"No"]
[null,null,null,null,null,null,null,null,null,"No"]
[null,null,null,null,null,null,null,null,null,"No"]
[null,null,null,null,null,null,null,null,null,"No"]
[null,null,null,null,null,null,null,null,null,"No"]
[null,null,null,null,null,null,null,null,null,"No"]
[null,null,null,null,null,null,null,null,null,"No"]
[null,null,null,null,null,null,null,null,null,"No"]
[null,null,null,null,null,null,null,null,null,"No"]
[null,null,null,null,null,null,null,null,null,"No"]
[null,null,null,null,null,null,null,null,null,"No"]
[null,null,null,null,null,null,null,null,null,"No"]
[null,null,null,null,null,null,null,null,null,"No"]
[null,null,null,null,null,null,null,null,null,"No"]
[null,null,null,null,null,null,null,null,null,"No"]
[null,null,null,null,null,null,null,null,null,"No"]
[null,null,null,null,null,null,null,null,null,"No"]
[null,null,null,null,null,null,null,null,null,"No"]
[null,null,null,null,null,null,null,null,null,"No"]
[null,null,null,null,null,null,null,null,null,"No"]
[null,null,null,null,null,null,null,null,null,"No"]
[null,null,null,null,null,null,null,null,null,"No"]
[null,null,null,null,null,null,null,null,null,"No"]
[null,null,null,null,null,null,null,null,null,"No"]
[null,null,null,null,null,null,null,null,null,"No"]
[null,null,null,null,null,null,null,null,null,"No"]
[null,null,null,null,null,null,null,null,null,"No"]
[null,null,null,null,null,null,null,null,null,"No"]
[null,null,null,null,null,null,null,null,null,"No"]
[null,null,null,null,null,null,null,null,null,"No"]
[null,null,null,null,null,null,null,null,null,"No"]
[null,null,null,null,null,null,null,null,null,"No"]
[null,null,null,null,null,null,null,null,null,"No"]
[null,null,null,null,null,null,null,null,null,"No"]
[null,null,null,null,null,null,null,null,null,"No"]
[null,null,null,null,null,null,null,null,null,"No"]
[null,null,null,null,null,null,null,null,null,"No"]
[null,null,null,null,null,null,null,null,null,"No"]
[null,null,null,null,null,null,null,null,null,"No"]
[null,null,null,null,null,null,null,null,null,"No"]
[null,null,null,null,null,null,null,null,null,"No"]
[null,null,null,null,null,null,null,null,null,"No"]
[null,null,null,null,null,null,null,null,null,"No"]
[null,null,null,null,null,null,null,null,null,"No"]
[null,null,null,null,null,null,null,null,null,"No"]
[null,null,null,null,null,null,null,null,null,"No"]
[null,null,null,null,null,null,null,null,null,"No"]
[null,null,null,null,null,null,null,null,null,"No"]
[null,null,null,null,null,null,null,null,null,"No"]
[null,null,null,null,null,null,null,null,null,"No"]
[null,null,null,null,null,null,null,null,null,"No"]
[null,null,null,null,null,null,null,null,null,"No"]
[null,null,null,null,null,null,null,null,null,"No"]
[null,null,null,null,null,null,null,null,null,"No"]
[null,null,null,null,null,null,null,null,null,"No"]
[null,null,null,null,null,null,null,null,null,"No"]
[null,null,null,null,null,null,null,null,null,"No"]
[null,null,null,null,null,null,null,null,null,"No"]
[null,null,null,null,null,null,null,null,null,"No"]
[null,null,null,null,null,null,null,null,null,"No"]
[null,null,null,null,null,null,null,null,null,"No"]
[null,null,null,null,null,null,null,null,null,"No"]
[null,null,null,null,null,null,null,null,null,"No"]
[null,null,null,null,null,null,null,null,null,"No"]
[null,null,null,null,null,null,null,null,null,"No"]
[null,null,null,null,null,null,null,null,null,"No"]
[null,null,null,null,null,null,null,null,null,"No"]
[null,null,null,null,null,null,null,null,null,"No"]
[null,null,null,null,null,null,null,null,null,"No"]
[null,null,null,null,null,null,null,null,null,"No"]
[null,null,null,null,null,null,null,null,null,"No"]
[null,null,null,null,null,null,null,null,null,"No"]
[null,null,null,null,null,null,null,null,null,"No"]
[null,null,null,null,null,null,null,null,null,"No"]
[null,null,null,null,null,null,null,null,null,"No"]
[null,null,null,null,null,null,null,null,null,"No"]
[null,null,null,null,null,null,null,null,null,"No"]
[null,null,null,null,null,null,null,null,null,"No"]
[null,null,null,null,null,null,null,null,null,"No"]
[null,null,null,null,null,null,null,null,null,"No"]
[null,null,null,null,null,null,null,null,null,"No"]
[null,null,null,null,null,null,null,null,null,"No"]
[null,null,null,null,null,null,null,null,null,"No"]
[null,null,null,null,null,null,null,null,null,"No"]
[null,null,null,null,null,null,null,null,null,"No"]
[null,null,null,null,null,null,null,null,null,"No"]
[null,null,null,null,null,null,null,null,null,"No"]
[null,null,null,null,null,null,null,null,null,"No"]
[null,null,null,null,null,null,null,null,null,"No"]
[null,null,null,null,null,null,null,null,null,"No"]
[null,null,null,null,null,null,null,null,null,"No"]
[null,null,null,null,null,null,null,null,null,"No"]
[null,null,null,null,null,null,null,null,null,"No"]
[null,null,null,null,null,null,null,null,null,"No"]
[null,null,null,null,null,null,null,null,null,"No"]
[null,null,null,null,null,null,null,null,null,"No"]
[null,null,null,null,null,null,null,null,null,"No"]
[null,null,null,null,null,null,null,null,null,"No"]
[null,null,null,null,null,null,null,null,null,"No"]
[null,null,null,null,null,null,null,null,null,"No"]
[null,null,null,null,null,null,null,null,null,"No"]
[null,null,null,null,null,null,null,null,null,"No"]
[null,null,null,null,null,null,null,null,null,"No"]
[null,null,null,null,null,null,null,null,null,"No"]
[null,null,null,null,null,null,null,null,null,"No"]
[null,null,null,null,null,null,null,null,null,"No"]
[null,null,null,null,null,null,null,null,null,"No"]
[null,null,null,null,null,null,null,null,null,"No"]
[null,null,null,null,null,null,null,null,null,"No"]
[null,null,null,null,null,null,null,null,null,"No"]
[null,null,null,null,null,null,null,null,null,"No"]
[null,null,null,null,null,null,null,null,null,"No"]
[null,null,null,null,null,null,null,null,null,"No"]
[null,null,null,null,null,null,null,null,null,"No"]
[null,null,null,null,null,null,null,null,null,"No"]
[null,null,null,null,null,null,null,null,null,"No"]
[null,null,null,null,null,null,null,null,null,"No"]
[null,null,null,null,null,null,null,null,null,"No"]
[null,null,null,null,null,null,null,null,null,"No"]
[null,null,null,null,null,null,null,null,null,"No"]
[null,null,null,null,null,null,null,null,null,"No"]
[null,null,null,null,null,null,null,null,null,"No"]
[null,null,null,null,null,null,null,null,null,"No"]
[null,null,null,null,null,null,null,null,null,"No"]
[null,null,null,null,null,null,null,null,null,"No"]
[null,null,null,null,null,null,null,null,null,"No"]
[null,null,null,null,null,null,null,null,null,"No"]
[null,null,null,null,null,null,null,null,null,"No"]
[null,null,null,null,null,null,null,null,null,"No"]
[null,null,null,null,null,null,null,null,null,"No"]
[null,null,null,null,null,null,null,null,null,"No"]
[null,null,null,null,null,null,null,null,null,"No"]
[null,null,null,null,null,null,null,null,null,"No"]
[null,null,null,null,null,null,null,null,null,"No"]
[null,null,null,null,null,null,null,null,null,"No"]
[null,null,null,null,null,null,null,null,null,"No"]
[null,null,null,null,null,null,null,null,null,"No"]
[null,null,null,null,null,null,null,null,null,"No"]
[null,null,null,null,null,null,null,null,null,"No"]
[null,null,null,null,null,null,null,null,null,"No"]
[null,null,null,null,null,null,null,null,null,"No"]
[null,null,null,null,null,null,null,null,null,"No"]
[null,null,null,null,null,null,null,null,null,"No"]
[null,null,null,null,null,null,null,null,null,"No"]
[null,null,null,null,null,null,null,null,null,"No"]
[null,null,null,null,null,null,null,null,null,"No"]
[null,null,null,null,null,null,null,null,null,"No"]
[null,null,null,null,null,null,null,null,null,"No"]
[null,null,null,null,null,null,null,null,null,"No"]
[null,null,null,null,null,null,null,null,null,"No"]
[null,null,null,null,null,null,null,null,null,"No"]
[null,null,null,null,null,null,null,null,null,"No"]
[null,null,null,null,null,null,null,null,null,"No"]
[null,null,null,null,null,null,null,null,null,"No"]
[null,null,null,null,null,null,null,null,null,"No"]
[null,null,null,null,null,null,null,null,null,"No"]
[null,null,null,null,null,null,null,null,null,"No"]
[null,null,null,null,null,null,null,null,null,"No"]
[null,null,null,null,null,null,null,null,null,"No"]
[null,null,null,null,null,null,null,null,null,"No"]
[null,null,null,null,null,null,null,null,null,"No"]
[null,null,null,null,null,null,null,null,null,"No"]
[null,null,null,null,null,null,null,null,null,"No"]
[null,null,null,null,null,null,null,null,null,"No"]
[null,null,null,null,null,null,null,null,null,"No"]
[null,null,null,null,null,null,null,null,null,"No"]
[null,null,null,null,null,null,null,null,null,"No"]
[null,null,null,null,null,null,null,null,null,"No"]
[null,null,null,null,null,null,null,null,null,"No"]
[null,null,null,null,null,null,null,null,null,"No"]
[null,null,null,null,null,null,null,null,null,"No"]
[null,null,null,null,null,null,null,null,null,"No"]
[null,null,null,null,null,null,null,null,null,"No"]
[null,null,null,null,null,null,null,null,null,"No"]
[null,null,null,null,null,null,null,null,null,"No"]
[null,null,null,null,null,null,null,null,null,"No"]
[null,null,null,null,null,null,null,null,null,"No"]
[null,null,null,null,null,null,null,null,null,"No"]
[null,null,null,null,null,null,null,null,null,"No"]
[null,null,null,null,null,null,null,null,null,"No"]
[null,null,null,null,null,null,null,null,null,"No"]
[null,null,null,null,null,null,null,null,null,"No"]
[null,null,null,null,null,null,null,null,null,"No"]
[null,null,null,null,null,null,null,null,null,"No"]
[null,null,null,null,null,null,null,null,null,"No"]
[null,null,null,null,null,null,null,null,null,"No"]
[null,null,null,null,null,null,null,null,null,"No"]
[null,null,null,null,null,null,null,null,null,"No"]
[null,null,null,null,null,null,null,null,null,"No"]
[null,null,null,null,null,null,null,null,null,"No"]
[null,null,null,null,null,null,null,null,null,"No"]
[null,null,null,null,null,null,null,null,null,"No"]
[null,null,null,null,null,null,null,null,null,"No"]
[null,null,null,null,null,null,null,null,null,"No"]
[null,null,null,null,null,null,null,null,null,"No"]
[null,null,null,null,null,null,null,null,null,"No"]
[null,null,null,null,null,null,null,null,null,"No"]
[null,null,null,null,null,null,null,null,null,"No"]
[null,null,null,null,null,null,null,null,null,"No"]
[null,null,null,null,null,null,null,null,null,"No"]
[null,null,null,null,null,null,null,null,null,"No"]
[null,null,null,null,null,null,null,null,null,"No"]
[null,null,null,null,null,null,null,null,null,"No"]
[null,null,null,null,null,null,null,null,null,"No"]
[null,null,null,null,null,null,null,null,null,"No"]
[null,null,null,null,null,null,null,null,null,"No"]
[null,null,null,null,null,null,null,null,null,"No"]
[null,null,null,null,null,null,null,null,null,"No"]
[null,null,null,null,null,null,null,null,null,"No"]
[null,null,null,null,null,null,null,null,null,"No"]
[null,null,null,null,null,null,null,null,null,"No"]
[null,null,null,null,null,null,null,null,null,"No"]
[null,null,null,null,null,null,null,null,null,"No"]
[null,null,null,null,null,null,null,null,null,"No"]
[null,null,null,null,null,null,null,null,null,"No"]
[null,null,null,null,null,null,null,null,null,"No"]
[null,null,null,null,null,null,null,null,null,"No"]
[null,null,null,null,null,null,null,null,null,"No"]
[null,null,null,null,null,null,null,null,null,"No"]
[null,null,null,null,null,null,null,null,null,"No"]
[null,null,null,null,null,null,null,null,null,"No"]
[null,null,null,null,null,null,null,null,null,"No"]
[null,null,null,null,null,null,null,null,null,"No"]
[null,null,null,null,null,null,null,null,null,"No"]
[null,null,null,null,null,null,null,null,null,"No"]
[null,null,null,null,null,null,null,null,null,"No"]
[null,null,null,null,null,null,null,null,null,"No"]
[null,null,null,null,null,null,null,null,null,"No"]
[null,null,null,null,null,null,null,null,null,"No"]
[null,null,null,null,null,null,null,null,null,"No"]
[null,null,null,null,null,null,null,null,null,"No"]
[null,null,null,null,null,null,null,null,null,"No"]
[null,null,null,null,null,null,null,null,null,"No"]
[null,null,null,null,null,null,null,null,null,"No"]
[null,null,null,null,null,null,null,null,null,"No"]
[null,null,null,null,null,null,null,null,null,"No"]
[null,null,null,null,null,null,null,null,null,"No"]
[null,null,null,null,null,null,null,null,null,"No"]
[null,null,null,null,null,null,null,null,null,"No"]
[null,null,null,null,null,null,null,null,null,"No"]
[null,null,null,null,null,null,null,null,null,"No"]
[null,null,null,null,null,null,null,null,null,"No"]
[null,null,null,null,null,null,null,null,null,"No"]
[null,null,null,null,null,null,null,null,null,"No"]
[null,null,null,null,null,null,null,null,null,"No"]
[null,null,null,null,null,null,null,null,null,"No"]
[null,null,null,null,null,null,null,null,null,"No"]
[null,null,null,null,null,null,null,null,null,"No"]
[null,null,null,null,null,null,null,null,null,"No"]
[null,null,null,null,null,null,null,null,null,"No"]
[null,null,null,null,null,null,null,null,null,"No"]
[null,null,null,null,null,null,null,null,null,"No"]
[null,null,null,null,null,null,null,null,null,"No"]
[null,null,null,null,null,null,null,null,null,"No"]
[null,null,null,null,null,null,null,null,null,"No"]
[null,null,null,null,null,null,null,null,null,"No"]
[null,null,null,null,null,null,null,null,null,"No"]
[null,null,null,null,null,null,null,null,null,"No"]
[null,null,null,null,null,null,null,null,null,"No"]
[null,null,null,null,null,null,null,null,null,"No"]
[null,null,null,null,null,null,null,null,null,"No"]
[null,null,null,null,null,null,null,null,null,"No"]
[null,null,null,null,null,null,null,null,null,"No"]
[null,null,null,null,null,null,null,null,null,"No"]
[null,null,null,null,null,null,null,null,null,"No"]
[null,null,null,null,null,null,null,null,null,"No"]
[null,null,null,null,null,null,null,null,null,"No"]
[null,null,null,null,null,null,null,null,null,"No"]
[null,null,null,null,null,null,null,null,null,"No"]
[null,null,null,null,null,null,null,null,null,"No"]
[null,null,null,null,null,null,null,null,null,"No"]
[null,null,null,null,null,null,null,null,null,"No"]
[null,null,null,null,null,null,null,null,null,"No"]
[null,null,null,null,null,null,null,null,null,"No"]
[null,null,null,null,null,null,null,null,null,"No"]
[null,null,null,null,null,null,null,null,null,"No"]
[null,null,null,null,null,null,null,null,null,"No"]
[null,null,null,null,null,null,null,null,null,"No"]
[null,null,null,null,null,null,null,null,null,"No"]
[null,null,null,null,null,null,null,null,null,"No"]
[null,null,null,null,null,null,null,null,null,"No"]
[null,null,null,null,null,null,null,null,null,"No"]
[null,null,null,null,null,null,null,null,null,"No"]
[null,null,null,null,null,null,null,null,null,"No"]
[null,null,null,null,null,null,null,null,null,"No"]
[null,null,null,null,null,null,null,null,null,"No"]
[null,null,null,null,null,null,null,null,null,"No"]
[null,null,null,null,null,null,null,null,null,"No"]
[null,null,null,null,null,null,null,null,null,"No"]
[null,null,null,null,null,null,null,null,null,"No"]
[null,null,null,null,null,null,null,null,null,"No"]
[null,null,null,null,null,null,null,null,null,"No"]
[null,null,null,null,null,null,null,null,null,"No"]
[null,null,null,null,null,null,null,null,null,"No"]
[null,null,null,null,null,null,null,null,null,"No"]
[null,null,null,null,null,null,null,null,null,"No"]
[null,null,null,null,null,null,null,null,null,"No"]
[null,null,null,null,null,null,null,null,null,"No"]
[null,null,null,null,null,null,null,null,null,"No"]
[null,null,null,null,null,null,null,null,null,"No"]
[null,null,null,null,null,null,null,null,null,"No"]
[null,null,null,null,null,null,null,null,null,"No"]
[null,null,null,null,null,null,null,null,null,"No"]
[null,null,null,null,null,null,null,null,null,"No"]
[null,null,null,null,null,null,null,null,null,"No"]
[null,null,null,null,null,null,null,null,null,"No"]
[null,null,null,null,null,null,null,null,null,"No"]
[null,null,null,null,null,null,null,null,null,"No"]
[null,null,null,null,null,null,null,null,null,"No"]
[null,null,null,null,null,null,null,null,null,"No"]
[null,null,null,null,null,null,null,null,null,"No"]
[null,null,null,null,null,null,null,null,null,"No"]
[null,null,null,null,null,null,null,null,null,"No"]
[null,null,null,null,null,null,null,null,null,"No"]
[null,null,null,null,null,null,null,null,null,"No"]
[null,null,null,null,null,null,null,null,null,"No"]
[null,null,null,null,null,null,null,null,null,"No"]
[null,null,null,null,null,null,null,null,null,"No"]
[null,null,null,null,null,null,null,null,null,"No"]
[null,null,null,null,null,null,null,null,null,"No"]
[null,null,null,null,null,null,null,null,null,"No"]
[null,null,null,null,null,null,null,null,null,"No"]
[null,null,null,null,null,null,null,null,null,"No"]
[null,null,null,null,null,null,null,null,null,"No"]
[null,null,null,null,null,null,null,null,null,"No"]
[null,null,null,null,null,null,null,null,null,"No"]
[null,null,null,null,null,null,null,null,null,"No"]
[null,null,null,null,null,null,null,null,null,"No"]
[null,null,null,null,null,null,null,null,null,"No"]
[null,null,null,null,null,null,null,null,null,"No"]
[null,null,null,null,null,null,null,null,null,"No"]
[null,null,null,null,null,null,null,null,null,"No"]
[null,null,null,null,null,null,null,null,null,"No"]
[null,null,null,null,null,null,null,null,null,"No"]
[null,null,null,null,null,null,null,null,null,"No"]
[null,null,null,null,null,null,null,null,null,"No"]
[null,null,null,null,null,null,null,null,null,"No"]
[null,null,null,null,null,null,null,null,null,"No"]
[null,null,null,null,null,null,null,null,null,"No"]
[null,null,null,null,null,null,null,null,null,"No"]
[null,null,null,null,null,null,null,null,null,"No"]
[null,null,null,null,null,null,null,null,null,"No"]
[null,null,null,null,null,null,null,null,null,"No"]
[null,null,null,null,null,null,null,null,null,"No"]
[null,null,null,null,null,null,null,null,null,"No"]
[null,null,null,null,null,null,null,null,null,"No"]
[null,null,null,null,null,null,null,null,null,"No"]
[null,null,null,null,null,null,null,null,null,"No"]
[null,null,null,null,null,null,null,null,null,"No"]
[null,null,null,null,null,null,null,null,null,"No"]
[null,null,null,null,null,null,null,null,null,"No"]
[null,null,null,null,null,null,null,null,null,"No"]
[null,null,null,null,null,null,null,null,null,"No"]
[null,null,null,null,null,null,null,null,null,"No"]
[null,null,null,null,null,null,null,null,null,"No"]
[null,null,null,null,null,null,null,null,null,"No"]
[null,null,null,null,null,null,null,null,null,"No"]
[null,null,null,null,null,null,null,null,null,"No"]
[null,null,null,null,null,null,null,null,null,"No"]
[null,null,null,null,null,null,null,null,null,"No"]
[null,null,null,null,null,null,null,null,null,"No"]
[null,null,null,null,null,null,null,null,null,"No"]
[null,null,null,null,null,null,null,null,null,"No"]
[null,null,null,null,null,null,null,null,null,"No"]
[null,null,null,null,null,null,null,null,null,"No"]
[null,null,null,null,null,null,null,null,null,"No"]
[null,null,null,null,null,null,null,null,null,"No"]
[null,null,null,null,null,null,null,null,null,"No"]
[null,null,null,null,null,null,null,null,null,"No"]
[null,null,null,null,null,null,null,null,null,"No"]
[null,null,null,null,null,null,null,null,null,"No"]
[null,null,null,null,null,null,null,null,null,"No"]
[null,null,null,null,null,null,null,null,null,"No"]
[null,null,null,null,null,null,null,null,null,"No"]
[null,null,null,null,null,null,null,null,null,"No"]
[null,null,null,null,null,null,null,null,null,"No"]
[null,null,null,null,null,null,null,null,null,"No"]
[null,null,null,null,null,null,null,null,null,"No"]
[null,null,null,null,null,null,null,null,null,"No"]
[null,null,null,null,null,null,null,null,null,"No"]
[null,null,null,null,null,null,null,null,null,"No"]
[null,null,null,null,null,null,null,null,null,"No"]
[null,null,null,null,null,null,null,null,null,"No"]
[null,null,null,null,null,null,null,null,null,"No"]
[null,null,null,null,null,null,null,null,null,"No"]
[null,null,null,null,null,null,null,null,null,"No"]
[null,null,null,null,null,null,null,null,null,"No"]
[null,null,null,null,null,null,null,null,null,"No"]
[null,null,null,null,null,null,null,null,null,"No"]
[null,null,null,null,null,null,null,null,null,"No"]
[null,null,null,null,null,null,null,null,null,"No"]
[null,null,null,null,null,null,null,null,null,"No"]
[null,null,null,null,null,null,null,null,null,"No"]
[null,null,null,null,null,null,null,null,null,"No"]
[null,null,null,null,null,null,null,null,null,"No"]
[null,null,null,null,null,null,null,null,null,"No"]
[null,null,null,null,null,null,null,null,null,"No"]
[null,null,null,null,null,null,null,null,null,"No"]
[null,null,null,null,null,null,null,null,null,"No"]
[null,null,null,null,null,null,null,null,null,"No"]
[null,null,null,null,null,null,null,null,null,"No"]
[null,null,null,null,null,null,null,null,null,"No"]
[null,null,null,null,null,null,null,null,null,"No"]
[null,null,null,null,null,null,null,null,null,"No"]
[null,null,null,null,null,null,null,null,null,"No"]
[null,null,null,null,null,null,null,null,null,"No"]
[null,null,null,null,null,null,null,null,null,"No"]
[null,null,null,null,null,null,null,null,null,"No"]
[null,null,null,null,null,null,null,null,null,"No"]
[null,null,null,null,null,null,null,null,null,"No"]
[null,null,null,null,null,null,null,null,null,"No"]
[null,null,null,null,null,null,null,null,null,"No"]
[null,null,null,null,null,null,null,null,null,"No"]
[null,null,null,null,null,null,null,null,null,"No"]
[null,null,null,null,null,null,null,null,null,"No"]
[null,null,null,null,null,null,null,null,null,"No"]
[null,null,null,null,null,null,null,null,null,"No"]
[null,null,null,null,null,null,null,null,null,"No"]
[null,null,null,null,null,null,null,null,null,"No"]
[null,null,null,null,null,null,null,null,null,"No"]
[null,null,null,null,null,null,null,null,null,"No"]
[null,null,null,null,null,null,null,null,null,"No"]
[null,null,null,null,null,null,null,null,null,"No"]
[null,null,null,null,null,null,null,null,null,"No"]
[null,null,null,null,null,null,null,null,null,"No"]
[null,null,null,null,null,null,null,null,null,"No"]
[null,null,null,null,null,null,null,null,null,"No"]
[null,null,null,null,null,null,null,null,null,"No"]
[null,null,null,null,null,null,null,null,null,"No"]
[null,null,null,null,null,null,null,null,null,"No"]
[null,null,null,null,null,null,null,null,null,"No"]
[null,null,null,null,null,null,null,null,null,"No"]
[null,null,null,null,null,null,null,null,null,"No"]
[null,null,null,null,null,null,null,null,null,"No"]
[null,null,null,null,null,null,null,null,null,"No"]
[null,null,null,null,null,null,null,null,null,"No"]
[null,null,null,null,null,null,null,null,null,"No"]
[null,null,null,null,null,null,null,null,null,"No"]
[null,null,null,null,null,null,null,null,null,"No"]
[null,null,null,null,null,null,null,null,null,"No"]
[null,null,null,null,null,null,null,null,null,"No"]
[null,null,null,null,null,null,null,null,null,"No"]
[null,null,null,null,null,null,null,null,null,"No"]
[null,null,null,null,null,null,null,null,null,"No"]
[null,null,null,null,null,null,null,null,null,"No"]
[null,null,null,null,null,null,null,null,null,"No"]
[null,null,null,null,null,null,null,null,null,"No"]
[null,null,null,null,null,null,null,null,null,"No"]
[null,null,null,null,null,null,null,null,null,"No"]
[null,null,null,null,null,null,null,null,null,"No"]
[null,null,null,null,null,null,null,null,null,"No"]
[null,null,null,null,null,null,null,null,null,"No"]
[null,null,null,null,null,null,null,null,null,"No"]
[null,null,null,null,null,null,null,null,null,"No"]
[null,null,null,null,null,null,null,null,null,"No"]
[null,null,null,null,null,null,null,null,null,"No"]
[null,null,null,null,null,null,null,null,null,"No"]
[null,null,null,null,null,null,null,null,null,"No"]
[null,null,null,null,null,null,null,null,null,"No"]
[null,null,null,null,null,null,null,null,null,"No"]
[null,null,null,null,null,null,null,null,null,"No"]
[null,null,null,null,null,null,null,null,null,"No"]
[null,null,null,null,null,null,null,null,null,"No"]
[null,null,null,null,null,null,null,null,null,"No"]
[null,null,null,null,null,null,null,null,null,"No"]
[null,null,null,null,null,null,null,null,null,"No"]
[null,null,null,null,null,null,null,null,null,"No"]
[null,null,null,null,null,null,null,null,null,"No"]
[null,null,null,null,null,null,null,null,null,"No"]
[null,null,null,null,null,null,null,null,null,"No"]
[null,null,null,null,null,null,null,null,null,"No"]
[null,null,null,null,null,null,null,null,null,"No"]
[null,null,null,null,null,null,null,null,null,"No"]
[null,null,null,null,null,null,null,null,null,"No"]
[null,null,null,null,null,null,null,null,null,"No"]
[null,null,null,null,null,null,null,null,null,"No"]
[null,null,null,null,null,null,null,null,null,"No"]
[null,null,null,null,null,null,null,null,null,"No"]
[null,null,null,null,null,null,null,null,null,"No"]
[null,null,null,null,null,null,null,null,null,"No"]
[null,null,null,null,null,null,null,null,null,"No"]
[null,null,null,null,null,null,null,null,null,"No"]
[null,null,null,null,null,null,null,null,null,"No"]
[null,null,null,null,null,null,null,null,null,"No"]
[null,null,null,null,null,null,null,null,null,"No"]
[null,null,null,null,null,null,null,null,null,"No"]
[null,null,null,null,null,null,null,null,null,"No"]
[null,null,null,null,null,null,null,null,null,"No"]
[null,null,null,null,null,null,null,null,null,"No"]
[null,null,null,null,null,null,null,null,null,"No"]
[null,null,null,null,null,null,null,null,null,"No"]
[null,null,null,null,null,null,null,null,null,"No"]
[null,null,null,null,null,null,null,null,null,"No"]
[null,null,null,null,null,null,null,null,null,"No"]
[null,null,null,null,null,null,null,null,null,"No"]
[null,null,null,null,null,null,null,null,null,"No"]
[null,null,null,null,null,null,null,null,null,"No"]
[null,null,null,null,null,null,null,null,null,"No"]
[null,null,null,null,null,null,null,null,null,"No"]
[null,null,null,null,null,null,null,null,null,"No"]
[null,null,null,null,null,null,null,null,null,"No"]
[null,null,null,null,null,null,null,null,null,"No"]
[null,null,null,null,null,null,null,null,null,"No"]
[null,null,null,null,null,null,null,null,null,"No"]
[null,null,null,null,null,null,null,null,null,"No"]
[null,null,null,null,null,null,null,null,null,"No"]
[null,null,null,null,null,null,null,null,null,"No"]
[null,null,null,null,null,null,null,null,null,"No"]
[null,null,null,null,null,null,null,null,null,"No"]
[null,null,null,null,null,null,null,null,null,"No"]
[null,null,null,null,null,null,null,null,null,"No"]
[null,null,null,null,null,null,null,null,null,"No"]
[null,null,null,null,null,null,null,null,null,"No"]
[null,null,null,null,null,null,null,null,null,"No"]
[null,null,null,null,null,null,null,null,null,"No"]
[null,null,null,null,null,null,null,null,null,"No"]
[null,null,null,null,null,null,null,null,null,"No"]
[null,null,null,null,null,null,null,null,null,"No"]
[null,null,null,null,null,null,null,null,null,"No"]
[null,null,null,null,null,null,null,null,null,"No"]
[null,null,null,null,null,null,null,null,null,"No"]
[null,null,null,null,null,null,null,null,null,"No"]
[null,null,null,null,null,null,null,null,null,"No"]
[null,null,null,null,null,null,null,null,null,"No"]
[null,null,null,null,null,null,null,null,null,"No"]
[null,null,null,null,null,null,null,null,null,"No"]
[null,null,null,null,null,null,null,null,null,"No"]
[null,null,null,null,null,null,null,null,null,"No"]
[null,null,null,null,null,null,null,null,null,"No"]
[null,null,null,null,null,null,null,null,null,"No"]
[null,null,null,null,null,null,null,null,null,"No"]
[null,null,null,null,null,null,null,null,null,"No"]
[null,null,null,null,null,null,null,null,null,"No"]
[null,null,null,null,null,null,null,null,null,"No"]
[null,null,null,null,null,null,null,null,null,"No"]
[null,null,null,null,null,null,null,null,null,"No"]
[null,null,null,null,null,null,null,null,null,"No"]
[null,null,null,null,null,null,null,null,null,"No"]
[null,null,null,null,null,null,null,null,null,"No"]
[null,null,null,null,null,null,null,null,null,"No"]
[null,null,null,null,null,null,null,null,null,"No"]
[null,null,null,null,null,null,null,null,null,"No"]
[null,null,null,null,null,null,null,null,null,"No"]
[null,null,null,null,null,null,null,null,null,"No"]
[null,null,null,null,null,null,null,null,null,"No"]
[null,null,null,null,null,null,null,null,null,"No"]
[null,null,null,null,null,null,null,null,null,"No"]
[null,null,null,null,null,null,null,null,null,"No"]
[null,null,null,null,null,null,null,null,null,"No"]
[null,null,null,null,null,null,null,null,null,"No"]
[null,null,null,null,null,null,null,null,null,"No"]
[null,null,null,null,null,null,null,null,null,"No"]
[null,null,null,null,null,null,null,null,null,"No"]
[null,null,null,null,null,null,null,null,null,"No"]
[null,null,null,null,null,null,null,null,null,"No"]
[null,null,null,null,null,null,null,null,null,"No"]
[null,null,null,null,null,null,null,null,null,"No"]
[null,null,null,null,null,null,null,null,null,"No"]
[null,null,null,null,null,null,null,null,null,"No"]
[null,null,null,null,null,null,null,null,null,"No"]
[null,null,null,null,null,null,null,null,null,"No"]
[null,null,null,null,null,null,null,null,null,"No"]
[null,null,null,null,null,null,null,null,null,"No"]
[null,null,null,null,null,null,null,null,null,"No"]
[null,null,null,null,null,null,null,null,null,"No"]
[null,null,null,null,null,null,null,null,null,"No"]
[null,null,null,null,null,null,null,null,null,"No"]
[null,null,null,null,null,null,null,null,null,"No"]
[null,null,null,null,null,null,null,null,null,"No"]
[null,null,null,null,null,null,null,null,null,"No"]
[null,null,null,null,null,null,null,null,null,"No"]
[null,null,null,null,null,null,null,null,null,"No"]
[null,null,null,null,null,null,null,null,null,"No"]
[null,null,null,null,null,null,null,null,null,"No"]
[null,null,null,null,null,null,null,null,null,"No"]
[null,null,null,null,null,null,null,null,null,"No"]
[null,null,null,null,null,null,null,null,null,"No"]
[null,null,null,null,null,null,null,null,null,"No"]
[null,null,null,null,null,null,null,null,null,"No"]
[null,null,null,null,null,null,null,null,null,"No"]
[null,null,null,null,null,null,null,null,null,"No"]
[null,null,null,null,null,null,null,null,null,"No"]
[null,null,null,null,null,null,null,null,null,"No"]
[null,null,null,null,null,null,null,null,null,"No"]
[null,null,null,null,null,null,null,null,null,"No"]
[null,null,null,null,null,null,null,null,null,"No"]
[null,null,null,null,null,null,null,null,null,"No"]
[null,null,null,null,null,null,null,null,null,"No"]
[null,null,null,null,null,null,null,null,null,"No"]
[null,null,null,null,null,null,null,null,null,"No"]
[null,null,null,null,null,null,null,null,null,"No"]
[null,null,null,null,null,null,null,null,null,"No"]
[null,null,null,null,null,null,null,null,null,"No"]
[null,null,null,null,null,null,null,null,null,"No"]
[null,null,null,null,null,null,null,null,null,"No"]
[null,null,null,null,null,null,null,null,null,"No"]
[null,null,null,null,null,null,null,null,null,"No"]
[null,null,null,null,null,null,null,null,null,"No"]
[null,null,null,null,null,null,null,null,null,"No"]
[null,null,null,null,null,null,null,null,null,"No"]
[null,null,null,null,null,null,null,null,null,"No"]
[null,null,null,null,null,null,null,null,null,"No"]
[null,null,null,null,null,null,null,null,null,"No"]
[null,null,null,null,null,null,null,null,null,"No"]
[null,null,null,null,null,null,null,null,null,"No"]
[null,null,null,null,null,null,null,null,null,"No"]
[null,null,null,null,null,null,null,null,null,"No"]
[null,null,null,null,null,null,null,null,null,"No"]
[null,null,null,null,null,null,null,null,null,"No"]
[null,null,null,null,null,null,null,null,null,"No"]
[null,null,null,null,null,null,null,null,null,"No"]
[null,null,null,null,null,null,null,null,null,"No"]
[null,null,null,null,null,null,null,null,null,"No"]
[null,null,null,null,null,null,null,null,null,"No"]
[null,null,null,null,null,null,null,null,null,"No"]
[null,null,null,null,null,null,null,null,null,"No"]
[null,null,null,null,null,null,null,null,null,"No"]
[null,null,null,null,null,null,null,null,null,"No"]
[null,null,null,null,null,null,null,null,null,"No"]
[null,null,null,null,null,null,null,null,null,"No"]
[null,null,null,null,null,null,null,null,null,"No"]
[null,null,null,null,null,null,null,null,null,"No"]
[null,null,null,null,null,null,null,null,null,"No"]
[null,null,null,null,null,null,null,null,null,"No"]
[null,null,null,null,null,null,null,null,null,"No"]
[null,null,null,null,null,null,null,null,null,"No"]
[null,null,null,null,null,null,null,null,null,"No"]
[null,null,null,null,null,null,null,null,null,"No"]
[null,null,null,null,null,null,null,null,null,"No"]
[null,null,null,null,null,null,null,null,null,"No"]
[null,null,null,null,null,null,null,null,null,"No"]
[null,null,null,null,null,null,null,null,null,"No"]
[null,null,null,null,null,null,null,null,null,"No"]
[null,null,null,null,null,null,null,null,null,"No"]
[null,null,null,null,null,null,null,null,null,"No"]
[null,null,null,null,null,null,null,null,null,"No"]
[null,null,null,null,null,null,null,null,null,"No"]
[null,null,null,null,null,null,null,null,null,"No"]
[null,null,null,null,null,null,null,null,null,"No"]
[null,null,null,null,null,null,null,null,null,"No"]
[null,null,null,null,null,null,null,null,null,"No"]
[null,null,null,null,null,null,null,null,null,"No"]
[null,null,null,null,null,null,null,null,null,"No"]
[null,null,null,null,null,null,null,null,null,"No"]
[null,null,null,null,null,null,null,null,null,"No"]
[null,null,null,null,null,null,null,null,null,"No"]
[null,null,null,null,null,null,null,null,null,"No"]
[null,null,null,null,null,null,null,null,null,"No"]
[null,null,null,null,null,null,null,null,null,"No"]
[null,null,null,null,null,null,null,null,null,"No"]
[null,null,null,null,null,null,null,null,null,"No"]
[null,null,null,null,null,null,null,null,null,"No"]
[null,null,null,null,null,null,null,null,null,"No"]
[null,null,null,null,null,null,null,null,null,"No"]
[null,null,null,null,null,null,null,null,null,"No"]
[null,null,null,null,null,null,null,null,null,"No"]
[null,null,null,null,null,null,null,null,null,"No"]
[null,null,null,null,null,null,null,null,null,"No"]
[null,null,null,null,null,null,null,null,null,"No"]
[null,null,null,null,null,null,null,null,null,"No"]
[null,null,null,null,null,null,null,null,null,"No"]
[null,null,null,null,null,null,null,null,null,"No"]
[null,null,null,null,null,null,null,null,null,"No"]
[null,null,null,null,null,null,null,null,null,"No"]
[null,null,null,null,null,null,null,null,null,"No"]
[null,null,null,null,null,null,null,null,null,"No"]
[null,null,null,null,null,null,null,null,null,"No"]
[null,null,null,null,null,null,null,null,null,"No"]
[null,null,null,null,null,null,null,null,null,"No"]
[null,null,null,null,null,null,null,null,null,"No"]
[null,null,null,null,null,null,null,null,null,"No"]
[null,null,null,null,null,null,null,null,null,"No"]
[null,null,null,null,null,null,null,null,null,"No"]
[null,null,null,null,null,null,null,null,null,"No"]
[null,null,null,null,null,null,null,null,null,"No"]
[null,null,null,null,null,null,null,null,null,"No"]
[null,null,null,null,null,null,null,null,null,"No"]
[null,null,null,null,null,null,null,null,null,"No"]
[null,null,null,null,null,null,null,null,null,"No"]
[null,null,null,null,null,null,null,null,null,"No"]
[null,null,null,null,null,null,null,null,null,"No"]
[null,null,null,null,null,null,null,null,null,"No"]
[null,null,null,null,null,null,null,null,null,"No"]
[null,null,null,null,null,null,null,null,null,"No"]
[null,null,null,null,null,null,null,null,null,"No"]
[null,null,null,null,null,null,null,null,null,"No"]
[null,null,null,null,null,null,null,null,null,"No"]
[null,null,null,null,null,null,null,null,null,"No"]
[null,null,null,null,null,null,null,null,null,"No"]
[null,null,null,null,null,null,null,null,null,"No"]
[null,null,null,null,null,null,null,null,null,"No"]
[null,null,null,null,null,null,null,null,null,"No"]
[null,null,null,null,null,null,null,null,null,"No"]
[null,null,null,null,null,null,null,null,null,"No"]
[null,null,null,null,null,null,null,null,null,"No"]
[null,null,null,null,null,null,null,null,null,"No"]
[null,null,null,null,null,null,null,null,null,"No"]
[null,null,null,null,null,null,null,null,null,"No"]
[null,null,null,null,null,null,null,null,null,"No"]
[null,null,null,null,null,null,null,null,null,"No"]
[null,null,null,null,null,null,null,null,null,"No"]
[null,null,null,null,null,null,null,null,null,"No"]
[null,null,null,null,null,null,null,null,null,"No"]
[null,null,null,null,null,null,null,null,null,"No"]
[null,null,null,null,null,null,null,null,null,"No"]
[null,null,null,null,null,null,null,null,null,"No"]
[null,null,null,null,null,null,null,null,null,"No"]
[null,null,null,null,null,null,null,null,null,"No"]

{"sheet":"Other","index":12,"n_rows":21,"n_cols":16,"rows_kept":21,"cut":false,"hidden":false,"merged":[[18,2,18,14],[18,0,18,1]]}
[]
[]
[]
[]
[]
[]
[]
[]
[]
[]
[]
[]
[]
[]
[]
[]
[]
[null,null,null,null,null,null,null,null,null,null,null,null,null,null,null,"X"]
["OTHER CRITICAL ASSETS",null,"RELEVANT THREATS/HAZARDS"]
["Asset ID","Comments",{"$f":"'CM Dictionary'!$C22","v":"Small Explosives"},{"$f":"'CM Dictionary'!$C23","v":"Large Explosives"},{"$f":"'CM Dictionary'!$C24","v":"Chemical / Biological / Radiological "},{"$f":"'CM Dictionary'!$C25","v":"Criminal Acts"},{"$f":"'CM Dictionary'!$C26","v":"Fire"},{"$f":"'CM Dictionary'!$C27","v":"Impact Collision / Deterioration"},{"$f":"'CM Dictionary'!$C28","v":"HAZMAT"},{"$f":"'CM Dictionary'!$C29","v":"Flood"},{"$f":"'CM Dictionary'!$C30","v":"Earthquake"},{"$f":"'CM Dictionary'!$C31","v":"Extreme Weather"},{"$f":"'CM Dictionary'!$C32","v":"Mud/Landslide"},{"$f":"'Relevant Risks'!C28","v":"New hazard 1"},{"$f":"'Relevant Risks'!C29","v":"New hazard 2"}]
["Cluverts",null,null,null,null,null,null,null,null,"X","X","X","X","X"]

{"sheet":"Critical Assets","index":13,"n_rows":34,"n_cols":85,"rows_kept":34,"cut":false,"hidden":false,"merged":[[15,1,18,1],[20,1,32,1]]}
[]
[null,null,null,"Asset Type",null,"# of critical assets",null,null,"# of assets considered"]
[null,null,null,"Road bridges",null,25,null,null,26]
[null,null,null,"Road tunnels",null,11,null,null,11]
[null,null,null,"Stations",null,13,null,null,13]
[null,null,null,"Rail bridges",null,6,null,null,6]
[null,null,null,"Rail tunnels",null,4,null,null,4]
[null,null,null,"Facilities",null,10,null,null,12]
[null,null,null,"Ferry",null,0,null,null,2]
[null,null,null,"Fleet",null,5,null,null,8]
[null,null,null,"Other ",null,1,null,null,1]
["Y","X",null,"Total",null,75,null,null,83]
[null,null,null,"ROAD BRIDGES","ROAD BRIDGES","ROAD BRIDGES","ROAD BRIDGES","ROAD BRIDGES","ROAD BRIDGES","ROAD BRIDGES","ROAD BRIDGES","ROAD BRIDGES","ROAD BRIDGES","ROAD BRIDGES","ROAD BRIDGES","ROAD BRIDGES","ROAD BRIDGES","ROAD BRIDGES","ROAD BRIDGES","ROAD BRIDGES","ROAD BRIDGES","ROAD BRIDGES","ROAD BRIDGES","ROAD BRIDGES","ROAD BRIDGES","ROAD BRIDGES","ROAD BRIDGES","ROAD BRIDGES","ROAD TUNNELS","ROAD TUNNELS","ROAD TUNNELS","ROAD TUNNELS","ROAD TUNNELS","ROAD TUNNELS","ROAD TUNNELS","ROAD TUNNELS","ROAD TUNNELS","ROAD TUNNELS","ROAD TUNNELS","TRANSIT/RAIL STATION","TRANSIT/RAIL STATION","TRANSIT/RAIL STATION","TRANSIT/RAIL STATION","TRANSIT/RAIL STATION","TRANSIT/RAIL STATION","TRANSIT/RAIL STATION","TRANSIT/RAIL STATION","TRANSIT/RAIL STATION","TRANSIT/RAIL STATION","TRANSIT/RAIL STATION","TRANSIT/RAIL STATION","TRANSIT/RAIL STATION","TRANSIT/RAIL BRIDGES","TRANSIT/RAIL BRIDGES","TRANSIT/RAIL BRIDGES","TRANSIT/RAIL BRIDGES","TRANSIT/RAIL BRIDGES","TRANSIT/RAIL BRIDGES","TRANSIT/RAIL TUNNELS","TRANSIT/RAIL TUNNELS","TRANSIT/RAIL TUNNELS","TRANSIT/RAIL TUNNELS","ADMIN & SUPPORT FACILITIES","ADMIN & SUPPORT FACILITIES","ADMIN & SUPPORT FACILITIES","ADMIN & SUPPORT FACILITIES","ADMIN & SUPPORT FACILITIES","ADMIN & SUPPORT FACILITIES","ADMIN & SUPPORT FACILITIES","ADMIN & SUPPORT FACILITIES","ADMIN & SUPPORT FACILITIES","ADMIN & SUPPORT FACILITIES","FLEET","FLEET","FLEET","FLEET","FLEET","OTHER"]
[null,null,null,"Road Bridges",null,null,null,null,null,null,null,null,null,null,null,null,null,null,null,null,null,null,null,null,null,null,null,null,"Road Tunnels",null,null,null,null,null,null,null,null,null,null,"Transit/Rail Station",null,null,null,null,null,null,null,null,null,null,null,null,"Transit/Rail Bridges",null,null,null,null,null,"Transit/Rail Tunnels",null,null,null,"Admin & Support Facilities",null,null,null,null,null,null,null,null,null,"FLEET",null,null,null,null,"OTHER"]
[null,null,null,"George's Island","High Rise","Blue River Bridge","State Line Bridge","Veteran's Bridge","Interstate Bridge","Morris Bridge","Route 500 River Bridge","Metropolitan Bridge","Point Park Bridge","Rt 17  Bridge","Military Highway Bridge","Rt 71 Bridge","Boulavard Bridge","Business Route Bridge","Memorial Bridge","New River Bridge","Old River Bridge","Lazy River Bridge","Muddy River Bridge","Crooked River Bridge","Beltway Interstate Bridge","Big River InterstateBridge","Big River InterstateBridge","Interstate Highway Ramp","Big Mountain Tunnel"," Bay Tunnel","Shoals Tunnel","Downtown Tunnel","East Mountain Tunnel","Uptown Tunnel","Midtown Tunnel","Memorial Tunnel","Harbor Tunnel","Airport Runway Tunnel","Parkland Tunnel","North Station","South Station","Bay Station","Downtown Station","Market Station","Park Street Station","Government Center","State Street","College Station","Suburban Station","Airport Station","All other aboveground ","All other belowground","River Bridge","Bay Bridge","Shipyard Bridge","Pedestrian","Highway Bridges - A","Highway Bridges - B","River Tunnel I","River Tunnel II","South Station Tunnel","Point Channel Tunnel","Rail Tunnel Ventilation ","Rail Tunnel Pump Stations","South Station -Bus Terminal","Bus maintenance Facility","Fuel Storage Sites","CNG Refueling Sites","Police HQ","Plaza Building","Operations Control Center","Parking garage","Red Line car","Blue Line","Orange Line car","Heavy rail  passenger","Heavy Rail control car","Cluverts"]
[null,"CRITICALITY","Potentially Exposed Population",null,null,"Y","Y","Y",null,null,null,null,null,null,null,null,null,null,null,null,null,null,null,null,null,null,null,null,null,null,null,"Y",null,"Y",null,"Y",null,null,null,"Y","Y","Y","Y","Y","Y","Y","Y","Y","Y","Y","Y","Y","Y","Y","Y","Y","Y","Y","Y","Y","Y","Y",null,null,"Y","Y",null,null,null,"Y",null,"Y","Y","Y","Y","Y","Y"]
[null,null,"Property Loss",null,null,null,null,null,null,null,null,null,null,null,null,null,null,null,null,null,null,null,null,null,null,null,null,null,null,null,null,null,null,"Y",null,"Y",null,null,null,null,null,"Y","Y","Y","Y","Y","Y","Y","Y",null,null,"Y",null,null,null,"Y",null,null,null,null,null,null,null,null,null,null,null,null,null,null,null,null,null,null,null,"Y"]
[null,null,"Mission Importance","Y","Y","Y","Y",null,"Y","Y","Y","Y","Y","Y","Y","Y","Y","Y","Y","Y","Y","Y","Y","Y","Y","Y","Y","Y","Y","Y","Y","Y","Y","Y","Y","Y","Y","Y","Y","Y","Y","Y","Y","Y","Y","Y","Y",null,"Y"]
[null,null,"Manual Override",null,null,null,null,null,null,null,null,null,null,null,null,null,null,null,null,null,null,null,null,null,null,null,null,null,null,null,null,null,null,null,null,null,null,null,null,null,null,null,null,null,null,null,null,null,null,null,null,null,null,null,null,null,null,null,null,null,null,null,"Y","Y",null,null,"Y","Y","Y",null,"Y",null,null,null,null,null,"Y","Y"]
[]
[null,"RELEVANT THREATS/ HAZARDS",{"$f":"'CM Dictionary'!C22","v":"Small Explosives"},null,null,"X","X","X",null,null,null,null,null,null,null,null,null,null,null,null,null,null,null,null,null,null,null,null,null,null,null,"X",null,"X",null,"X",null,null,null,"X","X","X","X","X","X","X","X","X","X","X","X","X","X","X","X","X","X","X","X","X","X","X","X","X","X","X","X","X","X","X","X","X","X","X","X","X","X"]
[null,null,{"$f":"'CM Dictionary'!C23","v":"Large Explosives"},"X","X","X","X","X","X","X","X","X","X","X","X","X","X","X","X","X","X","X","X","X","X","X","X","X","X","X","X","X","X","X","X","X","X","X","X","X","X","X","X","X","X","X","X","X","X","X","X","X","X","X","X","X","X","X","X","X","X","X","X","X","X","X","X","X","X","X","X","X","X","X","X","X","X"]
[null,null,{"$f":"'CM Dictionary'!C24","v":"Chemical / Biological / Radiological "},"X","X","X","X","X","X","X","X","X","X","X","X","X","X","X","X","X","X","X","X","X","X","X","X","X","X","X","X","X","X","X","X","X","X","X","X","X","X","X","X","X","X","X","X","X","X","X","X","X","X","X","X","X","X","X","X","X","X","X","X","X","X","X","X","X","X","X","X","X","X","X","X","X","X"]
[null,null,{"$f":"'CM Dictionary'!C25","v":"Criminal Acts"},null,null,null,null,null,null,null,null,null,null,null,null,null,null,null,null,null,null,null,null,null,null,null,null,null,null,null,null,null,null,null,null,null,null,null,null,null,null,null,null,null,null,null,null,null,null,null,null,null,null,null,null,null,null,null,null,null,null,null,"X","X",null,null,"X","X","X",null,"X",null,null,null,null,null,"X"]
[null,null,{"$f":"'CM Dictionary'!C26","v":"Fire"},"X","X","X","X","X","X","X","X","X","X","X","X","X","X","X","X","X","X","X","X","X","X","X","X","X","X","X","X","X","X","X","X","X","X","X","X","X","X","X","X","X","X","X","X","X","X","X","X","X","X","X","X","X","X","X","X","X","X","X","X","X","X","X","X","X","X","X","X","X","X","X","X","X","X"]
[null,null,{"$f":"'CM Dictionary'!C27","v":"Impact Collision / Deterioration"},"X","X","X","X","X","X","X","X","X","X","X","X","X","X","X","X","X","X","X","X","X","X","X","X","X","X","X","X","X","X","X","X","X","X","X","X","X","X","X","X","X","X","X","X","X","X","X","X","X","X","X","X","X","X","X","X","X","X","X","X","X","X","X","X","X","X","X","X","X",null,null,null,null,"X"]
[null,null,{"$f":"'CM Dictionary'!C28","v":"HAZMAT"},"X","X","X","X",null,"X","X","X","X","X","X","X","X","X","X","X","X","X","X","X","X","X","X","X","X","X","X","X","X","X","X","X","X","X","X","X","X","X","X","X","X","X","X","X",null,"X",null,null,null,null,null,null,null,null,null,null,null,null,null,"X","X",null,null,"X","X","X",null,"X",null,"X","X","X","X","X"]
[null,null,{"$f":"'CM Dictionary'!C29","v":"Flood"},"X","X","X","X","X","X","X","X","X","X","X","X","X","X","X","X","X","X","X","X","X","X","X","X","X","X","X","X","X","X","X","X","X","X","X","X","X","X","X","X","X","X","X","X","X","X","X","X","X","X","X","X","X","X","X","X","X","X","X","X","X",null,null,"X","X","X",null,"X",null,"X","X","X","X","X","X"]
[null,null,{"$f":"'CM Dictionary'!C30","v":"Earthquake"},"X","X","X","X","X","X","X","X","X","X","X","X","X","X","X","X","X","X","X","X","X","X","X","X","X","X","X","X","X","X","X","X","X","X","X","X",null,null,null,null,null,null,null,null,null,null,null,null,null,null,null,null,null,null,null,null,null,null,null,"X","X",null,null,"X","X","X",null,"X",null,"X","X","X","X","X","X"]
[null,null,{"$f":"'CM Dictionary'!C31","v":"Extreme Weather"},"X","X","X","X",null,"X","X","X","X","X","X","X","X","X","X","X","X","X","X","X","X","X","X","X","X","X","X","X","X","X","X","X","X","X","X","X","X","X","X","X","X","X","X","X","X","X",null,null,"X",null,null,null,"X",null,null,null,null,null,null,"X","X","X","X","X","X","X","X","X","X",null,null,null,"X","X","X"]
[null,null,{"$f":"'CM Dictionary'!C32","v":"Mud/Landslide"},"X","X","X","X",null,"X","X","X","X","X","X","X","X","X","X","X","X","X","X","X","X","X","X","X","X","X","X","X","X","X","X","X","X","X","X","X",null,null,null,null,null,null,null,null,null,null,null,null,null,null,null,null,null,null,null,null,null,null,null,"X","X",null,null,"X","X","X",null,"X",null,"X","X","X","X","X","X"]
[null,null,{"$f":"'Relevant Risks'!C28","v":"New hazard 1"},null,null,null,null,null,null,null,null,null,null,null,null,null,null,null,null,null,null,null,null,null,null,null,null,null,null,null,null,null,null,null,null,null,null,null,null,null,null,null,null,null,null,null,null,null,null,null,null,null,null,null,null,null,null,null,null,null,null,null,null,null,null,null,null,null,null,null,null,null,null,null,null,null,null,"X"]
[null,null,{"$f":"'Relevant Risks'!C29","v":"New hazard 2"}]
[null,null,null,1,null,null,null,null,null,null,null,null,null,null,null,null,null,null,null,null,null,null,null,null,null,null,null,null,1,1,1,1,1,1,1,1,1,1,1,2,4,1,1,1,1,1,1,1,1,3,20,13,1,1,1,1,23,23,1,1,1,1,3,null,null,null,null,null,null,null,null,null,120,120,120,240,42,100,120,120,120,80,240,42,40]

{"sheet":"PPI Info","index":14,"n_rows":0,"n_cols":0,"rows_kept":0,"cut":false,"hidden":false,"merged":[]}

{"sheet":"CM Costs","index":15,"n_rows":45,"n_cols":10,"rows_kept":45,"cut":false,"hidden":false,"merged":[[11,1,16,1],[17,1,29,1],[30,1,32,1],[33,1,41,1],[42,1,44,1]]}
[]
[]
[]
[]
[]
[]
[]
[null,null,null,null,"PPI (Default=2015)",null,null,null,null," "]
[null,null,null,null,108.8]
[null,null,null,null,100]
[null,"Countermeasure Category",null,"Countermeasure","ESTIMATED PER-UNIT COST (x1000)","Comments","Unit of measure","Default Cost (PPI 2009)","Estimated Default Cost (PPI 2015)"]
[null,"Physical Security Countermeasures",{"$f":"'CM Dictionary'!D2","v":1},{"$f":"'CM Dictionary'!D3","v":"Lighting"},{"$f":"(H12)*($E$9/100)","v":8.0000640000000001},"one per 100 feet of road or perimeter.  Assumes nearby power connection, no demolition or excavating.",1,7.3529999999999998,{"$f":"(H12)*($E$9/100)","v":8.0000640000000001}]
[null,null,{"$f":"'CM Dictionary'!E2","v":2},{"$f":"'CM Dictionary'!E3","v":"Barriers & Berms"},8.6006400000000003,"10 jersey barriers and two end planters to cover 100 feet of space",1,7.9050000000000002,{"$f":"(H13)*($E$9/100)","v":8.6006400000000003}]
[null,null,{"$f":"'CM Dictionary'!F2","v":3},{"$f":"'CM Dictionary'!F3","v":"Fences"},33.599616000000005,"12 foot height security fence, in concrete with 4 gates (6 feet high, 3 feet wide). Infrared detection system. Power install, relay to central monitor. Excludes central monitoring station operation.","100 linear feet",30.882000000000001,33.599616000000005]
[null,null,{"$f":"'CM Dictionary'!G2","v":4},{"$f":"'CM Dictionary'!G3","v":"CCTV"},34.749632000000005,"4 remote PTZ cameras, one control panel",1,31.939,34.749632000000005]
[null,null,{"$f":"'CM Dictionary'!H2","v":5},{"$f":"'CM Dictionary'!H3","v":"Intrusion Detection Devices"},0.76500544000000004,"1 burglar alarm with remote signal installed",1,0.70313000000000003,0.76500544000000004]
[null,null,{"$f":"'CM Dictionary'!I2","v":6},{"$f":"'CM Dictionary'!I3","v":"Physical Inspection of asset"},79.999552000000008,"1 full time equivalent (FTE) contract employee dedicated to this task","1 FTE employee per year",73.528999999999996,79.999552000000008]
[null,"Access Control Countermeasures",{"$f":"'CM Dictionary'!J2","v":7},{"$f":"'CM Dictionary'!J3","v":"ID Cards"},7.4995840000000005,"6 zone system with database, installed","6 zones",6.8929999999999998,7.4995840000000005]
[null,null,{"$f":"'CM Dictionary'!K2","v":8},{"$f":"'CM Dictionary'!K3","v":"Biometrics"},34.999871999999996,"6 facial and fingerprint scanners, database, installed","6 zones",32.168999999999997,34.999871999999996]
[null,null,{"$f":"'CM Dictionary'!L2","v":9},{"$f":"'CM Dictionary'!L3","v":"Background Checks"},79.999552000000008,"1 full time equivalent (FTE) contract employee dedicated to this task","1 FTE contract employee per year",73.528999999999996,79.999552000000008]
[null,null,{"$f":"'CM Dictionary'!M2","v":10},{"$f":"'CM Dictionary'!M3","v":"Metal Detectors"},38.499968000000003,"6 portals, 4 handhelds, installed. Assumes no demolition and nearby power source",null,35.386000000000003,38.499968000000003]
[null,null,{"$f":"'CM Dictionary'!N2","v":11},{"$f":"'CM Dictionary'!N3","v":"Restricted Parking"},37.800384000000008,"1 full time equivalent (FTE) contract employee dedicated to this task","1 FTE contract employee per year",34.743000000000002,37.800384000000008]
[null,null,{"$f":"'CM Dictionary'!O2","v":12},{"$f":"'CM Dictionary'!O3","v":"Random Inspections"},30.000512000000004,"1 full time equivalent (FTE) contract employee dedicated to this task","1 FTE contract employee per year",27.574000000000002,30.000512000000004]
[null,null,{"$f":"'CM Dictionary'!P2","v":13},{"$f":"'CM Dictionary'!P3","v":"Visible Badges"},27.999680000000001,"1 full time equivalent (FTE) contract employee dedicated to this task","1 FTE contract employee per year",25.734999999999999,27.999680000000001]
[null,null,{"$f":"'CM Dictionary'!Q2","v":14},{"$f":"'CM Dictionary'!Q3","v":"Limited Access Points"},27.999680000000001,"1 full time equivalent (FTE) contract employee dedicated to this task","1 FTE contract employee per year",25.734999999999999,27.999680000000001]
[null,null,{"$f":"'CM Dictionary'!R2","v":15},{"$f":"'CM Dictionary'!R3","v":"Visitor Control & Escort"},27.999680000000001,"1 full time equivalent (FTE) contract employee dedicated to this task","1 FTE contract employee per year",25.734999999999999,27.999680000000001]
[null,null,{"$f":"'CM Dictionary'!S2","v":16},{"$f":"'CM Dictionary'!S3","v":"Locks"},1.200064,"1 cipher lockset, installed. Assumes no demolition or heavy construction","Each",1.103,1.200064]
[null,null,{"$f":"'CM Dictionary'!T2","v":17},{"$f":"'CM Dictionary'!T3","v":"Explosive Detection"},153.99987200000001,"2 portals, 2 handhelds, with power","2+2",141.54400000000001,153.99987200000001]
[null,null,{"$f":"'CM Dictionary'!U2","v":18},{"$f":"'CM Dictionary'!U3","v":"Establish Clear Zones"},8.7312000000000012,"100 sq yards. Assumes no demolition","100-SY",8.0250000000000004,8.7312000000000012]
[null,null,{"$f":"'CM Dictionary'!V2","v":19},{"$f":"'CM Dictionary'!V3","v":"Visible Signs"},4.5043200000000005E-2,"1 aluminum sign 18 inches high, with base","Each",4.1399999999999999E-2,4.5043200000000005E-2]
[null,"Asset Design/Engineering",{"$f":"'CM Dictionary'!W2","v":20},{"$f":"'CM Dictionary'!W3","v":"Seismic Retrofitting"},1000.0003840000002,"Estimates must be changed to reflect local variation","Per application",919.11800000000005,1000.0003840000002]
[null,null,{"$f":"'CM Dictionary'!X2","v":21},{"$f":"'CM Dictionary'!X3","v":"Fire Detection & Supression"},500.47129600000005,"Class III standpipe system with Type 2 water supply to 10,000 sf building. System includes minimum 20 pull stations with master box, annunciator, and central station relay.  Assumes minimal demolition.",null,459.99200000000002,500.47129600000005]
[null,null,{"$f":"'CM Dictionary'!Y2","v":22},{"$f":"'CM Dictionary'!Y3","v":"Encasement, Wrapping, Jacketing"},3499.9980800000003,"Estimates must be changed to reflect local variation","100-SF",3216.91,3499.9980800000003]
[null,"Operational Countermeasures",{"$f":"'CM Dictionary'!Z2","v":23},{"$f":"'CM Dictionary'!Z3","v":"Patrols"},52.999744000000007,"1 full time equivalent (FTE) contract employee dedicated to this task","1 FTE contract employee per year",48.713000000000001,52.999744000000007]
[null,null,{"$f":"'CM Dictionary'!AA2","v":24},{"$f":"'CM Dictionary'!AA3","v":"WX/Seismic Information"},135.00012800000002,"1 full time equivalent (FTE) contract employee dedicated to this task","1 FTE contract employee per year",124.081,135.00012800000002]
[null,null,{"$f":"'CM Dictionary'!AB2","v":25},{"$f":"'CM Dictionary'!AB3","v":"Intelligence Networking"},135.00012800000002,"1 full time equivalent (FTE) contract employee dedicated to this task","1 FTE contract employee per year",124.081,135.00012800000002]
[null,null,{"$f":"'CM Dictionary'!AC2","v":26},{"$f":"'CM Dictionary'!AC3","v":"HAZMAT Mitigation"},400.99980799999997,"Hazmat remediation crew of 8 persons including supervisor. Excludes material dumping costs.","1 crew",368.56599999999997,400.99980799999997]
[null,null,{"$f":"'CM Dictionary'!AD2","v":27},{"$f":"'CM Dictionary'!AD3","v":"Security Awareness Training"},25.000064000000002,"Contracted","1 program",22.978000000000002,25.000064000000002]
[null,null,{"$f":"'CM Dictionary'!AE2","v":28},{"$f":"'CM Dictionary'!AE3","v":"Emergency Response Training"},139.99948799999999,"Contracted","1 program",128.67599999999999,139.99948799999999]
[null,null,{"$f":"'CM Dictionary'!AF2","v":29},{"$f":"'CM Dictionary'!AF3","v":"Emergency Evacuation Planning"},54.400000000000006,"Designed program for structures and stations","1 program",50,54.400000000000006]
[null,null,{"$f":"'CM Dictionary'!AG2","v":30},{"$f":"'CM Dictionary'!AG3","v":"Planned Redundancy (e.g., detours)"},307.07494400000002,"Pre-staged and marked detours. Deploys one FT traffic engineer, 1 PT carpenter, 1 PT operating engineer,"," $9,000 fixed cost - $211,000 per year",282.238,307.07494400000002]
[null,null,{"$f":"'CM Dictionary'!AH2","v":31},{"$f":"'CM Dictionary'!AH3","v":"Public Information and Dissemination"},50.000128000000004,"Program development ","1 program",45.956000000000003,50.000128000000004]
[null,"Asset Specific Countermeasures",null,"Safe Room",{"$f":"I43*($E$9/108.8)","v":16},"Steel reinforced safe room with dimensions of 14’x14’x8’","1 room",null,16]
[null,null,null,"Bracing/Tie-Downs",{"$f":"I44*($E$9/108.8)","v":500},null,null,null,500]
[null,null,null,"Pump Equipment ",{"$f":"I45*($E$9/108.8)","v":500},null,null,null,500]

{"sheet":"Additional CMs","index":16,"n_rows":128,"n_cols":24,"rows_kept":128,"cut":false,"hidden":false,"merged":[[11,1,18,1],[19,1,21,1],[22,1,25,1],[26,1,28,1],[117,1,127,1],[29,1,39,1],[62,1,72,1],[51,1,61,1],[84,1,94,1],[95,1,105,1],[106,1,116,1],[40,1,50,1],[73,1,83,1]]}
[null,null,null,null,null,null,null,null,null,null,null,null,null,"L"]
[null,null,null,null,null,null,null,null,null,null,null,null,null,"M"]
[null,null,null,null,null,null,null,null,null,null,null,null,null,"H"]
[]
[null,null,null,null,null,null,null,null,null,null,null,null,null,"X"]
[]
[null,null,null,null,null,null,null,null,null,null,null,null,null,"ON"]
[null,null,null,null,null,null,null,null,null,null,null,null,null,"OFF"]
[]
[null,null,null,"ON","ON","OFF","OFF","OFF","OFF","OFF",null,null,null,null,"OFF","OFF","OFF","OFF","OFF","OFF","OFF","OFF","OFF","OFF"]
[null,null,null,"Scour Measures","Stormwater Mgt","Other 3","Other 4","Other 5","Other 6","Other 7",null,null,null,null,"Other 1","Other 2","Other 3","Other 4","Other 5","Other 6","Other 7","Other 8","Other 9","Other 10"]
[null,"Functions","PREVENTION"]
[null,null,"PROTECTION","X"]
[null,null,"MITIGATE","X","X"]
[null,null,"RESPONSE PREP. "]
[null,null,"RECOVERY PREP."]
[null,null,"DESIGN ENGINEERING","X","X"]
[]
[]
[null,"Cost","Investment $ (x1000)",1000,500,0,0,0,0,0,null,null,null,null,0,0,0,0,0,0,0,0,0,0]
[]
[]
[null,"Implementation","Area-Wide",null,"X"]
[null,null,"Asset Specific","X","X"]
[null,null,"Temporary/Redeployable"]
[null,null,"Multipurpose Potential"]
[null,"Package","Basic",null,"X"]
[null,null,"Enhanced"]
[null,null,"Threat Responsive","X"]
[null,"Road Bridges",{"$f":"'CM Dictionary'!C22","v":"Small Explosives"},"L","L","L","L","L","L","L",null,null,null,null,"L","L","L","L","L","L","L","L","L","L"]
[null,null,{"$f":"'CM Dictionary'!C23","v":"Large Explosives"},"L","L","L","L","L","L","L",null,null,null,null,"L","L","L","L","L","L","L","L","L","L"]
[null,null,{"$f":"'CM Dictionary'!C24","v":"Chemical / Biological / Radiological "},"L","L","L","L","L","L","L",null,null,null,null,"L","L","L","L","L","L","L","L","L","L"]
[null,null,{"$f":"'CM Dictionary'!C25","v":"Criminal Acts"},"L","L","L","L","L","L","L",null,null,null,null,"L","L","L","L","L","L","L","L","L","L"]
[null,null,{"$f":"'CM Dictionary'!C26","v":"Fire"},"L","L","L","L","L","L","L",null,null,null,null,"L","L","L","L","L","L","L","L","L","L"]
[null,null,{"$f":"'CM Dictionary'!C27","v":"Impact Collision / Deterioration"},"L","L","L","L","L","L","L",null,null,null,null,"L","L","L","L","L","L","L","L","L","L"]
[null,null,{"$f":"'CM Dictionary'!C28","v":"HAZMAT"},"L","L","L","L","L","L","L",null,null,null,null,"L","L","L","L","L","L","L","L","L","L"]
[null,null,{"$f":"'CM Dictionary'!C29","v":"Flood"},"H","H","L","L","L","L","L",null,null,null,null,"L","L","L","L","L","L","L","L","L","L"]
[null,null,{"$f":"'CM Dictionary'!C30","v":"Earthquake"},"L","L","L","L","L","L","L",null,null,null,null,"L","L","L","L","L","L","L","L","L","L"]
[null,null,{"$f":"'CM Dictionary'!C31","v":"Extreme Weather"},"H","H","L","L","L","L","L",null,null,null,null,"L","L","L","L","L","L","L","L","L","L"]
[null,null,{"$f":"'CM Dictionary'!C32","v":"Mud/Landslide"},"M","M","L","L","L","L","L",null,null,null,null,"L","L","L","L","L","L","L","L","L","L"]
[null,"Road Tunnels",{"$f":"'CM Dictionary'!C33","v":"Small Explosives"},"L","L","L","L","L","L","L",null,null,null,null,"L","L","L","L","L","L","L","L","L","L"]
[null,null,{"$f":"'CM Dictionary'!C34","v":"Large Explosives"},"L","L","L","L","L","L","L",null,null,null,null,"L","L","L","L","L","L","L","L","L","L"]
[null,null,{"$f":"'CM Dictionary'!C35","v":"Chemical / Biological / Radiological "},"L","L","L","L","L","L","L",null,null,null,null,"L","L","L","L","L","L","L","L","L","L"]
[null,null,{"$f":"'CM Dictionary'!C36","v":"Criminal Acts"},"L","L","L","L","L","L","L",null,null,null,null,"L","L","L","L","L","L","L","L","L","L"]
[null,null,{"$f":"'CM Dictionary'!C37","v":"Fire"},"L","L","L","L","L","L","L",null,null,null,null,"L","L","L","L","L","L","L","L","L","L"]
[null,null,{"$f":"'CM Dictionary'!C38","v":"Impact Collision / Deterioration"},"L","L","L","L","L","L","L",null,null,null,null,"L","L","L","L","L","L","L","L","L","L"]
[null,null,{"$f":"'CM Dictionary'!C39","v":"HAZMAT"},"L","L","L","L","L","L","L",null,null,null,null,"L","L","L","L","L","L","L","L","L","L"]
[null,null,{"$f":"'CM Dictionary'!C40","v":"Flood"},"L","H","L","L","L","L","L",null,null,null,null,"L","L","L","L","L","L","L","L","L","L"]
[null,null,{"$f":"'CM Dictionary'!C41","v":"Earthquake"},"L","L","L","L","L","L","L",null,null,null,null,"L","L","L","L","L","L","L","L","L","L"]
[null,null,{"$f":"'CM Dictionary'!C42","v":"Extreme Weather"},"L","H","L","L","L","L","L",null,null,null,null,"L","L","L","L","L","L","L","L","L","L"]
[null,null,{"$f":"'CM Dictionary'!C43","v":"Mud/Landslide"},"L","L","L","L","L","L","L",null,null,null,null,"L","L","L","L","L","L","L","L","L","L"]
[null,"Transit Rail Station",{"$f":"'CM Dictionary'!C44","v":"Small Explosives"},"L","L","L","L","L","L","L",null,null,null,null,"L","L","L","L","L","L","L","L","L","L"]
[null,null,{"$f":"'CM Dictionary'!C45","v":"Large Explosives"},"L","L","L","L","L","L","L",null,null,null,null,"L","L","L","L","L","L","L","L","L","L"]
[null,null,{"$f":"'CM Dictionary'!C46","v":"Chemical / Biological / Radiological "},"L","L","L","L","L","L","L",null,null,null,null,"L","L","L","L","L","L","L","L","L","L"]
[null,null,{"$f":"'CM Dictionary'!C47","v":"Criminal Acts"},"L","L","L","L","L","L","L",null,null,null,null,"L","L","L","L","L","L","L","L","L","L"]
[null,null,{"$f":"'CM Dictionary'!C48","v":"Fire"},"L","L","L","L","L","L","L",null,null,null,null,"L","L","L","L","L","L","L","L","L","L"]
[null,null,{"$f":"'CM Dictionary'!C49","v":"Impact Collision / Deterioration"},"L","L","L","L","L","L","L",null,null,null,null,"L","L","L","L","L","L","L","L","L","L"]
[null,null,{"$f":"'CM Dictionary'!C50","v":"HAZMAT"},"L","L","L","L","L","L","L",null,null,null,null,"L","L","L","L","L","L","L","L","L","L"]
[null,null,{"$f":"'CM Dictionary'!C51","v":"Flood"},"L","L","L","L","L","L","L",null,null,null,null,"L","L","L","L","L","L","L","L","L","L"]
[null,null,{"$f":"'CM Dictionary'!C52","v":"Earthquake"},"L","L","L","L","L","L","L",null,null,null,null,"L","L","L","L","L","L","L","L","L","L"]
[null,null,{"$f":"'CM Dictionary'!C53","v":"Extreme Weather"},"L","L","L","L","L","L","L",null,null,null,null,"L","L","L","L","L","L","L","L","L","L"]
[null,null,{"$f":"'CM Dictionary'!C54","v":"Mud/Landslide"},"L","L","L","L","L","L","L",null,null,null,null,"L","L","L","L","L","L","L","L","L","L"]
[null,"Transit/Rail Bridges",{"$f":"'CM Dictionary'!C55","v":"Small Explosives"},"L","L","L","L","L","L","L",null,null,null,null,"L","L","L","L","L","L","L","L","L","L"]
[null,null,{"$f":"'CM Dictionary'!C56","v":"Large Explosives"},"L","L","L","L","L","L","L",null,null,null,null,"L","L","L","L","L","L","L","L","L","L"]
[null,null,{"$f":"'CM Dictionary'!C57","v":"Chemical / Biological / Radiological "},"L","L","L","L","L","L","L",null,null,null,null,"L","L","L","L","L","L","L","L","L","L"]
[null,null,{"$f":"'CM Dictionary'!C58","v":"Criminal Acts"},"L","L","L","L","L","L","L",null,null,null,null,"L","L","L","L","L","L","L","L","L","L"]
[null,null,{"$f":"'CM Dictionary'!C59","v":"Fire"},"L","L","L","L","L","L","L",null,null,null,null,"L","L","L","L","L","L","L","L","L","L"]
[null,null,{"$f":"'CM Dictionary'!C60","v":"Impact Collision / Deterioration"},"L","L","L","L","L","L","L",null,null,null,null,"L","L","L","L","L","L","L","L","L","L"]
[null,null,{"$f":"'CM Dictionary'!C61","v":"HAZMAT"},"L","L","L","L","L","L","L",null,null,null,null,"L","L","L","L","L","L","L","L","L","L"]
[null,null,{"$f":"'CM Dictionary'!C62","v":"Flood"},"H","L","L","L","L","L","L",null,null,null,null,"L","L","L","L","L","L","L","L","L","L"]
[null,null,{"$f":"'CM Dictionary'!C63","v":"Earthquake"},"L","L","L","L","L","L","L",null,null,null,null,"L","L","L","L","L","L","L","L","L","L"]
[null,null,{"$f":"'CM Dictionary'!C64","v":"Extreme Weather"},"H","L","L","L","L","L","L",null,null,null,null,"L","L","L","L","L","L","L","L","L","L"]
[null,null,{"$f":"'CM Dictionary'!C65","v":"Mud/Landslide"},"L","L","L","L","L","L","L",null,null,null,null,"L","L","L","L","L","L","L","L","L","L"]
[null,"Transit/Rail Tunnels",{"$f":"'CM Dictionary'!C66","v":"Small Explosives"},"L","L","L","L","L","L","L",null,null,null,null,"L","L","L","L","L","L","L","L","L","L"]
[null,null,{"$f":"'CM Dictionary'!C67","v":"Large Explosives"},"L","L","L","L","L","L","L",null,null,null,null,"L","L","L","L","L","L","L","L","L","L"]
[null,null,{"$f":"'CM Dictionary'!C68","v":"Chemical / Biological / Radiological "},"L","L","L","L","L","L","L",null,null,null,null,"L","L","L","L","L","L","L","L","L","L"]
[null,null,{"$f":"'CM Dictionary'!C69","v":"Criminal Acts"},"L","L","L","L","L","L","L",null,null,null,null,"L","L","L","L","L","L","L","L","L","L"]
[null,null,{"$f":"'CM Dictionary'!C70","v":"Fire"},"L","L","L","L","L","L","L",null,null,null,null,"L","L","L","L","L","L","L","L","L","L"]
[null,null,{"$f":"'CM Dictionary'!C71","v":"Impact Collision / Deterioration"},"L","L","L","L","L","L","L",null,null,null,null,"L","L","L","L","L","L","L","L","L","L"]
[null,null,{"$f":"'CM Dictionary'!C72","v":"HAZMAT"},"L","L","L","L","L","L","L",null,null,null,null,"L","L","L","L","L","L","L","L","L","L"]
[null,null,{"$f":"'CM Dictionary'!C73","v":"Flood"},"L","L","L","L","L","L","L",null,null,null,null,"L","L","L","L","L","L","L","L","L","L"]
[null,null,{"$f":"'CM Dictionary'!C74","v":"Earthquake"},"L","L","L","L","L","L","L",null,null,null,null,"L","L","L","L","L","L","L","L","L","L"]
[null,null,{"$f":"'CM Dictionary'!C75","v":"Extreme Weather"},"L","L","L","L","L","L","L",null,null,null,null,"L","L","L","L","L","L","L","L","L","L"]
[null,null,{"$f":"'CM Dictionary'!C76","v":"Mud/Landslide"},"L","L","L","L","L","L","L",null,null,null,null,"L","L","L","L","L","L","L","L","L","L"]
[null,"Admin & Support Facilities",{"$f":"'CM Dictionary'!C77","v":"Small Explosives"},"L","L","L","L","L","L","L",null,null,null,null,"L","L","L","L","L","L","L","L","L","L"]
[null,null,{"$f":"'CM Dictionary'!C78","v":"Large Explosives"},"L","L","L","L","L","L","L",null,null,null,null,"L","L","L","L","L","L","L","L","L","L"]
[null,null,{"$f":"'CM Dictionary'!C79","v":"Chemical / Biological / Radiological "},"L","L","L","L","L","L","L",null,null,null,null,"L","L","L","L","L","L","L","L","L","L"]
[null,null,{"$f":"'CM Dictionary'!C80","v":"Criminal Acts"},"L","L","L","L","L","L","L",null,null,null,null,"L","L","L","L","L","L","L","L","L","L"]
[null,null,{"$f":"'CM Dictionary'!C81","v":"Fire"},"L","L","L","L","L","L","L",null,null,null,null,"L","L","L","L","L","L","L","L","L","L"]
[null,null,{"$f":"'CM Dictionary'!C82","v":"Impact Collision / Deterioration"},"L","L","L","L","L","L","L",null,null,null,null,"L","L","L","L","L","L","L","L","L","L"]
[null,null,{"$f":"'CM Dictionary'!C83","v":"HAZMAT"},"L","L","L","L","L","L","L",null,null,null,null,"L","L","L","L","L","L","L","L","L","L"]
[null,null,{"$f":"'CM Dictionary'!C84","v":"Flood"},"L","L","L","L","L","L","L",null,null,null,null,"L","L","L","L","L","L","L","L","L","L"]
[null,null,{"$f":"'CM Dictionary'!C85","v":"Earthquake"},"L","L","L","L","L","L","L",null,null,null,null,"L","L","L","L","L","L","L","L","L","L"]
[null,null,{"$f":"'CM Dictionary'!C86","v":"Extreme Weather"},"L","L","L","L","L","L","L",null,null,null,null,"L","L","L","L","L","L","L","L","L","L"]
[null,null,{"$f":"'CM Dictionary'!C87","v":"Mud/Landslide"},"L","L","L","L","L","L","L",null,null,null,null,"L","L","L","L","L","L","L","L","L","L"]
[null,"Ferries",{"$f":"'CM Dictionary'!C88","v":"Small Explosives"},"L","L","L","L","L","L","L",null,null,null,null,"L","L","L","L","L","L","L","L","L","L"]
[null,null,{"$f":"'CM Dictionary'!C89","v":"Large Explosives"},"L","L","L","L","L","L","L",null,null,null,null,"L","L","L","L","L","L","L","L","L","L"]
[null,null,{"$f":"'CM Dictionary'!C90","v":"Chemical / Biological / Radiological "},"L","L","L","L","L","L","L",null,null,null,null,"L","L","L","L","L","L","L","L","L","L"]
[null,null,{"$f":"'CM Dictionary'!C91","v":"Criminal Acts"},"L","L","L","L","L","L","L",null,null,null,null,"L","L","L","L","L","L","L","L","L","L"]
[null,null,{"$f":"'CM Dictionary'!C92","v":"Fire"},"L","L","L","L","L","L","L",null,null,null,null,"L","L","L","L","L","L","L","L","L","L"]
[null,null,{"$f":"'CM Dictionary'!C93","v":"Impact Collision / Deterioration"},"L","L","L","L","L","L","L",null,null,null,null,"L","L","L","L","L","L","L","L","L","L"]
[null,null,{"$f":"'CM Dictionary'!C94","v":"HAZMAT"},"L","L","L","L","L","L","L",null,null,null,null,"L","L","L","L","L","L","L","L","L","L"]
[null,null,{"$f":"'CM Dictionary'!C95","v":"Flood"},"L","L","L","L","L","L","L",null,null,null,null,"L","L","L","L","L","L","L","L","L","L"]
[null,null,{"$f":"'CM Dictionary'!C96","v":"Earthquake"},"L","L","L","L","L","L","L",null,null,null,null,"L","L","L","L","L","L","L","L","L","L"]
[null,null,{"$f":"'CM Dictionary'!C97","v":"Extreme Weather"},"L","L","L","L","L","L","L",null,null,null,null,"L","L","L","L","L","L","L","L","L","L"]
[null,null,{"$f":"'CM Dictionary'!C98","v":"Mud/Landslide"},"L","L","L","L","L","L","L",null,null,null,null,"L","L","L","L","L","L","L","L","L","L"]
[null,"Fleets",{"$f":"'CM Dictionary'!C99","v":"Small Explosives"},"L","L","L","L","L","L","L",null,null,null,null,"L","L","L","L","L","L","L","L","L","L"]
[null,null,{"$f":"'CM Dictionary'!C100","v":"Large Explosives"},"L","L","L","L","L","L","L",null,null,null,null,"L","L","L","L","L","L","L","L","L","L"]
[null,null,{"$f":"'CM Dictionary'!C101","v":"Chemical / Biological / Radiological "},"L","L","L","L","L","L","L",null,null,null,null,"L","L","L","L","L","L","L","L","L","L"]
[null,null,{"$f":"'CM Dictionary'!C102","v":"Criminal Acts"},"L","L","L","L","L","L","L",null,null,null,null,"L","L","L","L","L","L","L","L","L","L"]
[null,null,{"$f":"'CM Dictionary'!C103","v":"Fire"},"L","L","L","L","L","L","L",null,null,null,null,"L","L","L","L","L","L","L","L","L","L"]
[null,null,{"$f":"'CM Dictionary'!C104","v":"Impact Collision / Deterioration"},"L","L","L","L","L","L","L",null,null,null,null,"L","L","L","L","L","L","L","L","L","L"]
[null,null,{"$f":"'CM Dictionary'!C105","v":"HAZMAT"},"L","L","L","L","L","L","L",null,null,null,null,"L","L","L","L","L","L","L","L","L","L"]
[null,null,{"$f":"'CM Dictionary'!C106","v":"Flood"},"L","L","L","L","L","L","L",null,null,null,null,"L","L","L","L","L","L","L","L","L","L"]
[null,null,{"$f":"'CM Dictionary'!C107","v":"Earthquake"},"L","L","L","L","L","L","L",null,null,null,null,"L","L","L","L","L","L","L","L","L","L"]
[null,null,{"$f":"'CM Dictionary'!C108","v":"Extreme Weather"},"L","L","L","L","L","L","L",null,null,null,null,"L","L","L","L","L","L","L","L","L","L"]
[null,null,{"$f":"'CM Dictionary'!C109","v":"Mud/Landslide"},"L","L","L","L","L","L","L",null,null,null,null,"L","L","L","L","L","L","L","L","L","L"]
[null,"Other",{"$f":"'CM Dictionary'!C110","v":"Small Explosives"},"L","L","L","L","L","L","L",null,null,null,null,"L","L","L","L","L","L","L","L","L","L"]
[null,null,{"$f":"'CM Dictionary'!C111","v":"Large Explosives"},"L","L","L","L","L","L","L",null,null,null,null,"L","L","L","L","L","L","L","L","L","L"]
[null,null,{"$f":"'CM Dictionary'!C112","v":"Chemical / Biological / Radiological "},"L","L","L","L","L","L","L",null,null,null,null,"L","L","L","L","L","L","L","L","L","L"]
[null,null,{"$f":"'CM Dictionary'!C113","v":"Criminal Acts"},"L","L","L","L","L","L","L",null,null,null,null,"L","L","L","L","L","L","L","L","L","L"]
[null,null,{"$f":"'CM Dictionary'!C114","v":"Fire"},"L","L","L","L","L","L","L",null,null,null,null,"L","L","L","L","L","L","L","L","L","L"]
[null,null,{"$f":"'CM Dictionary'!C115","v":"Impact Collision / Deterioration"},"L","L","L","L","L","L","L",null,null,null,null,"L","L","L","L","L","L","L","L","L","L"]
[null,null,{"$f":"'CM Dictionary'!C116","v":"HAZMAT"},"L","L","L","L","L","L","L",null,null,null,null,"L","L","L","L","L","L","L","L","L","L"]
[null,null,{"$f":"'CM Dictionary'!C117","v":"Flood"},"H","H","L","L","L","L","L",null,null,null,null,"L","L","L","L","L","L","L","L","L","L"]
[null,null,{"$f":"'CM Dictionary'!C118","v":"Earthquake"},"L","L","L","L","L","L","L",null,null,null,null,"L","L","L","L","L","L","L","L","L","L"]
[null,null,{"$f":"'CM Dictionary'!C119","v":"Extreme Weather"},"H","H","L","L","L","L","L",null,null,null,null,"L","L","L","L","L","L","L","L","L","L"]
[null,null,{"$f":"'CM Dictionary'!C120","v":"Mud/Landslide"},"L","M","L","L","L","L","L",null,null,null,null,"L","L","L","L","L","L","L","L","L","L"]

{"sheet":"CM Filter","index":17,"n_rows":20,"n_cols":22,"rows_kept":20,"cut":false,"hidden":false,"merged":[[8,0,13,0],[14,0,16,0],[17,0,18,0]]}
[]
[]
[null,null,null,null,null,null,null,null,null,null,null,"Basic","Area-Wide",null,"Y"]
[null,null,null,null,null,null,null,null,null,null,null,"Enhanced","Asset-Specific",null,"N"]
[null,null,null,null,null,null,null,null,null,null,null,"Both","Both"]
[]
[]
[null,null,null,"Road Bridges","Road Tunnels","Transit/Rail Station","Transit/Rail Bridges","Transit/Rail Tunnels","Admin & Support Facilities","Ferry","Fleet","Other",null,"Road Bridges","Road Tunnels","Transit/Rail Station","Transit/Rail Bridges","Transit/Rail Tunnels","Admin & Support Facilities","Ferry","Fleet","Other"]
["Functions","PREVENTION","Is prediction a desirable countermeasure function?","Y","Y","Y","Y","Y","Y","Y","Y","Y",null,"Y","Y","Y","Y","Y","Y","Y","Y","Y"]
[null,"PROTECTION","Is deterrence a desirable countermeasure function?","Y","Y","Y","Y","Y","Y","Y","Y","Y",null,"Y","Y","Y","Y","Y","Y","Y","Y","Y"]
[null,"MITIGATE","Is detection a desirable countermeasure function?","Y","Y","Y","Y","Y","Y","Y","Y","Y",null,"Y","Y","Y","Y","Y","Y","Y","Y","Y"]
[null,"RESPONSE PREP. ","Is interdiction a desirable countermeasure function?","Y","Y","Y","Y","Y","Y","Y","Y","Y",null,"Y","Y","Y","Y","Y","Y","Y","Y","Y"]
[null,"RECOVERY PREP.","Is response preparedness a desirable countermeasure function?","Y","Y","Y","Y","Y","Y","Y","Y","Y",null,"Y","Y","Y","Y","Y","Y","Y","Y","Y"]
[null,"DESIGN ENGINEERING","Are countermeasures related to design/engineering desirable?","Y","Y","Y","Y","Y","Y","Y","Y","Y",null,"Y","Y","Y","Y","Y","Y","Y","Y","Y"]
["Implementation","Area -Wide and Asset-Specific","Do you wish to consider only area-wide countermeasures, only asset-specific countermeasures, or both?","Both","Both","Both","Both","Both","Both","Both","Both","Both",null,"Both","Both","Both","Both","Both","Both","Both","Both","Both"]
[null,"Temporary/Redeployable","Do you wish to consider temp/redeployable countermeasures?","Y","Y","Y","Y","Y","Y","Y","Y","Y",null,"Y","Y","Y","Y","Y","Y","Y","Y","Y"]
[null,"Multipurpose Potential","Are you willing to consider CMs that are NOT multipurpose?","Y","Y","Y","Y","Y","Y","Y","Y","Y",null,"Y","Y","Y","Y","Y","Y","Y","Y","Y"]
["Package","Basic and Enhanced","Do you wish to consider only basic countermeasures, only enhanced countermeasures, or both?","Both","Both","Both","Both","Both","Both","Both","Both","Both",null,"Both","Both","Both","Both","Both","Both","Both","Both","Both"]
[null,"Threat Responsive","Do you wish to consider threat responsive countermeasures? (Answer \"N\" if only want permanent countermeasures.)","Y","Y","Y","Y","Y","Y","Y","Y","Y",null,"Y","Y","Y","Y","Y","Y","Y","Y","Y"]
["Cost","Max Unit Cost (x1000)","What is the maximum per unit countermeasure cost you are willing to pay?",999999,999999,999999,999999,999999,999999,999999,999999,999999,null,999999,999999,999999,999999,999999,999999,999999,999999,999999]

{"sheet":"CM Opportunities","index":18,"n_rows":75,"n_cols":78,"rows_kept":75,"cut":false,"hidden":false,"merged":[[78,1,86,1],[75,1,77,1],[9,9,10,11],[9,5,10,7],[65,1,74,1],[53,1,55,1],[56,1,64,1],[40,1,52,1],[15,1,18,1],[20,1,32,1],[34,1,39,1]]}
[]
[]
[]
[]
[]
[]
[]
[]
[]
[null,null,null,"Color Key",null,"Medium Effectiveness",null,null,null,"High Effectiveness"]
[]
["Y","X"]
[null,null,null,"ROAD BRIDGES","ROAD BRIDGES","ROAD BRIDGES","ROAD BRIDGES","ROAD BRIDGES","ROAD BRIDGES","ROAD BRIDGES","ROAD BRIDGES","ROAD BRIDGES","ROAD BRIDGES","ROAD BRIDGES","ROAD BRIDGES","ROAD BRIDGES","ROAD BRIDGES","ROAD BRIDGES","ROAD BRIDGES","ROAD BRIDGES","ROAD BRIDGES","ROAD BRIDGES","ROAD BRIDGES","ROAD BRIDGES","ROAD BRIDGES","ROAD BRIDGES","ROAD BRIDGES","ROAD BRIDGES","ROAD TUNNELS","ROAD TUNNELS","ROAD TUNNELS","ROAD TUNNELS","ROAD TUNNELS","ROAD TUNNELS","ROAD TUNNELS","ROAD TUNNELS","ROAD TUNNELS","ROAD TUNNELS","ROAD TUNNELS","TRANSIT/RAIL STATION","TRANSIT/RAIL STATION","TRANSIT/RAIL STATION","TRANSIT/RAIL STATION","TRANSIT/RAIL STATION","TRANSIT/RAIL STATION","TRANSIT/RAIL STATION","TRANSIT/RAIL STATION","TRANSIT/RAIL STATION","TRANSIT/RAIL STATION","TRANSIT/RAIL STATION","TRANSIT/RAIL STATION","TRANSIT/RAIL STATION","TRANSIT/RAIL BRIDGES","TRANSIT/RAIL BRIDGES","TRANSIT/RAIL BRIDGES","TRANSIT/RAIL BRIDGES","TRANSIT/RAIL BRIDGES","TRANSIT/RAIL BRIDGES","TRANSIT/RAIL TUNNELS","TRANSIT/RAIL TUNNELS","TRANSIT/RAIL TUNNELS","TRANSIT/RAIL TUNNELS","ADMIN & SUPPORT FACILITIES","ADMIN & SUPPORT FACILITIES","ADMIN & SUPPORT FACILITIES","ADMIN & SUPPORT FACILITIES","ADMIN & SUPPORT FACILITIES","ADMIN & SUPPORT FACILITIES","ADMIN & SUPPORT FACILITIES","ADMIN & SUPPORT FACILITIES","ADMIN & SUPPORT FACILITIES","ADMIN & SUPPORT FACILITIES","FLEET","FLEET","FLEET","FLEET","FLEET","OTHER"]
[null,null,null,"Road Bridges",null,null,null,null,null,null,null,null,null,null,null,null,null,null,null,null,null,null,null,null,null,null,null,null,"Road Tunnels",null,null,null,null,null,null,null,null,null,null,"Transit/Rail Station",null,null,null,null,null,null,null,null,null,null,null,null,"Transit/Rail Bridges",null,null,null,null,null,"Transit/Rail Tunnels",null,null,null,"Admin & Support Facilities",null,null,null,null,null,null,null,null,null,"FLEET",null,null,null,null,"OTHER"]
[null,null,null,"George's Island","High Rise","Blue River Bridge","State Line Bridge","Veteran's Bridge","Interstate Bridge","Morris Bridge","Route 500 River Bridge","Metropolitan Bridge","Point Park Bridge","Rt 17  Bridge","Military Highway Bridge","Rt 71 Bridge","Boulavard Bridge","Business Route Bridge","Memorial Bridge","New River Bridge","Old River Bridge","Lazy River Bridge","Muddy River Bridge","Crooked River Bridge","Beltway Interstate Bridge","Big River InterstateBridge","Big River InterstateBridge","Interstate Highway Ramp","Big Mountain Tunnel"," Bay Tunnel","Shoals Tunnel","Downtown Tunnel","East Mountain Tunnel","Uptown Tunnel","Midtown Tunnel","Memorial Tunnel","Harbor Tunnel","Airport Runway Tunnel","Parkland Tunnel","North Station","South Station","Bay Station","Downtown Station","Market Station","Park Street Station","Government Center","State Street","College Station","Suburban Station","Airport Station","All other aboveground ","All other belowground","River Bridge","Bay Bridge","Shipyard Bridge","Pedestrian","Highway Bridges - A","Highway Bridges - B","River Tunnel I","River Tunnel II","South Station Tunnel","Point Channel Tunnel","Rail Tunnel Ventilation ","Rail Tunnel Pump Stations","South Station -Bus Terminal","Bus maintenance Facility","Fuel Storage Sites","CNG Refueling Sites","Police HQ","Plaza Building","Operations Control Center","Parking garage","Red Line car","Blue Line","Orange Line car","Heavy rail  passenger","Heavy Rail control car","Cluverts"]
[null,"CRITICALITY","Exposure",null,null,"Y","Y","Y",null,null,null,null,null,null,null,null,null,null,null,null,null,null,null,null,null,null,null,null,null,null,null,"Y",null,"Y",null,"Y",null,null,null,"Y","Y","Y","Y","Y","Y","Y","Y","Y","Y","Y","Y","Y","Y","Y","Y","Y","Y","Y","Y","Y","Y","Y",null,null,"Y","Y",null,null,null,"Y",null,"Y","Y","Y","Y","Y","Y"]
[null,null,"Property",null,null,null,null,null,null,null,null,null,null,null,null,null,null,null,null,null,null,null,null,null,null,null,null,null,null,null,null,null,null,"Y",null,"Y",null,null,null,null,null,"Y","Y","Y","Y","Y","Y","Y","Y",null,null,"Y",null,null,null,"Y",null,null,null,null,null,null,null,null,null,null,null,null,null,null,null,null,null,null,null,"Y"]
[null,null,"Mission","Y","Y","Y","Y",null,"Y","Y","Y","Y","Y","Y","Y","Y","Y","Y","Y","Y","Y","Y","Y","Y","Y","Y","Y","Y","Y","Y","Y","Y","Y","Y","Y","Y","Y","Y","Y","Y","Y","Y","Y","Y","Y","Y","Y",null,"Y"]
[null,null,"Manual Override",null,null,null,null,null,null,null,null,null,null,null,null,null,null,null,null,null,null,null,null,null,null,null,null,null,null,null,null,null,null,null,null,null,null,null,null,null,null,null,null,null,null,null,null,null,null,null,null,null,null,null,null,null,null,null,null,null,null,null,"Y","Y",null,null,"Y","Y","Y",null,"Y",null,null,null,null,null,"Y","Y"]
[]
[null,"RELEVANT THREATS/ HAZARDS",{"$f":"'CM Dictionary'!C22","v":"Small Explosives"},null,null,"X","X","X",null,null,null,null,null,null,null,null,null,null,null,null,null,null,null,null,null,null,null,null,null,null,null,"X",null,"X",null,"X",null,null,null,"X","X","X","X","X","X","X","X","X","X","X","X","X","X","X","X","X","X","X","X","X","X","X","X","X","X","X","X","X","X","X","X","X","X","X","X","X","X"]
[null,null,{"$f":"'CM Dictionary'!C23","v":"Large Explosives"},"X","X","X","X","X","X","X","X","X","X","X","X","X","X","X","X","X","X","X","X","X","X","X","X","X","X","X","X","X","X","X","X","X","X","X","X","X","X","X","X","X","X","X","X","X","X","X","X","X","X","X","X","X","X","X","X","X","X","X","X","X","X","X","X","X","X","X","X","X","X","X","X","X","X"]
[null,null,{"$f":"'CM Dictionary'!C24","v":"Chemical / Biological / Radiological "},"X","X","X","X","X","X","X","X","X","X","X","X","X","X","X","X","X","X","X","X","X","X","X","X","X","X","X","X","X","X","X","X","X","X","X","X","X","X","X","X","X","X","X","X","X","X","X","X","X","X","X","X","X","X","X","X","X","X","X","X","X","X","X","X","X","X","X","X","X","X","X","X","X","X"]
[null,null,{"$f":"'CM Dictionary'!C25","v":"Criminal Acts"},null,null,null,null,null,null,null,null,null,null,null,null,null,null,null,null,null,null,null,null,null,null,null,null,null,null,null,null,null,null,null,null,null,null,null,null,null,null,null,null,null,null,null,null,null,null,null,null,null,null,null,null,null,null,null,null,null,null,null,"X","X",null,null,"X","X","X",null,"X",null,null,null,null,null,"X"]
[null,null,{"$f":"'CM Dictionary'!C26","v":"Fire"},"X","X","X","X","X","X","X","X","X","X","X","X","X","X","X","X","X","X","X","X","X","X","X","X","X","X","X","X","X","X","X","X","X","X","X","X","X","X","X","X","X","X","X","X","X","X","X","X","X","X","X","X","X","X","X","X","X","X","X","X","X","X","X","X","X","X","X","X","X","X","X","X","X","X"]
[null,null,{"$f":"'CM Dictionary'!C27","v":"Impact Collision / Deterioration"},"X","X","X","X","X","X","X","X","X","X","X","X","X","X","X","X","X","X","X","X","X","X","X","X","X","X","X","X","X","X","X","X","X","X","X","X","X","X","X","X","X","X","X","X","X","X","X","X","X","X","X","X","X","X","X","X","X","X","X","X","X","X","X","X","X","X","X","X","X",null,null,null,null,"X"]
[null,null,{"$f":"'CM Dictionary'!C28","v":"HAZMAT"},"X","X","X","X",null,"X","X","X","X","X","X","X","X","X","X","X","X","X","X","X","X","X","X","X","X","X","X","X","X","X","X","X","X","X","X","X","X","X","X","X","X","X","X","X",null,"X",null,null,null,null,null,null,null,null,null,null,null,null,null,"X","X",null,null,"X","X","X",null,"X",null,"X","X","X","X","X"]
[null,null,{"$f":"'CM Dictionary'!C29","v":"Flood"},"X","X","X","X","X","X","X","X","X","X","X","X","X","X","X","X","X","X","X","X","X","X","X","X","X","X","X","X","X","X","X","X","X","X","X","X","X","X","X","X","X","X","X","X","X","X","X","X","X","X","X","X","X","X","X","X","X","X","X","X","X",null,null,"X","X","X",null,"X",null,"X","X","X","X","X","X"]
[null,null,{"$f":"'CM Dictionary'!C30","v":"Earthquake"},"X","X","X","X","X","X","X","X","X","X","X","X","X","X","X","X","X","X","X","X","X","X","X","X","X","X","X","X","X","X","X","X","X","X","X","X",null,null,null,null,null,null,null,null,null,null,null,null,null,null,null,null,null,null,null,null,null,null,null,"X","X",null,null,"X","X","X",null,"X",null,"X","X","X","X","X","X"]
[null,null,{"$f":"'CM Dictionary'!C31","v":"Extreme Weather"},"X","X","X","X",null,"X","X","X","X","X","X","X","X","X","X","X","X","X","X","X","X","X","X","X","X","X","X","X","X","X","X","X","X","X","X","X","X","X","X","X","X","X","X","X","X","X",null,null,"X",null,null,null,"X",null,null,null,null,null,null,"X","X","X","X","X","X","X","X","X","X",null,null,null,"X","X","X"]
[null,null,{"$f":"'CM Dictionary'!C32","v":"Mud/Landslide"},"X","X","X","X",null,"X","X","X","X","X","X","X","X","X","X","X","X","X","X","X","X","X","X","X","X","X","X","X","X","X","X","X","X","X","X","X",null,null,null,null,null,null,null,null,null,null,null,null,null,null,null,null,null,null,null,null,null,null,null,"X","X",null,null,"X","X","X",null,"X",null,"X","X","X","X","X","X"]
[null,null,{"$f":"'Relevant Risks'!C28","v":"New hazard 1"},null,null,null,null,null,null,null,null,null,null,null,null,null,null,null,null,null,null,null,null,null,null,null,null,null,null,null,null,null,null,null,null,null,null,null,null,null,null,null,null,null,null,null,null,null,null,null,null,null,null,null,null,null,null,null,null,null,null,null,null,null,null,null,null,null,null,null,null,null,null,null,null,null,null,"X"]
[null,null,{"$f":"'Relevant Risks'!C29","v":"New hazard 2"}]
[null,null,"Quantity of Named Asset",1,null,null,null,null,null,null,null,null,null,null,null,null,null,null,null,null,null,null,null,null,null,null,null,null,1,1,1,1,1,1,1,1,1,1,1,2,4,1,1,1,1,1,1,1,1,3,20,13,1,1,1,1,23,23,1,1,1,1,3,null,null,null,null,null,null,null,null,null,120,120,120,240,42,100]
[null,"Physical Security Countermeasures",{"$f":"'CM Dictionary'!D3","v":"Lighting"}]
[null,null,{"$f":"'CM Dictionary'!E3","v":"Barriers & Berms"}]
[null,null,{"$f":"'CM Dictionary'!F3","v":"Fences"}]
[null,null,{"$f":"'CM Dictionary'!G3","v":"CCTV"}]
[null,null,{"$f":"'CM Dictionary'!H3","v":"Intrusion Detection Devices"}]
[null,null,{"$f":"'CM Dictionary'!I3","v":"Physical Inspection of asset"}]
[null,"Access Control Countermeasures",{"$f":"'CM Dictionary'!J3","v":"ID Cards"}]
[null,null,{"$f":"'CM Dictionary'!K3","v":"Biometrics"}]
[null,null,{"$f":"'CM Dictionary'!L3","v":"Background Checks"}]
[null,null,{"$f":"'CM Dictionary'!M3","v":"Metal Detectors"}]
[null,null,{"$f":"'CM Dictionary'!N3","v":"Restricted Parking"}]
[null,null,{"$f":"'CM Dictionary'!O3","v":"Random Inspections"}]
[null,null,{"$f":"'CM Dictionary'!P3","v":"Visible Badges"}]
[null,null,{"$f":"'CM Dictionary'!Q3","v":"Limited Access Points"}]
[null,null,{"$f":"'CM Dictionary'!R3","v":"Visitor Control & Escort"}]
[null,null,{"$f":"'CM Dictionary'!S3","v":"Locks"}]
[null,null,{"$f":"'CM Dictionary'!T3","v":"Explosive Detection"}]
[null,null,{"$f":"'CM Dictionary'!U3","v":"Establish Clear Zones"}]
[null,null,{"$f":"'CM Dictionary'!V3","v":"Visible Signs"}]
[null,"Asset Design/Engr",{"$f":"'CM Dictionary'!W3","v":"Seismic Retrofitting"}]
[null,null,{"$f":"'CM Dictionary'!X3","v":"Fire Detection & Supression"}]
[null,null,{"$f":"'CM Dictionary'!Y3","v":"Encasement, Wrapping, Jacketing"}]
[null,"Operational Countermeasures",{"$f":"'CM Dictionary'!Z3","v":"Patrols"}]
[null,null,{"$f":"'CM Dictionary'!AA3","v":"WX/Seismic Information"}]
[null,null,{"$f":"'CM Dictionary'!AB3","v":"Intelligence Networking"}]
[null,null,{"$f":"'CM Dictionary'!AC3","v":"HAZMAT Mitigation"}]
[null,null,{"$f":"'CM Dictionary'!AD3","v":"Security Awareness Training"}]
[null,null,{"$f":"'CM Dictionary'!AE3","v":"Emergency Response Training"}]
[null,null,{"$f":"'CM Dictionary'!AF3","v":"Emergency Evacuation Planning"}]
[null,null,{"$f":"'CM Dictionary'!AG3","v":"Planned Redundancy (e.g., detours)"}]
[null,null,{"$f":"'CM Dictionary'!AH3","v":"Public Information and Dissemination"}]
[null,"Asset Specific Countermeasures/Other",{"$f":"'CM Dictionary'!AI3","v":"Safe Room"}]
[null,null,{"$f":"'CM Dictionary'!AJ3","v":"Bracing/Tie-Downs"}]
[null,null,{"$f":"'CM Dictionary'!AK3","v":"Pump Equipment "}]
[null,null,{"$f":"'CM Dictionary'!AL3","v":"Scour Measures"}]
[null,null,{"$f":"'CM Dictionary'!AM3","v":"Stormwater Mgt"}]
[null,null,{"$f":"'CM Dictionary'!AN3","v":"Other 3"}]
[null,null,{"$f":"'CM Dictionary'!AO3","v":"Other 4"}]
[null,null,{"$f":"'CM Dictionary'!AP3","v":"Other 5"}]
[null,null,{"$f":"'CM Dictionary'!AQ3","v":"Other 6"}]
[null,null,{"$f":"'CM Dictionary'!AR3","v":"Other 7"}]

{"sheet":"CM Dictionary","index":19,"n_rows":120,"n_cols":44,"rows_kept":120,"cut":false,"hidden":false,"merged":[[0,34,0,36],[0,37,0,43],[0,9,0,21],[32,1,42,1],[21,1,31,1],[18,1,20,1],[3,1,10,1],[0,25,0,33],[11,0,20,0],[11,1,13,1],[14,1,17,1],[43,1,53,1],[0,22,0,24],[3,0,8,0],[21,0,119,0],[65,1,75,1],[87,1,97,1],[109,1,119,1],[54,1,64,1],[76,1,86,1],[98,1,108,1],[0,3,0,8]]}
[null,null,null,"Physical Security Countermeasures",null,null,null,null,null,"Access Control Countermeasures",null,null,null,null,null,null,null,null,null,null,null,null,"Asset Design/Engineering",null,null,"Operational Countermeasures",null,null,null,null,null,null,null,null,"Asset Specific Countermeasures",null,null,"Additional Countermeasures"]
[null,null,null,1,2,3,4,5,6,7,8,9,10,11,12,13,14,15,16,17,18,19,20,21,22,23,24,25,26,27,28,29,30,31,32,33,34,35,36,37,38,39,40,41]
[null,null,"Countermeasure","Lighting","Barriers & Berms","Fences","CCTV","Intrusion Detection Devices","Physical Inspection of asset","ID Cards","Biometrics","Background Checks","Metal Detectors","Restricted Parking","Random Inspections","Visible Badges","Limited Access Points","Visitor Control & Escort","Locks","Explosive Detection","Establish Clear Zones","Visible Signs","Seismic Retrofitting","Fire Detection & Supression","Encasement, Wrapping, Jacketing","Patrols","WX/Seismic Information","Intelligence Networking","HAZMAT Mitigation","Security Awareness Training","Emergency Response Training","Emergency Evacuation Planning","Planned Redundancy (e.g., detours)","Public Information and Dissemination",{"$f":"'CM Costs'!D43","v":"Safe Room"},{"$f":"'CM Costs'!D44","v":"Bracing/Tie-Downs"},{"$f":"'CM Costs'!D45","v":"Pump Equipment "},{"$f":"'Additional CMs'!D11","v":"Scour Measures"},{"$f":"'Additional CMs'!E11","v":"Stormwater Mgt"},{"$f":"'Additional CMs'!F11","v":"Other 3"},{"$f":"'Additional CMs'!G11","v":"Other 4"},{"$f":"'Additional CMs'!H11","v":"Other 5"},{"$f":"'Additional CMs'!I11","v":"Other 6"},{"$f":"'Additional CMs'!J11","v":"Other 7"}]
["CM Attributes","Functions","PREVENTION",null,null,null,null,null,"X",null,null,null,null,null,null,null,null,null,null,null,null,null,null,null,null,null,"X","X"]
[null,null,"PROTECTION","X","X","X","X","X",null,"X","X",null,null,"X",null,"X",null,null,"X",null,null,"X",null,null,null,null,null,null,null,null,null,null,null,null,null,null,null,"X"]
[null,null,"MITIGATE","X","X","X","X","X",null,null,null,"X","X",null,"X",null,"X",null,null,"X","X",null,null,"X",null,"X",null,null,null,null,null,null,null,null,"X","X","X","X","X"]
[null,null,"RESPONSE PREP. ",null,null,null,null,null,null,null,null,null,null,null,null,null,null,"X",null,null,null,null,null,null,null,null,null,null,null,null,null,null,null,null,"X"]
[null,null,"RECOVERY PREP.",null,null,null,null,null,null,null,null,null,null,null,null,null,null,null,null,null,null,null,null,"X","X",null,"X",null,"X","X","X","X","X","X","X"]
[null,null,"DESIGN ENGINEERING",null,null,null,null,null,null,null,null,null,null,null,null,null,null,null,null,null,null,null,"X",null,null,null,null,null,null,null,null,null,null,null,"X","X","X","X","X"]
[]
[]
[null,"Cost","Investment $ (x1000)",{"$f":"TRANSPOSE('CM Costs'!E12:E42)","v":8.0000640000000001},8.6006400000000003,33.599616000000005,34.749632000000005,0.76500544000000004,79.999552000000008,7.4995840000000005,34.999871999999996,79.999552000000008,38.499968000000003,37.800384000000008,30.000512000000004,27.999680000000001,27.999680000000001,27.999680000000001,1.200064,153.99987200000001,8.7312000000000012,4.5043200000000005E-2,1000.0003840000002,500.47129600000005,3499.9980800000003,52.999744000000007,135.00012800000002,135.00012800000002,400.99980799999997,25.000064000000002,139.99948799999999,54.400000000000006,307.07494400000002,50.000128000000004,{"$f":"'CM Costs'!E43","v":16},{"$f":"'CM Costs'!E44","v":500},{"$f":"'CM Costs'!E45","v":500},1000,500,0,0,0,0,0]
[]
[]
[null,"Implementation","Area-Wide",null,null,null,null,null,null,"X","X","X",null,null,"X","X",null,null,null,null,null,null,null,null,null,"X","X","X","X","X","X","X","X","X",null,null,null,null,"X"]
[null,null,"Asset Specific","X","X","X","X","X","X",null,null,null,"X","X",null,null,"X","X","X","X","X","X","X","X","X",null,null,null,null,null,null,null,null,null,"X","X","X","X","X"]
[null,null,"Temporary/Redeployable",null,null,null,null,null,"X",null,null,null,null,null,"X",null,"X","X",null,"X",null,null,null,null,null,"X",null,"X","X"]
[null,null,"Multipurpose Potential","X","X","X","X","X","X",null,null,null,null,null,null,null,null,null,null,null,null,null,"X","X","X","X","X",null,null,null,null,null,null,"X"]
[null,"Package","Basic","X","X","X","X","X","X","X",null,"X",null,"X",null,"X",null,"X","X",null,"X","X",null,null,null,"X","X","X","X","X","X","X","X","X",null,null,null,null,"X"]
[null,null,"Enhanced",null,null,null,null,null,null,null,"X",null,"X",null,null,null,null,null,null,"X",null,null,"X","X","X"]
[null,null,"Threat Responsive",null,null,null,null,null,"X",null,null,null,null,null,"X",null,"X",null,null,null,null,null,null,null,null,"X",null,"X",null,null,null,null,null,"X",null,null,null,"X"]
[null,"Road Bridges","Small Explosives","L","H","H","M","M","H","L","M","L","M","L","H","L","M","M","M","H","H","L","H","H","H","H","L","M","L","H","H","H","H","H","L","M","L","L","L","L","L","L","L","L"]
[null,null,"Large Explosives","M","M","M","M","M","M","L","M","L","L","M","M","M","M","M","M","H","M","L","H","M","H","H","L","M","L","M","M","M","M","H","L","L","L","L","L","L","L","L","L","L"]
[null,null,"Chemical / Biological / Radiological ","M","L","L","L","M","H","L","M","L","L","M","H","L","M","M","M","L","M","L","L","M","L","H","M","M","H","L","H","H","H","H","L","L","L","L","L","L","L","L","L","L"]
[null,null,"Criminal Acts","M","M","M","M","M","M","L","L","M","L","M","M","M","M","M","H","L","H","M","M","M","H","H","L","L","L","H","M","M","M","H","L","M","L","L","L","L","L","L","L","L"]
[null,null,"Fire","M","M","L","M","L","L","L","L","L","L","L","L","L","L","L","L","L","H","L","H","H","H","H","L","L","L","L","H","H","H","H","L","L","M","L","L","L","L","L","L","L"]
[null,null,"Impact Collision / Deterioration","L","L","L","L","L","H","L","L","L","L","L","L","L","L","L","L","L","L","L","H","L","H","L","L","L","L","L","H","H","H","H","L","H","L","L","L","L","L","L","L","L"]
[null,null,"HAZMAT","L","L","L","L","L","H","L","L","L","L","L","L","L","L","L","L","L","M","L","L","H","L","M","M","L","H","L","H","H","H","H","L","L","L","L","L","L","L","L","L","L"]
[null,null,"Flood","L","M","L","L","L","H","L","L","L","L","L","L","L","L","L","L","L","M","L","H","L","L","H","H","L","L","L","H","H","H","H","L","M","H","H","H","L","L","L","L","L"]
[null,null,"Earthquake","L","L","L","L","L","L","L","L","L","L","L","L","L","L","L","L","L","L","L","H","M","H","M","H","L","L","L","H","H","H","H","L","M","L","L","L","L","L","L","L","L"]
[null,null,"Extreme Weather","L","M","L","L","L","H","L","L","L","L","L","L","L","L","L","L","L","L","L","H","L","H","M","H","L","L","L","H","H","H","H","L","H","H","H","H","L","L","L","L","L"]
[null,null,"Mud/Landslide","L","M","L","L","L","H","L","L","L","L","L","L","L","L","L","L","L","L","L","H","L","H","M","H","L","L","L","H","H","H","H","L","M","M","M","M","L","L","L","L","L"]
[null,"Road Tunnels","Small Explosives","L","H","H","M","M","H","L","M","L","M","L","H","L","M","M","M","H","H","L","H","H","H","H","L","M","L","H","H","H","H","H","L","L","L","L","L","L","L","L","L","L"]
[null,null,"Large Explosives","M","M","M","M","M","M","L","M","L","L","M","M","M","M","M","M","H","M","L","H","M","H","H","L","M","L","M","M","M","M","H","L","L","L","L","L","L","L","L","L","L"]
[null,null,"Chemical / Biological / Radiological ","M","L","L","L","M","H","L","M","L","L","M","H","L","M","M","M","L","M","L","L","M","L","H","M","M","H","L","H","H","H","H","L","L","L","L","L","L","L","L","L","L"]
[null,null,"Criminal Acts","M","M","M","M","M","M","L","L","M","L","M","M","M","M","M","H","L","H","M","M","M","H","H","L","L","L","H","M","M","M","H","L","L","L","L","L","L","L","L","L","L"]
[null,null,"Fire","M","M","L","M","L","L","L","L","L","L","L","L","L","L","L","L","L","H","L","H","H","H","H","L","L","L","L","H","H","H","H","L","L","M","L","L","L","L","L","L","L"]
[null,null,"Impact Collision / Deterioration","L","L","L","L","L","H","L","L","L","L","L","L","L","L","L","L","L","L","L","H","L","H","L","L","L","L","L","H","H","H","H","L","L","L","L","L","L","L","L","L","L"]
[null,null,"HAZMAT","L","L","L","L","L","H","L","L","L","L","L","L","L","L","L","L","L","M","L","L","H","L","M","M","L","H","L","H","H","H","H","L","L","L","L","L","L","L","L","L","L"]
[null,null,"Flood","L","M","L","L","L","H","L","L","L","L","L","L","L","L","L","L","L","M","L","H","L","L","H","H","L","L","L","H","H","H","H","L","L","H","L","H","L","L","L","L","L"]
[null,null,"Earthquake","L","L","L","L","L","L","L","L","L","L","L","L","L","L","L","L","L","L","L","H","M","H","M","H","L","L","L","H","H","H","H","L","L","L","L","L","L","L","L","L","L"]
[null,null,"Extreme Weather","L","M","L","L","L","H","L","L","L","L","L","L","L","L","L","L","L","L","L","H","L","H","M","H","L","L","L","H","H","H","H","L","L","H","L","H","L","L","L","L","L"]
[null,null,"Mud/Landslide","L","M","L","L","L","H","L","L","L","L","L","L","L","L","L","L","L","L","L","H","L","H","M","H","L","L","L","H","H","H","H","L","L","M","L","L","L","L","L","L","L"]
[null,"Transit/Rail Station","Small Explosives","M","L","L","M","M","H","L","M","L","M","L","H","L","M","M","M","H","H","L","H","H","H","H","L","M","L","H","H","H","H","H","H","M","L","L","L","L","L","L","L","L"]
[null,null,"Large Explosives","M","M","M","M","M","M","L","M","L","L","M","M","M","M","M","M","H","M","L","H","M","H","H","L","M","L","M","M","M","M","H","M","L","L","L","L","L","L","L","L","L"]
[null,null,"Chemical / Biological / Radiological ","M","L","L","L","M","H","L","M","L","L","M","H","L","M","M","M","L","M","L","L","M","L","H","M","M","H","L","H","H","H","H","M","L","L","L","L","L","L","L","L","L"]
[null,null,"Criminal Acts","M","L","L","M","M","M","L","L","M","L","M","M","M","M","M","H","L","H","M","M","M","H","H","L","L","L","H","M","M","M","H","L","M","L","L","L","L","L","L","L","L"]
[null,null,"Fire","M","M","L","M","L","L","L","L","L","L","L","L","L","L","L","L","L","H","L","H","H","H","H","L","L","L","L","H","H","H","H","M","L","M","L","L","L","L","L","L","L"]
[null,null,"Impact Collision / Deterioration","L","L","L","L","L","H","L","L","L","L","L","L","L","L","L","L","L","L","L","H","L","H","L","L","L","L","L","H","H","H","H","H","H","L","L","L","L","L","L","L","L"]
[null,null,"HAZMAT","L","L","L","L","L","H","L","L","L","L","L","L","L","L","L","L","L","M","L","L","H","L","M","M","L","H","L","H","H","H","H","M","L","L","L","L","L","L","L","L","L"]
[null,null,"Flood","L","M","L","L","L","H","L","L","L","L","L","L","L","L","L","L","L","M","L","H","L","L","H","H","L","L","L","H","H","H","H","L","M","H","L","L","L","L","L","L","L"]
[null,null,"Earthquake","L","L","L","L","L","L","L","L","L","L","L","L","L","L","L","L","L","L","L","H","M","H","M","H","L","L","L","H","H","H","H","M","M","L","L","L","L","L","L","L","L"]
[null,null,"Extreme Weather","L","M","L","L","L","H","L","L","L","L","L","L","L","L","L","L","L","L","L","H","L","H","M","H","L","L","L","H","H","H","H","H","H","H","L","L","L","L","L","L","L"]
[null,null,"Mud/Landslide","L","M","L","L","L","H","L","L","L","L","L","L","L","L","L","L","L","L","L","H","L","H","M","H","L","L","L","H","H","H","H","L","M","M","L","L","L","L","L","L","L"]
[null,"Transit/Rail Bridges","Small Explosives","M","M","L","M","L","H","H","L","L","M","L","H","L","H","H","M","H","H","L","H","H","H","H","L","M","L","H","H","H","H","H","L","M","L","L","L","L","L","L","L","L"]
[null,null,"Large Explosives","M","H","H","M","H","H","H","H","H","H","L","H","L","H","H","H","H","M","L","H","H","H","H","L","M","L","H","H","H","H","H","L","L","L","L","L","L","L","L","L","L"]
[null,null,"Chemical / Biological / Radiological ","M","L","L","M","L","H","L","L","L","L","L","L","L","L","L","L","L","M","L","L","H","L","M","L","M","H","H","H","H","H","H","L","L","L","L","L","L","L","L","L","L"]
[null,null,"Criminal Acts","M","L","L","M","M","M","L","L","M","L","M","M","M","M","M","H","L","L","M","M","M","H","H","L","L","L","H","M","M","M","H","L","M","L","L","L","L","L","L","L","L"]
[null,null,"Fire","M","M","L","M","L","L","L","L","L","L","L","L","L","L","L","L","L","H","L","H","H","H","H","L","L","L","L","H","H","H","H","L","L","M","L","L","L","L","L","L","L"]
[null,null,"Impact Collision / Deterioration","L","L","L","L","L","H","L","L","L","L","L","L","L","L","L","L","L","L","L","H","L","H","L","L","L","L","L","H","H","H","H","L","H","L","L","L","L","L","L","L","L"]
[null,null,"HAZMAT","L","L","L","L","L","H","L","L","L","L","L","L","L","L","L","L","L","M","L","L","H","L","M","M","L","H","L","H","H","H","H","L","L","L","L","L","L","L","L","L","L"]
[null,null,"Flood","L","M","L","L","L","H","L","L","L","L","L","L","L","L","L","L","L","M","L","H","L","L","H","H","L","L","L","H","H","H","H","L","M","H","H","L","L","L","L","L","L"]
[null,null,"Earthquake","L","L","L","L","L","L","L","L","L","L","L","L","L","L","L","L","L","L","L","H","M","H","M","H","L","L","L","H","H","H","H","L","M","L","L","L","L","L","L","L","L"]
[null,null,"Extreme Weather","L","M","L","L","L","H","L","L","L","L","L","L","L","L","L","L","L","L","L","H","L","H","M","H","L","L","L","H","H","H","H","L","H","H","H","L","L","L","L","L","L"]
[null,null,"Mud/Landslide","L","M","L","L","L","H","L","L","L","L","L","L","L","L","L","L","L","L","L","H","L","H","M","H","L","L","L","H","H","H","H","L","M","M","L","L","L","L","L","L","L"]
[null,"Transit/Rail Tunnels","Small Explosives","M","M","L","M","L","H","H","L","L","M","L","H","L","H","H","M","H","H","L","H","H","H","H","L","M","L","H","H","H","H","H","L","L","L","L","L","L","L","L","L","L"]
[null,null,"Large Explosives","M","H","H","M","H","H","H","H","H","H","L","H","L","H","H","H","H","M","L","H","H","H","H","L","M","L","H","H","H","H","H","L","L","L","L","L","L","L","L","L","L"]
[null,null,"Chemical / Biological / Radiological ","M","L","L","M","L","H","L","L","L","L","L","L","L","L","L","L","L","M","L","L","H","L","M","L","M","H","H","H","H","H","H","L","L","L","L","L","L","L","L","L","L"]
[null,null,"Criminal Acts","M","L","L","M","M","M","L","L","M","L","M","M","M","M","M","H","L","L","M","M","M","H","H","L","L","L","H","M","M","M","H","L","L","L","L","L","L","L","L","L","L"]
[null,null,"Fire","M","M","L","M","L","L","L","L","L","L","L","L","L","L","L","L","L","H","L","H","H","H","H","L","L","L","L","H","H","H","H","L","L","M","L","L","L","L","L","L","L"]
[null,null,"Impact Collision / Deterioration","L","L","L","L","L","H","L","L","L","L","L","L","L","L","L","L","L","L","L","H","L","H","L","L","L","L","L","H","H","H","H","L","L","L","L","L","L","L","L","L","L"]
[null,null,"HAZMAT","L","L","L","L","L","H","L","L","L","L","L","L","L","L","L","L","L","M","L","L","H","L","M","M","L","H","L","H","H","H","H","L","L","L","L","L","L","L","L","L","L"]
[null,null,"Flood","L","M","L","L","L","H","L","L","L","L","L","L","L","L","L","L","L","M","L","H","L","L","H","H","L","L","L","H","H","H","H","L","L","H","L","L","L","L","L","L","L"]
[null,null,"Earthquake","L","L","L","L","L","L","L","L","L","L","L","L","L","L","L","L","L","L","L","H","M","H","M","H","L","L","L","H","H","H","H","L","L","L","L","L","L","L","L","L","L"]
[null,null,"Extreme Weather","L","M","L","L","L","H","L","L","L","L","L","L","L","L","L","L","L","L","L","H","L","H","M","H","L","L","L","H","H","H","H","L","L","H","L","L","L","L","L","L","L"]
[null,null,"Mud/Landslide","L","M","L","L","L","H","L","L","L","L","L","L","L","L","L","L","L","L","L","H","L","H","M","H","L","L","L","H","H","H","H","L","L","M","L","L","L","L","L","L","L"]
[null,"Admin & Support Facilities","Small Explosives","M","L","L","M","M","H","L","M","L","M","L","H","L","M","M","M","H","H","L","H","H","H","H","L","M","L","H","H","H","H","H","M","M","L","L","L","L","L","L","L","L"]
[null,null,"Large Explosives","M","M","M","M","M","M","L","M","L","L","M","M","M","M","M","M","H","M","L","H","M","H","H","L","M","L","M","M","M","M","H","L","L","L","L","L","L","L","L","L","L"]
[null,null,"Chemical / Biological / Radiological ","M","L","L","L","M","H","L","M","L","L","M","H","L","M","M","M","L","M","L","L","M","L","H","M","M","H","L","H","H","H","H","L","L","L","L","L","L","L","L","L","L"]
[null,null,"Criminal Acts","M","L","L","M","M","M","L","L","M","L","M","M","M","M","M","H","L","H","M","M","M","H","H","L","L","L","H","M","M","M","H","M","M","L","L","L","L","L","L","L","L"]
[null,null,"Fire","L","L","L","L","L","L","L","L","L","L","L","L","L","L","L","L","L","H","L","H","H","H","M","L","L","L","M","H","H","H","H","L","L","M","L","L","L","L","L","L","L"]
[null,null,"Impact Collision / Deterioration","L","L","L","L","L","H","L","L","L","L","L","L","L","L","L","L","L","L","L","H","L","H","L","M","L","L","L","H","H","H","H","H","H","L","L","L","L","L","L","L","L"]
[null,null,"HAZMAT","L","L","L","L","L","M","L","L","L","L","L","L","L","L","L","L","L","M","L","L","M","L","L","L","L","H","L","H","H","H","H","L","L","L","L","L","L","L","L","L","L"]
[null,null,"Flood","L","M","L","L","L","H","L","L","L","L","L","L","L","L","L","L","L","M","L","H","L","H","L","H","L","L","L","H","H","H","H","M","M","H","L","L","L","L","L","L","L"]
[null,null,"Earthquake","L","L","L","L","L","L","L","L","L","L","L","L","L","L","L","L","L","L","L","H","L","H","L","H","L","L","L","H","H","H","H","M","M","L","L","L","L","L","L","L","L"]
[null,null,"Extreme Weather","L","M","L","L","L","L","L","L","L","L","L","L","L","L","L","L","L","L","L","H","L","H","L","H","L","L","L","H","H","H","H","H","H","H","L","L","L","L","L","L","L"]
[null,null,"Mud/Landslide","L","M","L","L","L","L","L","L","L","L","L","L","L","L","L","L","L","L","L","H","L","H","L","H","L","L","L","H","H","H","H","M","M","M","L","L","L","L","L","L","L"]
[null,"Ferries","Small Explosives","M","L","L","M","M","H","L","M","L","M","L","H","L","M","M","M","H","H","L","H","H","H","H","L","M","L","H","H","H","H","H","L","M","L","L","L","L","L","L","L","L"]
[null,null,"Large Explosives","M","M","M","M","M","M","L","M","L","L","M","M","M","M","M","M","H","M","L","H","M","H","H","L","M","L","M","M","M","M","H","L","L","L","L","L","L","L","L","L","L"]
[null,null,"Chemical / Biological / Radiological ","M","L","L","L","M","H","L","M","L","L","M","H","L","M","M","M","L","M","L","L","M","L","H","M","M","H","L","H","H","H","H","L","L","L","L","L","L","L","L","L","L"]
[null,null,"Criminal Acts","M","L","L","M","M","M","L","L","M","L","M","M","M","M","M","H","L","H","M","M","M","H","H","L","L","L","H","M","M","M","H","L","M","L","L","L","L","L","L","L","L"]
[null,null,"Fire","L","L","L","L","L","L","L","L","L","L","L","L","L","L","L","L","L","H","L","H","H","H","M","L","L","L","M","H","H","H","H","L","L","M","L","L","L","L","L","L","L"]
[null,null,"Impact Collision / Deterioration","L","L","L","L","L","H","L","L","L","L","L","L","L","L","L","L","L","L","L","H","L","H","L","M","L","L","L","H","H","H","H","L","H","L","L","L","L","L","L","L","L"]
[null,null,"HAZMAT","L","L","L","L","L","M","L","L","L","L","L","L","L","L","L","L","L","M","L","L","M","L","L","L","L","H","L","H","H","H","H","L","L","L","L","L","L","L","L","L","L"]
[null,null,"Flood","L","M","L","L","L","H","L","L","L","L","L","L","L","L","L","L","L","M","L","H","L","H","L","H","L","L","L","H","H","H","H","L","M","H","L","L","L","L","L","L","L"]
[null,null,"Earthquake","L","L","L","L","L","L","L","L","L","L","L","L","L","L","L","L","L","L","L","H","L","H","L","H","L","L","L","H","H","H","H","L","M","L","L","L","L","L","L","L","L"]
[null,null,"Extreme Weather","L","M","L","L","L","L","L","L","L","L","L","L","L","L","L","L","L","L","L","H","L","H","L","H","L","L","L","H","H","H","H","L","H","H","L","L","L","L","L","L","L"]
[null,null,"Mud/Landslide","L","M","L","L","L","L","L","L","L","L","L","L","L","L","L","L","L","L","L","H","L","H","L","H","L","L","L","H","H","H","H","L","M","M","L","L","L","L","L","L","L"]
[null,"Fleets","Small Explosives","M","L","L","M","M","H","L","M","L","M","L","H","L","M","M","M","H","H","L","H","H","H","H","L","M","L","H","H","H","H","H","L","M","L","L","L","L","L","L","L","L"]
[null,null,"Large Explosives","M","M","M","M","M","M","L","M","L","L","M","M","M","M","M","M","H","M","L","H","M","H","H","L","M","L","M","M","M","M","H","L","L","L","L","L","L","L","L","L","L"]
[null,null,"Chemical / Biological / Radiological ","M","L","L","L","M","H","L","M","L","L","M","H","L","M","M","M","L","M","L","L","M","L","H","M","M","H","L","H","H","H","H","L","L","L","L","L","L","L","L","L","L"]
[null,null,"Criminal Acts","M","L","L","M","M","M","L","L","M","L","M","M","M","M","M","H","L","H","M","M","M","H","H","L","L","L","H","M","M","M","H","L","M","L","L","L","L","L","L","L","L"]
[null,null,"Fire","L","L","L","L","L","L","L","L","L","L","L","L","L","L","L","L","L","H","L","H","H","H","M","L","L","L","M","H","H","H","H","L","L","M","L","L","L","L","L","L","L"]
[null,null,"Impact Collision / Deterioration","L","L","L","L","L","H","L","L","L","L","L","L","L","L","L","L","L","L","L","H","L","H","L","M","L","L","L","H","H","H","H","L","H","L","L","L","L","L","L","L","L"]
[null,null,"HAZMAT","L","L","L","L","L","M","L","L","L","L","L","L","L","L","L","L","L","M","L","L","M","L","L","L","L","H","L","H","H","H","H","L","L","L","L","L","L","L","L","L","L"]
[null,null,"Flood","L","M","L","L","L","H","L","L","L","L","L","L","L","L","L","L","L","M","L","H","L","H","L","H","L","L","L","H","H","H","H","L","M","H","L","L","L","L","L","L","L"]
[null,null,"Earthquake","L","L","L","L","L","L","L","L","L","L","L","L","L","L","L","L","L","L","L","H","L","H","L","H","L","L","L","H","H","H","H","L","M","L","L","L","L","L","L","L","L"]
[null,null,"Extreme Weather","L","M","L","L","L","L","L","L","L","L","L","L","L","L","L","L","L","L","L","H","L","H","L","H","L","L","L","H","H","H","H","L","H","H","L","L","L","L","L","L","L"]
[null,null,"Mud/Landslide","L","M","L","L","L","L","L","L","L","L","L","L","L","L","L","L","L","L","L","H","L","H","L","H","L","L","L","H","H","H","H","L","L","L","L","L","L","L","L","L","L"]
[null,"Other","Small Explosives","L","L","L","L","L","L","L","L","L","L","L","L","L","L","L","L","L","L","L","L","L","L","L","L","L","L","L","L","L","L","L","L","L","L","L","L","L","L","L","L","L"]
[null,null,"Large Explosives","L","L","L","L","L","L","L","L","L","L","L","L","L","L","L","L","L","L","L","L","L","L","L","L","L","L","L","L","L","L","L","L","L","L","L","L","L","L","L","L","L"]
[null,null,"Chemical / Biological / Radiological ","L","L","L","L","L","L","L","L","L","L","L","L","L","L","L","L","L","L","L","L","L","L","L","L","L","L","L","L","L","L","L","H","L","L","L","L","L","L","L","L","L"]
[null,null,"Criminal Acts","L","L","L","L","L","L","L","L","L","L","L","L","L","L","L","L","L","L","L","L","L","L","L","L","L","L","L","L","L","L","L","L","L","L","L","L","L","L","L","L","L"]
[null,null,"Fire","L","L","L","L","L","L","L","L","L","L","L","L","L","L","L","L","L","L","L","L","L","L","L","L","L","L","L","L","L","L","L","L","L","L","L","L","L","L","L","L","L"]
[null,null,"Impact Collision / Deterioration","L","L","L","L","L","L","L","L","L","L","L","L","L","L","L","L","L","L","L","L","L","L","L","L","L","L","L","L","L","L","L","L","L","L","L","L","L","L","L","L","L"]
[null,null,"HAZMAT","L","L","L","L","L","L","L","L","L","L","L","L","L","L","L","L","L","L","L","L","L","L","L","L","L","L","L","L","L","L","L","H","L","L","L","L","L","L","L","L","L"]
[null,null,"Flood","L","L","L","L","L","L","L","L","L","L","L","L","L","L","L","L","L","L","L","L","L","L","L","L","L","L","L","L","L","L","L","L","L","L","H","H","L","L","L","L","L"]
[null,null,"Earthquake","L","L","L","L","L","L","L","L","L","L","L","L","L","L","L","L","L","L","L","L","L","L","L","L","L","L","L","L","L","L","L","L","L","L","L","L","L","L","L","L","L"]
[null,null,"Extreme Weather","L","L","L","L","L","L","L","L","L","L","L","L","L","L","L","L","L","L","L","L","L","L","L","L","L","L","L","L","L","L","L","L","L","L","H","H","L","L","L","L","L"]
[null,null,"Mud/Landslide","L","L","L","L","L","L","L","L","L","L","L","L","L","L","L","L","L","L","L","L","L","L","L","L","L","L","L","L","L","L","L","L","L","L","M","M","L","L","L","L","L"]

{"sheet":"Asset Analyst","index":20,"n_rows":32,"n_cols":43,"rows_kept":32,"cut":false,"hidden":false,"merged":[]}
[4]
[]
[]
[]
[]
[]
[]
[null,"Asset Analyzed:"]
[null,"bridge 1"]
[null,null,"Lighting","Barriers & Berms","Fences","CCTV","Intrusion Detection Devices","Physical Inspection of asset","ID Cards","Biometrics","Background Checks","Metal Detectors","Restricted Parking","Random Inspections","Visible Badges","Limited Access Points","Visitor Control & Escort","Locks","Explosive Detection","Establish Clear Zones","Visible Signs","Seismic Retrofitting","Fire Detection & Supression","Encasement, Wrapping, Jacketing"," Patrols","WX/Seismic Information","Intelligence Networking","HAZMAT Mitigatoin","Security Awareness Training","Emergency Response Training","Emergency Evacuation Planning","Planned Redundancy (e.g., detours)","Public Information and Dissemination",{"$f":"'CM Dictionary'!AI3","v":"Safe Room"},{"$f":"'CM Dictionary'!AJ3","v":"Bracing/Tie-Downs"},{"$f":"'CM Dictionary'!AK3","v":"Pump Equipment "},{"$f":"'Additional CMs'!D$11","v":"Scour Measures"},{"$f":"'Additional CMs'!E$11","v":"Stormwater Mgt"},{"$f":"'Additional CMs'!F$11","v":"Other 3"},{"$f":"'Additional CMs'!G$11","v":"Other 4"},{"$f":"'Additional CMs'!H$11","v":"Other 5"},{"$f":"'Additional CMs'!I$11","v":"Other 6"},{"$f":"'Additional CMs'!J$11","v":"Other 7"}]
[null,{"$f":"'CM Dictionary'!C22","v":"Small Explosives"},"L","H","H","M","M","H","L","M","L","M","L","H","L","M","M","M","H","H","L","H","H","H","H","L","M","L","H","H","H","H","H","L","M","L","L","L","L","L","L","L","L"]
[null,{"$f":"'CM Dictionary'!C23","v":"Large Explosives"},"M","M","M","M","M","M","L","M","L","L","M","M","M","M","M","M","H","M","L","H","M","H","H","L","M","L","M","M","M","M","H","L","L","L","L","L","L","L","L","L","L"]
[null,{"$f":"'CM Dictionary'!C24","v":"Chemical / Biological / Radiological "},"M","L","L","L","M","H","L","M","L","L","M","H","L","M","M","M","L","M","L","L","M","L","H","M","M","H","L","H","H","H","H","L","L","L","L","L","L","L","L","L","L"]
[null,{"$f":"'CM Dictionary'!C25","v":"Criminal Acts"},"M","M","M","M","M","M","L","L","M","L","M","M","M","M","M","H","L","H","M","M","M","H","H","L","L","L","H","M","M","M","H","L","M","L","L","L","L","L","L","L","L"]
[null,{"$f":"'CM Dictionary'!C26","v":"Fire"},"M","M","L","M","L","L","L","L","L","L","L","L","L","L","L","L","L","H","L","H","H","H","H","L","L","L","L","H","H","H","H","L","L","M","L","L","L","L","L","L","L"]
[null,{"$f":"'CM Dictionary'!C27","v":"Impact Collision / Deterioration"},"L","L","L","L","L","H","L","L","L","L","L","L","L","L","L","L","L","L","L","H","L","H","L","L","L","L","L","H","H","H","H","L","H","L","L","L","L","L","L","L","L"]
[null,{"$f":"'CM Dictionary'!C28","v":"HAZMAT"},"L","L","L","L","L","H","L","L","L","L","L","L","L","L","L","L","L","M","L","L","H","L","M","M","L","H","L","H","H","H","H","L","L","L","L","L","L","L","L","L","L"]
[null,{"$f":"'CM Dictionary'!C29","v":"Flood"},"L","M","L","L","L","H","L","L","L","L","L","L","L","L","L","L","L","M","L","H","L","L","H","H","L","L","L","H","H","H","H","L","M","H","H","H","L","L","L","L","L"]
[null,{"$f":"'CM Dictionary'!C30","v":"Earthquake"},"L","L","L","L","L","L","L","L","L","L","L","L","L","L","L","L","L","L","L","H","M","H","M","H","L","L","L","H","H","H","H","L","M","L","L","L","L","L","L","L","L"]
[null,{"$f":"'CM Dictionary'!C31","v":"Extreme Weather"},"L","M","L","L","L","H","L","L","L","L","L","L","L","L","L","L","L","L","L","H","L","H","M","H","L","L","L","H","H","H","H","L","H","H","H","H","L","L","L","L","L"]
[null,{"$f":"'CM Dictionary'!C32","v":"Mud/Landslide"},"L","M","L","L","L","H","L","L","L","L","L","L","L","L","L","L","L","L","L","H","L","H","M","H","L","L","L","H","H","H","H","L","M","M","M","M","L","L","L","L","L"]
[]
[]
[]
[]
[null,"Total Units Desired for All Assets in Class",null,null,null,null,null,1,null,null,null,null,null,null,null,null,null,null,null,null,null,null,null,null,null,1,null,null,null,null,1,null,null,null,null,null,1,1]
[]
[null,"Cost Per Unit (x1000)",{"$f":"'CM Dictionary'!D12","v":8.0000640000000001},{"$f":"'CM Dictionary'!E12","v":8.6006400000000003},{"$f":"'CM Dictionary'!F12","v":33.599616000000005},{"$f":"'CM Dictionary'!G12","v":34.749632000000005},{"$f":"'CM Dictionary'!H12","v":0.76500544000000004},{"$f":"'CM Dictionary'!I12","v":79.999552000000008},{"$f":"'CM Dictionary'!J12","v":7.4995840000000005},{"$f":"'CM Dictionary'!K12","v":34.999871999999996},{"$f":"'CM Dictionary'!L12","v":79.999552000000008},{"$f":"'CM Dictionary'!M12","v":38.499968000000003},{"$f":"'CM Dictionary'!N12","v":37.800384000000008},{"$f":"'CM Dictionary'!O12","v":30.000512000000004},{"$f":"'CM Dictionary'!P12","v":27.999680000000001},{"$f":"'CM Dictionary'!Q12","v":27.999680000000001},{"$f":"'CM Dictionary'!R12","v":27.999680000000001},{"$f":"'CM Dictionary'!S12","v":1.200064},{"$f":"'CM Dictionary'!T12","v":153.99987200000001},{"$f":"'CM Dictionary'!U12","v":8.7312000000000012},{"$f":"'CM Dictionary'!V12","v":4.5043200000000005E-2},{"$f":"'CM Dictionary'!W12","v":1000.0003840000002},{"$f":"'CM Dictionary'!X12","v":500.47129600000005},{"$f":"'CM Dictionary'!Y12","v":3499.9980800000003},{"$f":"'CM Dictionary'!Z12","v":52.999744000000007},{"$f":"'CM Dictionary'!AA12","v":135.00012800000002},{"$f":"'CM Dictionary'!AB12","v":135.00012800000002},{"$f":"'CM Dictionary'!AC12","v":400.99980799999997},{"$f":"'CM Dictionary'!AD12","v":25.000064000000002},{"$f":"'CM Dictionary'!AE12","v":139.99948799999999},{"$f":"'CM Dictionary'!AF12","v":54.400000000000006},{"$f":"'CM Dictionary'!AG12","v":307.07494400000002},{"$f":"'CM Dictionary'!AH12","v":50.000128000000004},{"$f":"'CM Dictionary'!AI12","v":16},{"$f":"'CM Dictionary'!AJ12","v":500},{"$f":"'CM Dictionary'!AK12","v":500},{"$f":"'CM Dictionary'!AL12","v":1000},{"$f":"'CM Dictionary'!AM12","v":500},{"$f":"'CM Dictionary'!AN12","v":0},{"$f":"'CM Dictionary'!AO12","v":0},{"$f":"'CM Dictionary'!AP12","v":0},{"$f":"'CM Dictionary'!AQ12","v":0},{"$f":"'CM Dictionary'!AR12","v":0}]
[null,"Total CM Cost (x1000)",{"$f":"C26*C28","v":0},0,0,0,0,79.999552000000008,0,0,0,0,0,0,0,0,0,0,0,0,0,0,0,0,0,135.00012800000002,0,0,0,0,54.400000000000006,0,0,0,0,0,1000,500,0,0,0,0,0]
[]
[null,"Total Asset Cost (x1000):"]
[null,{"$f":"SUM(C29:AQ29)","v":1769.39968}]

{"sheet":"Results Summary","index":21,"n_rows":43,"n_cols":12,"rows_kept":43,"cut":false,"hidden":false,"merged":[[4,1,16,1],[18,2,19,2],[20,2,21,2],[37,1,42,1],[25,2,26,2],[22,2,23,2],[18,1,23,1],[30,1,35,1],[25,1,28,1],[25,3,26,3],[25,11,26,11],[25,5,26,5],[25,6,26,6],[25,9,26,9],[25,10,26,10],[25,8,26,8],[25,4,26,4],[25,7,26,7]]}
[null,null,null,null,null,null,"Report Date and Time:"]
[null,null,null,null,null,null,{"$f":"NOW()","v":"2016-09-30T07:58:58.470"}]
[]
[null,null,null,"Road Bridges","Road Tunnels","Transit/Rail Station","Transit/Rail Bridges","Transit/Rail Tunnels","Admin & Support Facilities","Ferry","Fleet","Other"]
[null,"Relevant Risks",{"$f":"'CM Dictionary'!C22","v":"Small Explosives"},{"$f":"IF('Relevant Risks'!D14=\"Y\",\"X\",\"\")","v":"X"},{"$f":"IF('Relevant Risks'!E14=\"Y\",\"X\",\"\")","v":"X"},{"$f":"IF('Relevant Risks'!F14=\"Y\",\"X\",\"\")","v":"X"},{"$f":"IF('Relevant Risks'!G14=\"Y\",\"X\",\"\")","v":"X"},{"$f":"IF('Relevant Risks'!H14=\"Y\",\"X\",\"\")","v":"X"},{"$f":"IF('Relevant Risks'!I14=\"Y\",\"X\",\"\")","v":"X"},{"$f":"IF('Relevant Risks'!J14=\"Y\",\"X\",\"\")","v":"X"},{"$f":"IF('Relevant Risks'!K14=\"Y\",\"X\",\"\")","v":"X"},{"$f":"IF((COUNTA(Other!C$21:C$1300)>0),\"X\",\"\")","v":""}]
[null,null,{"$f":"'CM Dictionary'!C23","v":"Large Explosives"},{"$f":"IF('Relevant Risks'!D15=\"Y\",\"X\",\"\")","v":"X"},{"$f":"IF('Relevant Risks'!E15=\"Y\",\"X\",\"\")","v":"X"},{"$f":"IF('Relevant Risks'!F15=\"Y\",\"X\",\"\")","v":"X"},{"$f":"IF('Relevant Risks'!G15=\"Y\",\"X\",\"\")","v":"X"},{"$f":"IF('Relevant Risks'!H15=\"Y\",\"X\",\"\")","v":"X"},{"$f":"IF('Relevant Risks'!I15=\"Y\",\"X\",\"\")","v":"X"},{"$f":"IF('Relevant Risks'!J15=\"Y\",\"X\",\"\")","v":"X"},{"$f":"IF('Relevant Risks'!K15=\"Y\",\"X\",\"\")","v":"X"},{"$f":"IF((COUNTA(Other!D$21:D$1300)>0),\"X\",\"\")","v":""}]
[null,null,{"$f":"'CM Dictionary'!C24","v":"Chemical / Biological / Radiological "},{"$f":"IF('Relevant Risks'!D16=\"Y\",\"X\",\"\")","v":"X"},{"$f":"IF('Relevant Risks'!E16=\"Y\",\"X\",\"\")","v":"X"},{"$f":"IF('Relevant Risks'!F16=\"Y\",\"X\",\"\")","v":"X"},{"$f":"IF('Relevant Risks'!G16=\"Y\",\"X\",\"\")","v":"X"},{"$f":"IF('Relevant Risks'!H16=\"Y\",\"X\",\"\")","v":"X"},{"$f":"IF('Relevant Risks'!I16=\"Y\",\"X\",\"\")","v":"X"},{"$f":"IF('Relevant Risks'!J16=\"Y\",\"X\",\"\")","v":"X"},{"$f":"IF('Relevant Risks'!K16=\"Y\",\"X\",\"\")","v":"X"},{"$f":"IF((COUNTA(Other!E$21:E$1300)>0),\"X\",\"\")","v":""}]
[null,null,{"$f":"'CM Dictionary'!C25","v":"Criminal Acts"},{"$f":"IF('Relevant Risks'!D17=\"Y\",\"X\",\"\")","v":"X"},{"$f":"IF('Relevant Risks'!E17=\"Y\",\"X\",\"\")","v":"X"},{"$f":"IF('Relevant Risks'!F17=\"Y\",\"X\",\"\")","v":"X"},{"$f":"IF('Relevant Risks'!G17=\"Y\",\"X\",\"\")","v":"X"},{"$f":"IF('Relevant Risks'!H17=\"Y\",\"X\",\"\")","v":"X"},{"$f":"IF('Relevant Risks'!I17=\"Y\",\"X\",\"\")","v":"X"},{"$f":"IF('Relevant Risks'!J17=\"Y\",\"X\",\"\")","v":"X"},{"$f":"IF('Relevant Risks'!K17=\"Y\",\"X\",\"\")","v":"X"},{"$f":"IF((COUNTA(Other!F$21:F$1300)>0),\"X\",\"\")","v":""}]
[null,null,{"$f":"'CM Dictionary'!C26","v":"Fire"},{"$f":"IF('Relevant Risks'!D19=\"Y\",\"X\",\"\")","v":"X"},{"$f":"IF('Relevant Risks'!E19=\"Y\",\"X\",\"\")","v":"X"},{"$f":"IF('Relevant Risks'!F19=\"Y\",\"X\",\"\")","v":"X"},{"$f":"IF('Relevant Risks'!G19=\"Y\",\"X\",\"\")","v":"X"},{"$f":"IF('Relevant Risks'!H19=\"Y\",\"X\",\"\")","v":"X"},{"$f":"IF('Relevant Risks'!I19=\"Y\",\"X\",\"\")","v":"X"},{"$f":"IF('Relevant Risks'!J19=\"Y\",\"X\",\"\")","v":"X"},{"$f":"IF('Relevant Risks'!K19=\"Y\",\"X\",\"\")","v":"X"},{"$f":"IF((COUNTA(Other!G$21:G$1300)>0),\"X\",\"\")","v":""}]
[null,null,{"$f":"'CM Dictionary'!C27","v":"Impact Collision / Deterioration"},{"$f":"IF('Relevant Risks'!D20=\"Y\",\"X\",\"\")","v":"X"},{"$f":"IF('Relevant Risks'!E20=\"Y\",\"X\",\"\")","v":"X"},{"$f":"IF('Relevant Risks'!F20=\"Y\",\"X\",\"\")","v":"X"},{"$f":"IF('Relevant Risks'!G20=\"Y\",\"X\",\"\")","v":"X"},{"$f":"IF('Relevant Risks'!H20=\"Y\",\"X\",\"\")","v":"X"},{"$f":"IF('Relevant Risks'!I20=\"Y\",\"X\",\"\")","v":"X"},{"$f":"IF('Relevant Risks'!J20=\"Y\",\"X\",\"\")","v":"X"},{"$f":"IF('Relevant Risks'!K20=\"Y\",\"X\",\"\")","v":"X"},{"$f":"IF((COUNTA(Other!H$21:H$1300)>0),\"X\",\"\")","v":""}]
[null,null,{"$f":"'CM Dictionary'!C28","v":"HAZMAT"},{"$f":"IF('Relevant Risks'!D21=\"Y\",\"X\",\"\")","v":"X"},{"$f":"IF('Relevant Risks'!E21=\"Y\",\"X\",\"\")","v":"X"},{"$f":"IF('Relevant Risks'!F21=\"Y\",\"X\",\"\")","v":"X"},{"$f":"IF('Relevant Risks'!G21=\"Y\",\"X\",\"\")","v":"X"},{"$f":"IF('Relevant Risks'!H21=\"Y\",\"X\",\"\")","v":"X"},{"$f":"IF('Relevant Risks'!I21=\"Y\",\"X\",\"\")","v":"X"},{"$f":"IF('Relevant Risks'!J21=\"Y\",\"X\",\"\")","v":"X"},{"$f":"IF('Relevant Risks'!K21=\"Y\",\"X\",\"\")","v":"X"},{"$f":"IF((COUNTA(Other!I$21:I$1300)>0),\"X\",\"\")","v":""}]
[null,null,{"$f":"'CM Dictionary'!C29","v":"Flood"},{"$f":"IF('Relevant Risks'!D23=\"Y\",\"X\",\"\")","v":"X"},{"$f":"IF('Relevant Risks'!E23=\"Y\",\"X\",\"\")","v":"X"},{"$f":"IF('Relevant Risks'!F23=\"Y\",\"X\",\"\")","v":"X"},{"$f":"IF('Relevant Risks'!G23=\"Y\",\"X\",\"\")","v":"X"},{"$f":"IF('Relevant Risks'!H23=\"Y\",\"X\",\"\")","v":"X"},{"$f":"IF('Relevant Risks'!I23=\"Y\",\"X\",\"\")","v":"X"},{"$f":"IF('Relevant Risks'!J23=\"Y\",\"X\",\"\")","v":"X"},{"$f":"IF('Relevant Risks'!K23=\"Y\",\"X\",\"\")","v":"X"},{"$f":"IF((COUNTA(Other!J$21:J$1300)>0),\"X\",\"\")","v":"X"}]
[null,null,{"$f":"'CM Dictionary'!C30","v":"Earthquake"},{"$f":"IF('Relevant Risks'!D24=\"Y\",\"X\",\"\")","v":"X"},{"$f":"IF('Relevant Risks'!E24=\"Y\",\"X\",\"\")","v":"X"},{"$f":"IF('Relevant Risks'!F24=\"Y\",\"X\",\"\")","v":"X"},{"$f":"IF('Relevant Risks'!G24=\"Y\",\"X\",\"\")","v":"X"},{"$f":"IF('Relevant Risks'!H24=\"Y\",\"X\",\"\")","v":"X"},{"$f":"IF('Relevant Risks'!I24=\"Y\",\"X\",\"\")","v":"X"},{"$f":"IF('Relevant Risks'!J24=\"Y\",\"X\",\"\")","v":"X"},{"$f":"IF('Relevant Risks'!K24=\"Y\",\"X\",\"\")","v":"X"},{"$f":"IF((COUNTA(Other!K$21:K$1300)>0),\"X\",\"\")","v":"X"}]
[null,null,{"$f":"'CM Dictionary'!C31","v":"Extreme Weather"},{"$f":"IF('Relevant Risks'!D25=\"Y\",\"X\",\"\")","v":"X"},{"$f":"IF('Relevant Risks'!E25=\"Y\",\"X\",\"\")","v":"X"},{"$f":"IF('Relevant Risks'!F25=\"Y\",\"X\",\"\")","v":"X"},{"$f":"IF('Relevant Risks'!G25=\"Y\",\"X\",\"\")","v":"X"},{"$f":"IF('Relevant Risks'!H25=\"Y\",\"X\",\"\")","v":"X"},{"$f":"IF('Relevant Risks'!I25=\"Y\",\"X\",\"\")","v":"X"},{"$f":"IF('Relevant Risks'!J25=\"Y\",\"X\",\"\")","v":"X"},{"$f":"IF('Relevant Risks'!K25=\"Y\",\"X\",\"\")","v":"X"},{"$f":"IF((COUNTA(Other!L$21:L$1300)>0),\"X\",\"\")","v":"X"}]
[null,null,{"$f":"'CM Dictionary'!C32","v":"Mud/Landslide"},{"$f":"IF('Relevant Risks'!D26=\"Y\",\"X\",\"\")","v":"X"},{"$f":"IF('Relevant Risks'!E26=\"Y\",\"X\",\"\")","v":"X"},{"$f":"IF('Relevant Risks'!F26=\"Y\",\"X\",\"\")","v":"X"},{"$f":"IF('Relevant Risks'!G26=\"Y\",\"X\",\"\")","v":"X"},{"$f":"IF('Relevant Risks'!H26=\"Y\",\"X\",\"\")","v":"X"},{"$f":"IF('Relevant Risks'!I26=\"Y\",\"X\",\"\")","v":"X"},{"$f":"IF('Relevant Risks'!J26=\"Y\",\"X\",\"\")","v":"X"},{"$f":"IF('Relevant Risks'!K26=\"Y\",\"X\",\"\")","v":"X"},{"$f":"IF((COUNTA(Other!M$21:M$1300)>0),\"X\",\"\")","v":"X"}]
[null,null,{"$f":"'Relevant Risks'!C28","v":"New hazard 1"},{"$f":"IF('Relevant Risks'!D28=\"Y\",\"X\",\"\")","v":""},{"$f":"IF('Relevant Risks'!E28=\"Y\",\"X\",\"\")","v":""},{"$f":"IF('Relevant Risks'!F28=\"Y\",\"X\",\"\")","v":""},{"$f":"IF('Relevant Risks'!G28=\"Y\",\"X\",\"\")","v":""},{"$f":"IF('Relevant Risks'!H28=\"Y\",\"X\",\"\")","v":""},{"$f":"IF('Relevant Risks'!I28=\"Y\",\"X\",\"\")","v":""},{"$f":"IF('Relevant Risks'!J28=\"Y\",\"X\",\"\")","v":""},{"$f":"IF('Relevant Risks'!K28=\"Y\",\"X\",\"\")","v":""},{"$f":"IF((COUNTA(Other!N$21:N$1300)>0),\"X\",\"\")","v":"X"}]
[null,null,{"$f":"'Relevant Risks'!C29","v":"New hazard 2"},{"$f":"IF('Relevant Risks'!D29=\"Y\",\"X\",\"\")","v":""},{"$f":"IF('Relevant Risks'!E29=\"Y\",\"X\",\"\")","v":""},{"$f":"IF('Relevant Risks'!F29=\"Y\",\"X\",\"\")","v":""},{"$f":"IF('Relevant Risks'!G29=\"Y\",\"X\",\"\")","v":""},{"$f":"IF('Relevant Risks'!H29=\"Y\",\"X\",\"\")","v":""},{"$f":"IF('Relevant Risks'!I29=\"Y\",\"X\",\"\")","v":""},{"$f":"IF('Relevant Risks'!J29=\"Y\",\"X\",\"\")","v":""},{"$f":"IF('Relevant Risks'!K29=\"Y\",\"X\",\"\")","v":""},{"$f":"IF((COUNTA(Other!O$21:O$1300)>0),\"X\",\"\")","v":""}]
[]
[null,"Thresholds","Potentially Exposed Population","Persons","Persons","Persons","Persons","Persons","Persons","Persons","Persons","--"]
[null,null,null,{"$f":"Thresholds!C12","v":302},{"$f":"Thresholds!C20","v":302},{"$f":"Thresholds!C24","v":302},{"$f":"Thresholds!C28","v":302},{"$f":"Thresholds!C32","v":302},{"$f":"Thresholds!C36","v":303},{"$f":"Thresholds!C40","v":302},{"$f":"Thresholds!C44","v":302},"--"]
[null,null,"Property Loss","Damage","Damage","Below Ground Stations Critical?","Damage","Damage","Damage","Damage","Damage","--"]
[null,null,null,{"$f":"Thresholds!C13","v":1007196726},{"$f":"Thresholds!C21","v":1007196726},{"$f":"Thresholds!C25","v":"Yes"},{"$f":"Thresholds!C29","v":503600863},{"$f":"Thresholds!C33","v":503600863},{"$f":"Thresholds!C37","v":111111111},{"$f":"Thresholds!C41","v":100724172},{"$f":"Thresholds!C45","v":100724172},"--"]
[null,null,"Mission Importance","ADT * Detour Length","Road tunnels critical?","Transfer Stations Critical?","% of ridership that causes mission criticality ","% of ridership that causes mission criticality ","Facilities critical?","Ferries critical?","Fleets critical?","--"]
[null,null,null,{"$f":"Thresholds!C14","v":"Level III"},{"$f":"Thresholds!C22","v":"Yes"},{"$f":"Thresholds!C26","v":"Yes"},{"$f":"Thresholds!C30","v":50},{"$f":"Thresholds!C34","v":50},{"$f":"Thresholds!C38","v":"No"},{"$f":"Thresholds!C42","v":"No"},{"$f":"Thresholds!C46","v":"No"},"--"]
[]
[null,"Counts","# of Unique Critical Assets",{"$f":"COUNTA('Road Bridge CM Summ'!$Q9:$IV9)-1","v":25},{"$f":"COUNTA('Road Tunnel CM Summ'!$Q9:$IV9)-1","v":11},{"$f":"COUNTA('Station CM Summ'!$Q9:$IV9)-1","v":13},{"$f":"COUNTA('Rail Bridge CM Summ'!$Q9:$IV9)-1","v":6},{"$f":"COUNTA('Rail Tunnel CM Summ'!$Q9:$IV9)-1","v":4},{"$f":"COUNTA('Facilities CM Summ'!$Q9:$IV9)-1","v":10},{"$f":"COUNTA('Ferry CM Summ'!$Q9:$IV9)-1","v":0},{"$f":"COUNTA('Fleet CM Summ'!$Q9:$IV9)-1","v":5},{"$f":"COUNTA('Other CM Summ'!$Q9:$IV9)-1","v":1}]
[]
[null,null,"# of Unique Countermeasures",0,0,0,0,0,0,0,0,0]
[null,null,"Total # of Countermeasures",0,0,0,0,0,0,0,0,0]
[]
[null,"Expenditures","Physical Security Countermeasures (x1000)",0,0,0,0,0,0,0,0,0]
[null,null,"Access Control Countermeasures (x1000)",0,0,0,0,0,0,0,0,0]
[null,null,"Asset Design/Engr Countermeasures (x1000)",0,0,0,0,0,0,0,0,0]
[null,null,"Operational Countermeasures (x1000)",0,0,0,0,0,0,0,0,0]
[null,null,"Other Countermeasures (x1000)",0,0,0,0,0,0,0,0,0]
[null,null,"Total Countermeasure Expenditures (x1000)",{"$f":"SUM('Road Bridge CM Summ'!$Q51:$IV51)/2","v":0},{"$f":"SUM('Road Tunnel CM Summ'!$Q51:$IV51)/2","v":0},{"$f":"SUM('Station CM Summ'!$Q51:$IV51)/2","v":0},{"$f":"SUM('Rail Bridge CM Summ'!$Q51:$IV51)/2","v":0},{"$f":"SUM('Rail Tunnel CM Summ'!$Q51:$IV51)/2","v":0},{"$f":"SUM('Facilities CM Summ'!$Q51:$IV51)/2","v":0},{"$f":"SUM('Ferry CM Summ'!$Q51:$IV51)/2","v":0},{"$f":"SUM('Fleet CM Summ'!$Q51:$IV51)/2","v":0},{"$f":"SUM('Other CM Summ'!$Q51:$IV51)/2","v":0}]
[]
[null,"Totals","Physical Security Countermeasures",{"$f":"SUM(D31:L31)*1000","v":0}]
[null,null,"Access Control Countermeasures",0]
[null,null,"Design/Engr Countermeasures",0]
[null,null,"Operational Countermeasures",0]
[null,null,"Other Countermeasures",0]
[null,null,"Overall Total",0]

{"sheet":"Road Bridge CM Summ","index":22,"n_rows":51,"n_cols":42,"rows_kept":51,"cut":false,"hidden":false,"merged":[[9,0,14,0],[15,0,27,0],[28,0,30,0],[31,0,39,0]]}
[]
[]
[]
[]
[]
[]
[]
[]
[null,null,{"$f":"TRANSPOSE('CM Dictionary'!C4:C9)","v":"PREVENTION"},"PROTECTION","MITIGATE","RESPONSE PREP. ","RECOVERY PREP.","DESIGN ENGINEERING",{"$f":"TRANSPOSE('CM Dictionary'!C15:C21)","v":"Area-Wide"},"Asset Specific","Temporary/Redeployable","Multipurpose Potential","Basic","Enhanced","Threat Responsive",null,"George's Island","High Rise","Blue River Bridge","State Line Bridge","Veteran's Bridge","Interstate Bridge","Morris Bridge","Route 500 River Bridge","Metropolitan Bridge","Point Park Bridge","Rt 17  Bridge","Military Highway Bridge","Rt 71 Bridge","Boulavard Bridge","Business Route Bridge","Memorial Bridge","New River Bridge","Old River Bridge","Lazy River Bridge","Muddy River Bridge","Crooked River Bridge","Beltway Interstate Bridge","Big River InterstateBridge","Big River InterstateBridge","Interstate Highway Ramp","TOTAL COST (x1000)"]
[null,{"$f":"'CM Dictionary'!D3","v":"Lighting"},{"$f":"TRANSPOSE('CM Dictionary'!D4:AR9)","v":0},"X","X",0,0,0,{"$f":"TRANSPOSE('CM Dictionary'!D15:AR21)","v":0},"X",0,"X","X",0,0]
[null,{"$f":"'CM Dictionary'!E3","v":"Barriers & Berms"},0,"X","X",0,0,0,0,"X",0,"X","X",0,0]
[null,{"$f":"'CM Dictionary'!F3","v":"Fences"},0,"X","X",0,0,0,0,"X",0,"X","X",0,0]
[null,{"$f":"'CM Dictionary'!G3","v":"CCTV"},0,"X","X",0,0,0,0,"X",0,"X","X",0,0]
[null,{"$f":"'CM Dictionary'!H3","v":"Intrusion Detection Devices"},0,"X","X",0,0,0,0,"X",0,"X","X",0,0]
[null,{"$f":"'CM Dictionary'!I3","v":"Physical Inspection of asset"},"X",0,0,0,0,0,0,"X","X","X","X",0,"X"]
[null,{"$f":"'CM Dictionary'!J3","v":"ID Cards"},0,"X",0,0,0,0,"X",0,0,0,"X",0,0]
[null,{"$f":"'CM Dictionary'!K3","v":"Biometrics"},0,"X",0,0,0,0,"X",0,0,0,0,"X",0]
[null,{"$f":"'CM Dictionary'!L3","v":"Background Checks"},0,0,"X",0,0,0,"X",0,0,0,"X",0,0]
[null,{"$f":"'CM Dictionary'!M3","v":"Metal Detectors"},0,0,"X",0,0,0,0,"X",0,0,0,"X",0]
[null,{"$f":"'CM Dictionary'!N3","v":"Restricted Parking"},0,"X",0,0,0,0,0,"X",0,0,"X",0,0]
[null,{"$f":"'CM Dictionary'!O3","v":"Random Inspections"},0,0,"X",0,0,0,"X",0,"X",0,0,0,"X"]
[null,{"$f":"'CM Dictionary'!P3","v":"Visible Badges"},0,"X",0,0,0,0,"X",0,0,0,"X",0,0]
[null,{"$f":"'CM Dictionary'!Q3","v":"Limited Access Points"},0,0,"X",0,0,0,0,"X","X",0,0,0,"X"]
[null,{"$f":"'CM Dictionary'!R3","v":"Visitor Control & Escort"},0,0,0,"X",0,0,0,"X","X",0,"X",0,0]
[null,{"$f":"'CM Dictionary'!S3","v":"Locks"},0,"X",0,0,0,0,0,"X",0,0,"X",0,0]
[null,{"$f":"'CM Dictionary'!T3","v":"Explosive Detection"},0,0,"X",0,0,0,0,"X","X",0,0,"X",0]
[null,{"$f":"'CM Dictionary'!U3","v":"Establish Clear Zones"},0,0,"X",0,0,0,0,"X",0,0,"X",0,0]
[null,{"$f":"'CM Dictionary'!V3","v":"Visible Signs"},0,"X",0,0,0,0,0,"X",0,0,"X",0,0]
[null,{"$f":"'CM Dictionary'!W3","v":"Seismic Retrofitting"},0,0,0,0,0,"X",0,"X",0,"X",0,"X",0]
[null,{"$f":"'CM Dictionary'!X3","v":"Fire Detection & Supression"},0,0,"X",0,"X",0,0,"X",0,"X",0,"X",0]
[null,{"$f":"'CM Dictionary'!Y3","v":"Encasement, Wrapping, Jacketing"},0,0,0,0,"X",0,0,"X",0,"X",0,"X",0]
[null,{"$f":"'CM Dictionary'!Z3","v":"Patrols"},0,0,"X",0,0,0,"X",0,"X","X","X",0,"X"]
[null,{"$f":"'CM Dictionary'!AA3","v":"WX/Seismic Information"},"X",0,0,0,"X",0,"X",0,0,"X","X",0,0]
[null,{"$f":"'CM Dictionary'!AB3","v":"Intelligence Networking"},"X",0,0,0,0,0,"X",0,"X",0,"X",0,"X"]
[null,{"$f":"'CM Dictionary'!AC3","v":"HAZMAT Mitigation"},0,0,0,0,"X",0,"X",0,"X",0,"X",0,0]
[null,{"$f":"'CM Dictionary'!AD3","v":"Security Awareness Training"},0,0,0,0,"X",0,"X",0,0,0,"X",0,0]
[null,{"$f":"'CM Dictionary'!AE3","v":"Emergency Response Training"},0,0,0,0,"X",0,"X",0,0,0,"X",0,0]
[null,{"$f":"'CM Dictionary'!AF3","v":"Emergency Evacuation Planning"},0,0,0,0,"X",0,"X",0,0,0,"X",0,0]
[null,{"$f":"'CM Dictionary'!AG3","v":"Planned Redundancy (e.g., detours)"},0,0,0,0,"X",0,"X",0,0,0,"X",0,0]
[null,{"$f":"'CM Dictionary'!AH3","v":"Public Information and Dissemination"},0,0,0,0,"X",0,"X",0,0,"X","X",0,"X"]
[null,{"$f":"'CM Dictionary'!AI3","v":"Safe Room"},0,0,"X","X","X","X",0,"X",0,0,0,0,0,0]
[null,{"$f":"'CM Dictionary'!AJ3","v":"Bracing/Tie-Downs"},0,0,"X",0,0,"X",0,"X",0,0,0,0,0]
[null,{"$f":"'CM Dictionary'!AK3","v":"Pump Equipment "},0,0,"X",0,0,"X",0,"X",0,0,0,0,0]
[null,{"$f":"'CM Dictionary'!AL3","v":"Scour Measures"},0,"X","X",0,0,"X",0,"X",0,0,0,0,"X"]
[null,{"$f":"'CM Dictionary'!AM3","v":"Stormwater Mgt"},0,0,"X",0,0,"X","X","X",0,0,"X",0,0]
[null,{"$f":"'CM Dictionary'!AN3","v":"Other 3"},0,0,0,0,0,0,0,0,0,0,0,0,0]
[null,{"$f":"'CM Dictionary'!AO3","v":"Other 4"},0,0,0,0,0,0,0,0,0,0,0,0,0]
[null,{"$f":"'CM Dictionary'!AP3","v":"Other 5"},0,0,0,0,0,0,0,0,0,0,0,0,0]
[null,{"$f":"'CM Dictionary'!AQ3","v":"Other 6"},0,0,0,0,0,0,0,0,0,0,0,0,0]
[null,{"$f":"'CM Dictionary'!AR3","v":"Other 7"},0,0,0,0,0,0,0,0,0,0,0,0,0]
[null,null,null,null,null,null,null,null,null,null,null,null,null,null,"TOTAL COST (x1000)",null,0,0,0,0,0,0,0,0,0,0,0,0,0,0,0,0,0,0,0,0,0,0,0,0,0,0]

{"sheet":"Road Tunnel CM Summ","index":23,"n_rows":51,"n_cols":28,"rows_kept":51,"cut":false,"hidden":false,"merged":[[9,0,14,0],[15,0,27,0],[28,0,30,0],[31,0,39,0]]}
[]
[]
[]
[]
[]
[]
[]
[]
[null,null,{"$f":"TRANSPOSE('CM Dictionary'!C4:C9)","v":"PREVENTION"},"PROTECTION","MITIGATE","RESPONSE PREP. ","RECOVERY PREP.","DESIGN ENGINEERING",{"$f":"TRANSPOSE('CM Dictionary'!C15:C21)","v":"Area-Wide"},"Asset Specific","Temporary/Redeployable","Multipurpose Potential","Basic","Enhanced","Threat Responsive",null,"Big Mountain Tunnel"," Bay Tunnel","Shoals Tunnel","Downtown Tunnel","East Mountain Tunnel","Uptown Tunnel","Midtown Tunnel","Memorial Tunnel","Harbor Tunnel","Airport Runway Tunnel","Parkland Tunnel","TOTAL COST (x1000)"]
[null,{"$f":"'CM Dictionary'!D3","v":"Lighting"},{"$f":"TRANSPOSE('CM Dictionary'!D4:AR9)","v":0},"X","X",0,0,0,{"$f":"TRANSPOSE('CM Dictionary'!D15:AR21)","v":0},"X",0,"X","X",0,0]
[null,{"$f":"'CM Dictionary'!E3","v":"Barriers & Berms"},0,"X","X",0,0,0,0,"X",0,"X","X",0,0]
[null,{"$f":"'CM Dictionary'!F3","v":"Fences"},0,"X","X",0,0,0,0,"X",0,"X","X",0,0]
[null,{"$f":"'CM Dictionary'!G3","v":"CCTV"},0,"X","X",0,0,0,0,"X",0,"X","X",0,0]
[null,{"$f":"'CM Dictionary'!H3","v":"Intrusion Detection Devices"},0,"X","X",0,0,0,0,"X",0,"X","X",0,0]
[null,{"$f":"'CM Dictionary'!I3","v":"Physical Inspection of asset"},"X",0,0,0,0,0,0,"X","X","X","X",0,"X"]
[null,{"$f":"'CM Dictionary'!J3","v":"ID Cards"},0,"X",0,0,0,0,"X",0,0,0,"X",0,0]
[null,{"$f":"'CM Dictionary'!K3","v":"Biometrics"},0,"X",0,0,0,0,"X",0,0,0,0,"X",0]
[null,{"$f":"'CM Dictionary'!L3","v":"Background Checks"},0,0,"X",0,0,0,"X",0,0,0,"X",0,0]
[null,{"$f":"'CM Dictionary'!M3","v":"Metal Detectors"},0,0,"X",0,0,0,0,"X",0,0,0,"X",0]
[null,{"$f":"'CM Dictionary'!N3","v":"Restricted Parking"},0,"X",0,0,0,0,0,"X",0,0,"X",0,0]
[null,{"$f":"'CM Dictionary'!O3","v":"Random Inspections"},0,0,"X",0,0,0,"X",0,"X",0,0,0,"X"]
[null,{"$f":"'CM Dictionary'!P3","v":"Visible Badges"},0,"X",0,0,0,0,"X",0,0,0,"X",0,0]
[null,{"$f":"'CM Dictionary'!Q3","v":"Limited Access Points"},0,0,"X",0,0,0,0,"X","X",0,0,0,"X"]
[null,{"$f":"'CM Dictionary'!R3","v":"Visitor Control & Escort"},0,0,0,"X",0,0,0,"X","X",0,"X",0,0]
[null,{"$f":"'CM Dictionary'!S3","v":"Locks"},0,"X",0,0,0,0,0,"X",0,0,"X",0,0]
[null,{"$f":"'CM Dictionary'!T3","v":"Explosive Detection"},0,0,"X",0,0,0,0,"X","X",0,0,"X",0]
[null,{"$f":"'CM Dictionary'!U3","v":"Establish Clear Zones"},0,0,"X",0,0,0,0,"X",0,0,"X",0,0]
[null,{"$f":"'CM Dictionary'!V3","v":"Visible Signs"},0,"X",0,0,0,0,0,"X",0,0,"X",0,0]
[null,{"$f":"'CM Dictionary'!W3","v":"Seismic Retrofitting"},0,0,0,0,0,"X",0,"X",0,"X",0,"X",0]
[null,{"$f":"'CM Dictionary'!X3","v":"Fire Detection & Supression"},0,0,"X",0,"X",0,0,"X",0,"X",0,"X",0]
[null,{"$f":"'CM Dictionary'!Y3","v":"Encasement, Wrapping, Jacketing"},0,0,0,0,"X",0,0,"X",0,"X",0,"X",0]
[null,{"$f":"'CM Dictionary'!Z3","v":"Patrols"},0,0,"X",0,0,0,"X",0,"X","X","X",0,"X"]
[null,{"$f":"'CM Dictionary'!AA3","v":"WX/Seismic Information"},"X",0,0,0,"X",0,"X",0,0,"X","X",0,0]
[null,{"$f":"'CM Dictionary'!AB3","v":"Intelligence Networking"},"X",0,0,0,0,0,"X",0,"X",0,"X",0,"X"]
[null,{"$f":"'CM Dictionary'!AC3","v":"HAZMAT Mitigation"},0,0,0,0,"X",0,"X",0,"X",0,"X",0,0]
[null,{"$f":"'CM Dictionary'!AD3","v":"Security Awareness Training"},0,0,0,0,"X",0,"X",0,0,0,"X",0,0]
[null,{"$f":"'CM Dictionary'!AE3","v":"Emergency Response Training"},0,0,0,0,"X",0,"X",0,0,0,"X",0,0]
[null,{"$f":"'CM Dictionary'!AF3","v":"Emergency Evacuation Planning"},0,0,0,0,"X",0,"X",0,0,0,"X",0,0]
[null,{"$f":"'CM Dictionary'!AG3","v":"Planned Redundancy (e.g., detours)"},0,0,0,0,"X",0,"X",0,0,0,"X",0,0]
[null,{"$f":"'CM Dictionary'!AH3","v":"Public Information and Dissemination"},0,0,0,0,"X",0,"X",0,0,"X","X",0,"X"]
[null,{"$f":"'CM Dictionary'!AI3","v":"Safe Room"},0,0,"X","X","X","X",0,"X",0,0,0,0,0,0]
[null,{"$f":"'CM Dictionary'!AJ3","v":"Bracing/Tie-Downs"},0,0,"X",0,0,"X",0,"X",0,0,0,0,0]
[null,{"$f":"'CM Dictionary'!AK3","v":"Pump Equipment "},0,0,"X",0,0,"X",0,"X",0,0,0,0,0]
[null,{"$f":"'CM Dictionary'!AL3","v":"Scour Measures"},0,"X","X",0,0,"X",0,"X",0,0,0,0,"X"]
[null,{"$f":"'CM Dictionary'!AM3","v":"Stormwater Mgt"},0,0,"X",0,0,"X","X","X",0,0,"X",0,0]
[null,{"$f":"'CM Dictionary'!AN3","v":"Other 3"},0,0,0,0,0,0,0,0,0,0,0,0,0]
[null,{"$f":"'CM Dictionary'!AO3","v":"Other 4"},0,0,0,0,0,0,0,0,0,0,0,0,0]
[null,{"$f":"'CM Dictionary'!AP3","v":"Other 5"},0,0,0,0,0,0,0,0,0,0,0,0,0]
[null,{"$f":"'CM Dictionary'!AQ3","v":"Other 6"},0,0,0,0,0,0,0,0,0,0,0,0,0]
[null,{"$f":"'CM Dictionary'!AR3","v":"Other 7"},0,0,0,0,0,0,0,0,0,0,0,0,0]
[null,null,null,null,null,null,null,null,null,null,null,null,null,null,"TOTAL COST (x1000)",null,0,0,0,0,0,0,0,0,0,0,0,0]

{"sheet":"Station CM Summ","index":24,"n_rows":51,"n_cols":30,"rows_kept":51,"cut":false,"hidden":false,"merged":[[9,0,14,0],[15,0,27,0],[28,0,30,0],[31,0,39,0]]}
[]
[]
[]
[]
[]
[]
[]
[]
[null,null,{"$f":"TRANSPOSE('CM Dictionary'!C4:C9)","v":"PREVENTION"},"PROTECTION","MITIGATE","RESPONSE PREP. ","RECOVERY PREP.","DESIGN ENGINEERING",{"$f":"TRANSPOSE('CM Dictionary'!C15:C21)","v":"Area-Wide"},"Asset Specific","Temporary/Redeployable","Multipurpose Potential","Basic","Enhanced","Threat Responsive",null,"North Station","South Station","Bay Station","Downtown Station","Market Station","Park Street Station","Government Center","State Street","College Station","Suburban Station","Airport Station","All other aboveground ","All other belowground","TOTAL COST (x1000)"]
[null,{"$f":"'CM Dictionary'!D3","v":"Lighting"},{"$f":"TRANSPOSE('CM Dictionary'!D4:AR9)","v":0},"X","X",0,0,0,{"$f":"TRANSPOSE('CM Dictionary'!D15:AR21)","v":0},"X",0,"X","X",0,0]
[null,{"$f":"'CM Dictionary'!E3","v":"Barriers & Berms"},0,"X","X",0,0,0,0,"X",0,"X","X",0,0]
[null,{"$f":"'CM Dictionary'!F3","v":"Fences"},0,"X","X",0,0,0,0,"X",0,"X","X",0,0]
[null,{"$f":"'CM Dictionary'!G3","v":"CCTV"},0,"X","X",0,0,0,0,"X",0,"X","X",0,0]
[null,{"$f":"'CM Dictionary'!H3","v":"Intrusion Detection Devices"},0,"X","X",0,0,0,0,"X",0,"X","X",0,0]
[null,{"$f":"'CM Dictionary'!I3","v":"Physical Inspection of asset"},"X",0,0,0,0,0,0,"X","X","X","X",0,"X"]
[null,{"$f":"'CM Dictionary'!J3","v":"ID Cards"},0,"X",0,0,0,0,"X",0,0,0,"X",0,0]
[null,{"$f":"'CM Dictionary'!K3","v":"Biometrics"},0,"X",0,0,0,0,"X",0,0,0,0,"X",0]
[null,{"$f":"'CM Dictionary'!L3","v":"Background Checks"},0,0,"X",0,0,0,"X",0,0,0,"X",0,0]
[null,{"$f":"'CM Dictionary'!M3","v":"Metal Detectors"},0,0,"X",0,0,0,0,"X",0,0,0,"X",0]
[null,{"$f":"'CM Dictionary'!N3","v":"Restricted Parking"},0,"X",0,0,0,0,0,"X",0,0,"X",0,0]
[null,{"$f":"'CM Dictionary'!O3","v":"Random Inspections"},0,0,"X",0,0,0,"X",0,"X",0,0,0,"X"]
[null,{"$f":"'CM Dictionary'!P3","v":"Visible Badges"},0,"X",0,0,0,0,"X",0,0,0,"X",0,0]
[null,{"$f":"'CM Dictionary'!Q3","v":"Limited Access Points"},0,0,"X",0,0,0,0,"X","X",0,0,0,"X"]
[null,{"$f":"'CM Dictionary'!R3","v":"Visitor Control & Escort"},0,0,0,"X",0,0,0,"X","X",0,"X",0,0]
[null,{"$f":"'CM Dictionary'!S3","v":"Locks"},0,"X",0,0,0,0,0,"X",0,0,"X",0,0]
[null,{"$f":"'CM Dictionary'!T3","v":"Explosive Detection"},0,0,"X",0,0,0,0,"X","X",0,0,"X",0]
[null,{"$f":"'CM Dictionary'!U3","v":"Establish Clear Zones"},0,0,"X",0,0,0,0,"X",0,0,"X",0,0]
[null,{"$f":"'CM Dictionary'!V3","v":"Visible Signs"},0,"X",0,0,0,0,0,"X",0,0,"X",0,0]
[null,{"$f":"'CM Dictionary'!W3","v":"Seismic Retrofitting"},0,0,0,0,0,"X",0,"X",0,"X",0,"X",0]
[null,{"$f":"'CM Dictionary'!X3","v":"Fire Detection & Supression"},0,0,"X",0,"X",0,0,"X",0,"X",0,"X",0]
[null,{"$f":"'CM Dictionary'!Y3","v":"Encasement, Wrapping, Jacketing"},0,0,0,0,"X",0,0,"X",0,"X",0,"X",0]
[null,{"$f":"'CM Dictionary'!Z3","v":"Patrols"},0,0,"X",0,0,0,"X",0,"X","X","X",0,"X"]
[null,{"$f":"'CM Dictionary'!AA3","v":"WX/Seismic Information"},"X",0,0,0,"X",0,"X",0,0,"X","X",0,0]
[null,{"$f":"'CM Dictionary'!AB3","v":"Intelligence Networking"},"X",0,0,0,0,0,"X",0,"X",0,"X",0,"X"]
[null,{"$f":"'CM Dictionary'!AC3","v":"HAZMAT Mitigation"},0,0,0,0,"X",0,"X",0,"X",0,"X",0,0]
[null,{"$f":"'CM Dictionary'!AD3","v":"Security Awareness Training"},0,0,0,0,"X",0,"X",0,0,0,"X",0,0]
[null,{"$f":"'CM Dictionary'!AE3","v":"Emergency Response Training"},0,0,0,0,"X",0,"X",0,0,0,"X",0,0]
[null,{"$f":"'CM Dictionary'!AF3","v":"Emergency Evacuation Planning"},0,0,0,0,"X",0,"X",0,0,0,"X",0,0]
[null,{"$f":"'CM Dictionary'!AG3","v":"Planned Redundancy (e.g., detours)"},0,0,0,0,"X",0,"X",0,0,0,"X",0,0]
[null,{"$f":"'CM Dictionary'!AH3","v":"Public Information and Dissemination"},0,0,0,0,"X",0,"X",0,0,"X","X",0,"X"]
[null,{"$f":"'CM Dictionary'!AI3","v":"Safe Room"},0,0,"X","X","X","X",0,"X",0,0,0,0,0,0]
[null,{"$f":"'CM Dictionary'!AJ3","v":"Bracing/Tie-Downs"},0,0,"X",0,0,"X",0,"X",0,0,0,0,0]
[null,{"$f":"'CM Dictionary'!AK3","v":"Pump Equipment "},0,0,"X",0,0,"X",0,"X",0,0,0,0,0]
[null,{"$f":"'CM Dictionary'!AL3","v":"Scour Measures"},0,"X","X",0,0,"X",0,"X",0,0,0,0,"X"]
[null,{"$f":"'CM Dictionary'!AM3","v":"Stormwater Mgt"},0,0,"X",0,0,"X","X","X",0,0,"X",0,0]
[null,{"$f":"'CM Dictionary'!AN3","v":"Other 3"},0,0,0,0,0,0,0,0,0,0,0,0,0]
[null,{"$f":"'CM Dictionary'!AO3","v":"Other 4"},0,0,0,0,0,0,0,0,0,0,0,0,0]
[null,{"$f":"'CM Dictionary'!AP3","v":"Other 5"},0,0,0,0,0,0,0,0,0,0,0,0,0]
[null,{"$f":"'CM Dictionary'!AQ3","v":"Other 6"},0,0,0,0,0,0,0,0,0,0,0,0,0]
[null,{"$f":"'CM Dictionary'!AR3","v":"Other 7"},0,0,0,0,0,0,0,0,0,0,0,0,0]
[null,null,null,null,null,null,null,null,null,null,null,null,null,null,"TOTAL COST (x1000)",null,0,0,0,0,0,0,0,0,0,0,0,0,0,0]

{"sheet":"Rail Bridge CM Summ","index":25,"n_rows":51,"n_cols":23,"rows_kept":51,"cut":false,"hidden":false,"merged":[[9,0,14,0],[15,0,27,0],[28,0,30,0],[31,0,39,0]]}
[]
[]
[]
[]
[]
[]
[]
[]
[null,null,{"$f":"TRANSPOSE('CM Dictionary'!C4:C9)","v":"PREVENTION"},"PROTECTION","MITIGATE","RESPONSE PREP. ","RECOVERY PREP.","DESIGN ENGINEERING",{"$f":"TRANSPOSE('CM Dictionary'!C15:C21)","v":"Area-Wide"},"Asset Specific","Temporary/Redeployable","Multipurpose Potential","Basic","Enhanced","Threat Responsive",null,"River Bridge","Bay Bridge","Shipyard Bridge","Pedestrian","Highway Bridges - A","Highway Bridges - B","TOTAL COST (x1000)"]
[null,{"$f":"'CM Dictionary'!D3","v":"Lighting"},{"$f":"TRANSPOSE('CM Dictionary'!D4:AR9)","v":0},"X","X",0,0,0,{"$f":"TRANSPOSE('CM Dictionary'!D15:AR21)","v":0},"X",0,"X","X",0,0]
[null,{"$f":"'CM Dictionary'!E3","v":"Barriers & Berms"},0,"X","X",0,0,0,0,"X",0,"X","X",0,0]
[null,{"$f":"'CM Dictionary'!F3","v":"Fences"},0,"X","X",0,0,0,0,"X",0,"X","X",0,0]
[null,{"$f":"'CM Dictionary'!G3","v":"CCTV"},0,"X","X",0,0,0,0,"X",0,"X","X",0,0]
[null,{"$f":"'CM Dictionary'!H3","v":"Intrusion Detection Devices"},0,"X","X",0,0,0,0,"X",0,"X","X",0,0]
[null,{"$f":"'CM Dictionary'!I3","v":"Physical Inspection of asset"},"X",0,0,0,0,0,0,"X","X","X","X",0,"X"]
[null,{"$f":"'CM Dictionary'!J3","v":"ID Cards"},0,"X",0,0,0,0,"X",0,0,0,"X",0,0]
[null,{"$f":"'CM Dictionary'!K3","v":"Biometrics"},0,"X",0,0,0,0,"X",0,0,0,0,"X",0]
[null,{"$f":"'CM Dictionary'!L3","v":"Background Checks"},0,0,"X",0,0,0,"X",0,0,0,"X",0,0]
[null,{"$f":"'CM Dictionary'!M3","v":"Metal Detectors"},0,0,"X",0,0,0,0,"X",0,0,0,"X",0]
[null,{"$f":"'CM Dictionary'!N3","v":"Restricted Parking"},0,"X",0,0,0,0,0,"X",0,0,"X",0,0]
[null,{"$f":"'CM Dictionary'!O3","v":"Random Inspections"},0,0,"X",0,0,0,"X",0,"X",0,0,0,"X"]
[null,{"$f":"'CM Dictionary'!P3","v":"Visible Badges"},0,"X",0,0,0,0,"X",0,0,0,"X",0,0]
[null,{"$f":"'CM Dictionary'!Q3","v":"Limited Access Points"},0,0,"X",0,0,0,0,"X","X",0,0,0,"X"]
[null,{"$f":"'CM Dictionary'!R3","v":"Visitor Control & Escort"},0,0,0,"X",0,0,0,"X","X",0,"X",0,0]
[null,{"$f":"'CM Dictionary'!S3","v":"Locks"},0,"X",0,0,0,0,0,"X",0,0,"X",0,0]
[null,{"$f":"'CM Dictionary'!T3","v":"Explosive Detection"},0,0,"X",0,0,0,0,"X","X",0,0,"X",0]
[null,{"$f":"'CM Dictionary'!U3","v":"Establish Clear Zones"},0,0,"X",0,0,0,0,"X",0,0,"X",0,0]
[null,{"$f":"'CM Dictionary'!V3","v":"Visible Signs"},0,"X",0,0,0,0,0,"X",0,0,"X",0,0]
[null,{"$f":"'CM Dictionary'!W3","v":"Seismic Retrofitting"},0,0,0,0,0,"X",0,"X",0,"X",0,"X",0]
[null,{"$f":"'CM Dictionary'!X3","v":"Fire Detection & Supression"},0,0,"X",0,"X",0,0,"X",0,"X",0,"X",0]
[null,{"$f":"'CM Dictionary'!Y3","v":"Encasement, Wrapping, Jacketing"},0,0,0,0,"X",0,0,"X",0,"X",0,"X",0]
[null,{"$f":"'CM Dictionary'!Z3","v":"Patrols"},0,0,"X",0,0,0,"X",0,"X","X","X",0,"X"]
[null,{"$f":"'CM Dictionary'!AA3","v":"WX/Seismic Information"},"X",0,0,0,"X",0,"X",0,0,"X","X",0,0]
[null,{"$f":"'CM Dictionary'!AB3","v":"Intelligence Networking"},"X",0,0,0,0,0,"X",0,"X",0,"X",0,"X"]
[null,{"$f":"'CM Dictionary'!AC3","v":"HAZMAT Mitigation"},0,0,0,0,"X",0,"X",0,"X",0,"X",0,0]
[null,{"$f":"'CM Dictionary'!AD3","v":"Security Awareness Training"},0,0,0,0,"X",0,"X",0,0,0,"X",0,0]
[null,{"$f":"'CM Dictionary'!AE3","v":"Emergency Response Training"},0,0,0,0,"X",0,"X",0,0,0,"X",0,0]
[null,{"$f":"'CM Dictionary'!AF3","v":"Emergency Evacuation Planning"},0,0,0,0,"X",0,"X",0,0,0,"X",0,0]
[null,{"$f":"'CM Dictionary'!AG3","v":"Planned Redundancy (e.g., detours)"},0,0,0,0,"X",0,"X",0,0,0,"X",0,0]
[null,{"$f":"'CM Dictionary'!AH3","v":"Public Information and Dissemination"},0,0,0,0,"X",0,"X",0,0,"X","X",0,"X"]
[null,{"$f":"'CM Dictionary'!AI3","v":"Safe Room"},0,0,"X","X","X","X",0,"X",0,0,0,0,0,0]
[null,{"$f":"'CM Dictionary'!AJ3","v":"Bracing/Tie-Downs"},0,0,"X",0,0,"X",0,"X",0,0,0,0,0]
[null,{"$f":"'CM Dictionary'!AK3","v":"Pump Equipment "},0,0,"X",0,0,"X",0,"X",0,0,0,0,0]
[null,{"$f":"'CM Dictionary'!AL3","v":"Scour Measures"},0,"X","X",0,0,"X",0,"X",0,0,0,0,"X"]
[null,{"$f":"'CM Dictionary'!AM3","v":"Stormwater Mgt"},0,0,"X",0,0,"X","X","X",0,0,"X",0,0]
[null,{"$f":"'CM Dictionary'!AN3","v":"Other 3"},0,0,0,0,0,0,0,0,0,0,0,0,0]
[null,{"$f":"'CM Dictionary'!AO3","v":"Other 4"},0,0,0,0,0,0,0,0,0,0,0,0,0]
[null,{"$f":"'CM Dictionary'!AP3","v":"Other 5"},0,0,0,0,0,0,0,0,0,0,0,0,0]
[null,{"$f":"'CM Dictionary'!AQ3","v":"Other 6"},0,0,0,0,0,0,0,0,0,0,0,0,0]
[null,{"$f":"'CM Dictionary'!AR3","v":"Other 7"},0,0,0,0,0,0,0,0,0,0,0,0,0]
[null,null,null,null,null,null,null,null,null,null,null,null,null,null,"TOTAL COST (x1000)",null,0,0,0,0,0,0,0]

{"sheet":"Rail Tunnel CM Summ","index":26,"n_rows":51,"n_cols":21,"rows_kept":51,"cut":false,"hidden":false,"merged":[[9,0,14,0],[15,0,27,0],[28,0,30,0],[31,0,39,0]]}
[]
[]
[]
[]
[]
[]
[]
[]
[null,null,{"$f":"TRANSPOSE('CM Dictionary'!C4:C9)","v":"PREVENTION"},"PROTECTION","MITIGATE","RESPONSE PREP. ","RECOVERY PREP.","DESIGN ENGINEERING",{"$f":"TRANSPOSE('CM Dictionary'!C15:C21)","v":"Area-Wide"},"Asset Specific","Temporary/Redeployable","Multipurpose Potential","Basic","Enhanced","Threat Responsive",null,"River Tunnel I","River Tunnel II","South Station Tunnel","Point Channel Tunnel","TOTAL COST (x1000)"]
[null,{"$f":"'CM Dictionary'!D3","v":"Lighting"},{"$f":"TRANSPOSE('CM Dictionary'!D4:AR9)","v":0},"X","X",0,0,0,{"$f":"TRANSPOSE('CM Dictionary'!D15:AR21)","v":0},"X",0,"X","X",0,0]
[null,{"$f":"'CM Dictionary'!E3","v":"Barriers & Berms"},0,"X","X",0,0,0,0,"X",0,"X","X",0,0]
[null,{"$f":"'CM Dictionary'!F3","v":"Fences"},0,"X","X",0,0,0,0,"X",0,"X","X",0,0]
[null,{"$f":"'CM Dictionary'!G3","v":"CCTV"},0,"X","X",0,0,0,0,"X",0,"X","X",0,0]
[null,{"$f":"'CM Dictionary'!H3","v":"Intrusion Detection Devices"},0,"X","X",0,0,0,0,"X",0,"X","X",0,0]
[null,{"$f":"'CM Dictionary'!I3","v":"Physical Inspection of asset"},"X",0,0,0,0,0,0,"X","X","X","X",0,"X"]
[null,{"$f":"'CM Dictionary'!J3","v":"ID Cards"},0,"X",0,0,0,0,"X",0,0,0,"X",0,0]
[null,{"$f":"'CM Dictionary'!K3","v":"Biometrics"},0,"X",0,0,0,0,"X",0,0,0,0,"X",0]
[null,{"$f":"'CM Dictionary'!L3","v":"Background Checks"},0,0,"X",0,0,0,"X",0,0,0,"X",0,0]
[null,{"$f":"'CM Dictionary'!M3","v":"Metal Detectors"},0,0,"X",0,0,0,0,"X",0,0,0,"X",0]
[null,{"$f":"'CM Dictionary'!N3","v":"Restricted Parking"},0,"X",0,0,0,0,0,"X",0,0,"X",0,0]
[null,{"$f":"'CM Dictionary'!O3","v":"Random Inspections"},0,0,"X",0,0,0,"X",0,"X",0,0,0,"X"]
[null,{"$f":"'CM Dictionary'!P3","v":"Visible Badges"},0,"X",0,0,0,0,"X",0,0,0,"X",0,0]
[null,{"$f":"'CM Dictionary'!Q3","v":"Limited Access Points"},0,0,"X",0,0,0,0,"X","X",0,0,0,"X"]
[null,{"$f":"'CM Dictionary'!R3","v":"Visitor Control & Escort"},0,0,0,"X",0,0,0,"X","X",0,"X",0,0]
[null,{"$f":"'CM Dictionary'!S3","v":"Locks"},0,"X",0,0,0,0,0,"X",0,0,"X",0,0]
[null,{"$f":"'CM Dictionary'!T3","v":"Explosive Detection"},0,0,"X",0,0,0,0,"X","X",0,0,"X",0]
[null,{"$f":"'CM Dictionary'!U3","v":"Establish Clear Zones"},0,0,"X",0,0,0,0,"X",0,0,"X",0,0]
[null,{"$f":"'CM Dictionary'!V3","v":"Visible Signs"},0,"X",0,0,0,0,0,"X",0,0,"X",0,0]
[null,{"$f":"'CM Dictionary'!W3","v":"Seismic Retrofitting"},0,0,0,0,0,"X",0,"X",0,"X",0,"X",0]
[null,{"$f":"'CM Dictionary'!X3","v":"Fire Detection & Supression"},0,0,"X",0,"X",0,0,"X",0,"X",0,"X",0]
[null,{"$f":"'CM Dictionary'!Y3","v":"Encasement, Wrapping, Jacketing"},0,0,0,0,"X",0,0,"X",0,"X",0,"X",0]
[null,{"$f":"'CM Dictionary'!Z3","v":"Patrols"},0,0,"X",0,0,0,"X",0,"X","X","X",0,"X"]
[null,{"$f":"'CM Dictionary'!AA3","v":"WX/Seismic Information"},"X",0,0,0,"X",0,"X",0,0,"X","X",0,0]
[null,{"$f":"'CM Dictionary'!AB3","v":"Intelligence Networking"},"X",0,0,0,0,0,"X",0,"X",0,"X",0,"X"]
[null,{"$f":"'CM Dictionary'!AC3","v":"HAZMAT Mitigation"},0,0,0,0,"X",0,"X",0,"X",0,"X",0,0]
[null,{"$f":"'CM Dictionary'!AD3","v":"Security Awareness Training"},0,0,0,0,"X",0,"X",0,0,0,"X",0,0]
[null,{"$f":"'CM Dictionary'!AE3","v":"Emergency Response Training"},0,0,0,0,"X",0,"X",0,0,0,"X",0,0]
[null,{"$f":"'CM Dictionary'!AF3","v":"Emergency Evacuation Planning"},0,0,0,0,"X",0,"X",0,0,0,"X",0,0]
[null,{"$f":"'CM Dictionary'!AG3","v":"Planned Redundancy (e.g., detours)"},0,0,0,0,"X",0,"X",0,0,0,"X",0,0]
[null,{"$f":"'CM Dictionary'!AH3","v":"Public Information and Dissemination"},0,0,0,0,"X",0,"X",0,0,"X","X",0,"X"]
[null,{"$f":"'CM Dictionary'!AI3","v":"Safe Room"},0,0,"X","X","X","X",0,"X",0,0,0,0,0,0]
[null,{"$f":"'CM Dictionary'!AJ3","v":"Bracing/Tie-Downs"},0,0,"X",0,0,"X",0,"X",0,0,0,0,0]
[null,{"$f":"'CM Dictionary'!AK3","v":"Pump Equipment "},0,0,"X",0,0,"X",0,"X",0,0,0,0,0]
[null,{"$f":"'CM Dictionary'!AL3","v":"Scour Measures"},0,"X","X",0,0,"X",0,"X",0,0,0,0,"X"]
[null,{"$f":"'CM Dictionary'!AM3","v":"Stormwater Mgt"},0,0,"X",0,0,"X","X","X",0,0,"X",0,0]
[null,{"$f":"'CM Dictionary'!AN3","v":"Other 3"},0,0,0,0,0,0,0,0,0,0,0,0,0]
[null,{"$f":"'CM Dictionary'!AO3","v":"Other 4"},0,0,0,0,0,0,0,0,0,0,0,0,0]
[null,{"$f":"'CM Dictionary'!AP3","v":"Other 5"},0,0,0,0,0,0,0,0,0,0,0,0,0]
[null,{"$f":"'CM Dictionary'!AQ3","v":"Other 6"},0,0,0,0,0,0,0,0,0,0,0,0,0]
[null,{"$f":"'CM Dictionary'!AR3","v":"Other 7"},0,0,0,0,0,0,0,0,0,0,0,0,0]
[null,null,null,null,null,null,null,null,null,null,null,null,null,null,"TOTAL COST (x1000)",null,0,0,0,0,0]

{"sheet":"Facilities CM Summ","index":27,"n_rows":51,"n_cols":27,"rows_kept":51,"cut":false,"hidden":false,"merged":[[9,0,14,0],[15,0,27,0],[28,0,30,0],[31,0,39,0]]}
[]
[]
[]
[]
[]
[]
[]
[]
[null,null,{"$f":"TRANSPOSE('CM Dictionary'!C4:C9)","v":"PREVENTION"},"PROTECTION","MITIGATE","RESPONSE PREP. ","RECOVERY PREP.","DESIGN ENGINEERING",{"$f":"TRANSPOSE('CM Dictionary'!C15:C21)","v":"Area-Wide"},"Asset Specific","Temporary/Redeployable","Multipurpose Potential","Basic","Enhanced","Threat Responsive",null,"Rail Tunnel Ventilation ","Rail Tunnel Pump Stations","South Station -Bus Terminal","Bus maintenance Facility","Fuel Storage Sites","CNG Refueling Sites","Police HQ","Plaza Building","Operations Control Center","Parking garage","TOTAL COST (x1000)"]
[null,{"$f":"'CM Dictionary'!D3","v":"Lighting"},{"$f":"TRANSPOSE('CM Dictionary'!D4:AR9)","v":0},"X","X",0,0,0,{"$f":"TRANSPOSE('CM Dictionary'!D15:AR21)","v":0},"X",0,"X","X",0,0]
[null,{"$f":"'CM Dictionary'!E3","v":"Barriers & Berms"},0,"X","X",0,0,0,0,"X",0,"X","X",0,0]
[null,{"$f":"'CM Dictionary'!F3","v":"Fences"},0,"X","X",0,0,0,0,"X",0,"X","X",0,0]
[null,{"$f":"'CM Dictionary'!G3","v":"CCTV"},0,"X","X",0,0,0,0,"X",0,"X","X",0,0]
[null,{"$f":"'CM Dictionary'!H3","v":"Intrusion Detection Devices"},0,"X","X",0,0,0,0,"X",0,"X","X",0,0]
[null,{"$f":"'CM Dictionary'!I3","v":"Physical Inspection of asset"},"X",0,0,0,0,0,0,"X","X","X","X",0,"X"]
[null,{"$f":"'CM Dictionary'!J3","v":"ID Cards"},0,"X",0,0,0,0,"X",0,0,0,"X",0,0]
[null,{"$f":"'CM Dictionary'!K3","v":"Biometrics"},0,"X",0,0,0,0,"X",0,0,0,0,"X",0]
[null,{"$f":"'CM Dictionary'!L3","v":"Background Checks"},0,0,"X",0,0,0,"X",0,0,0,"X",0,0]
[null,{"$f":"'CM Dictionary'!M3","v":"Metal Detectors"},0,0,"X",0,0,0,0,"X",0,0,0,"X",0]
[null,{"$f":"'CM Dictionary'!N3","v":"Restricted Parking"},0,"X",0,0,0,0,0,"X",0,0,"X",0,0]
[null,{"$f":"'CM Dictionary'!O3","v":"Random Inspections"},0,0,"X",0,0,0,"X",0,"X",0,0,0,"X"]
[null,{"$f":"'CM Dictionary'!P3","v":"Visible Badges"},0,"X",0,0,0,0,"X",0,0,0,"X",0,0]
[null,{"$f":"'CM Dictionary'!Q3","v":"Limited Access Points"},0,0,"X",0,0,0,0,"X","X",0,0,0,"X"]
[null,{"$f":"'CM Dictionary'!R3","v":"Visitor Control & Escort"},0,0,0,"X",0,0,0,"X","X",0,"X",0,0]
[null,{"$f":"'CM Dictionary'!S3","v":"Locks"},0,"X",0,0,0,0,0,"X",0,0,"X",0,0]
[null,{"$f":"'CM Dictionary'!T3","v":"Explosive Detection"},0,0,"X",0,0,0,0,"X","X",0,0,"X",0]
[null,{"$f":"'CM Dictionary'!U3","v":"Establish Clear Zones"},0,0,"X",0,0,0,0,"X",0,0,"X",0,0]
[null,{"$f":"'CM Dictionary'!V3","v":"Visible Signs"},0,"X",0,0,0,0,0,"X",0,0,"X",0,0]
[null,{"$f":"'CM Dictionary'!W3","v":"Seismic Retrofitting"},0,0,0,0,0,"X",0,"X",0,"X",0,"X",0]
[null,{"$f":"'CM Dictionary'!X3","v":"Fire Detection & Supression"},0,0,"X",0,"X",0,0,"X",0,"X",0,"X",0]
[null,{"$f":"'CM Dictionary'!Y3","v":"Encasement, Wrapping, Jacketing"},0,0,0,0,"X",0,0,"X",0,"X",0,"X",0]
[null,{"$f":"'CM Dictionary'!Z3","v":"Patrols"},0,0,"X",0,0,0,"X",0,"X","X","X",0,"X"]
[null,{"$f":"'CM Dictionary'!AA3","v":"WX/Seismic Information"},"X",0,0,0,"X",0,"X",0,0,"X","X",0,0]
[null,{"$f":"'CM Dictionary'!AB3","v":"Intelligence Networking"},"X",0,0,0,0,0,"X",0,"X",0,"X",0,"X"]
[null,{"$f":"'CM Dictionary'!AC3","v":"HAZMAT Mitigation"},0,0,0,0,"X",0,"X",0,"X",0,"X",0,0]
[null,{"$f":"'CM Dictionary'!AD3","v":"Security Awareness Training"},0,0,0,0,"X",0,"X",0,0,0,"X",0,0]
[null,{"$f":"'CM Dictionary'!AE3","v":"Emergency Response Training"},0,0,0,0,"X",0,"X",0,0,0,"X",0,0]
[null,{"$f":"'CM Dictionary'!AF3","v":"Emergency Evacuation Planning"},0,0,0,0,"X",0,"X",0,0,0,"X",0,0]
[null,{"$f":"'CM Dictionary'!AG3","v":"Planned Redundancy (e.g., detours)"},0,0,0,0,"X",0,"X",0,0,0,"X",0,0]
[null,{"$f":"'CM Dictionary'!AH3","v":"Public Information and Dissemination"},0,0,0,0,"X",0,"X",0,0,"X","X",0,"X"]
[null,{"$f":"'CM Dictionary'!AI3","v":"Safe Room"},0,0,"X","X","X","X",0,"X",0,0,0,0,0,0]
[null,{"$f":"'CM Dictionary'!AJ3","v":"Bracing/Tie-Downs"},0,0,"X",0,0,"X",0,"X",0,0,0,0,0]
[null,{"$f":"'CM Dictionary'!AK3","v":"Pump Equipment "},0,0,"X",0,0,"X",0,"X",0,0,0,0,0]
[null,{"$f":"'CM Dictionary'!AL3","v":"Scour Measures"},0,"X","X",0,0,"X",0,"X",0,0,0,0,"X"]
[null,{"$f":"'CM Dictionary'!AM3","v":"Stormwater Mgt"},0,0,"X",0,0,"X","X","X",0,0,"X",0,0]
[null,{"$f":"'CM Dictionary'!AN3","v":"Other 3"},0,0,0,0,0,0,0,0,0,0,0,0,0]
[null,{"$f":"'CM Dictionary'!AO3","v":"Other 4"},0,0,0,0,0,0,0,0,0,0,0,0,0]
[null,{"$f":"'CM Dictionary'!AP3","v":"Other 5"},0,0,0,0,0,0,0,0,0,0,0,0,0]
[null,{"$f":"'CM Dictionary'!AQ3","v":"Other 6"},0,0,0,0,0,0,0,0,0,0,0,0,0]
[null,{"$f":"'CM Dictionary'!AR3","v":"Other 7"},0,0,0,0,0,0,0,0,0,0,0,0,0]
[null,null,null,null,null,null,null,null,null,null,null,null,null,null,"TOTAL COST (x1000)",null,0,0,0,0,0,0,0,0,0,0,0]

{"sheet":"Ferry CM Summ","index":28,"n_rows":51,"n_cols":17,"rows_kept":51,"cut":false,"hidden":false,"merged":[[9,0,14,0],[15,0,27,0],[28,0,30,0],[31,0,39,0]]}
[]
[]
[]
[]
[]
[]
[]
[]
[null,null,{"$f":"TRANSPOSE('CM Dictionary'!C4:C9)","v":"PREVENTION"},"PROTECTION","MITIGATE","RESPONSE PREP. ","RECOVERY PREP.","DESIGN ENGINEERING",{"$f":"TRANSPOSE('CM Dictionary'!C15:C21)","v":"Area-Wide"},"Asset Specific","Temporary/Redeployable","Multipurpose Potential","Basic","Enhanced","Threat Responsive",null,"TOTAL COST (x1000)"]
[null,{"$f":"'CM Dictionary'!D3","v":"Lighting"},{"$f":"TRANSPOSE('CM Dictionary'!D4:AR9)","v":0},"X","X",0,0,0,{"$f":"TRANSPOSE('CM Dictionary'!D15:AR21)","v":0},"X",0,"X","X",0,0]
[null,{"$f":"'CM Dictionary'!E3","v":"Barriers & Berms"},0,"X","X",0,0,0,0,"X",0,"X","X",0,0]
[null,{"$f":"'CM Dictionary'!F3","v":"Fences"},0,"X","X",0,0,0,0,"X",0,"X","X",0,0]
[null,{"$f":"'CM Dictionary'!G3","v":"CCTV"},0,"X","X",0,0,0,0,"X",0,"X","X",0,0]
[null,{"$f":"'CM Dictionary'!H3","v":"Intrusion Detection Devices"},0,"X","X",0,0,0,0,"X",0,"X","X",0,0]
[null,{"$f":"'CM Dictionary'!I3","v":"Physical Inspection of asset"},"X",0,0,0,0,0,0,"X","X","X","X",0,"X"]
[null,{"$f":"'CM Dictionary'!J3","v":"ID Cards"},0,"X",0,0,0,0,"X",0,0,0,"X",0,0]
[null,{"$f":"'CM Dictionary'!K3","v":"Biometrics"},0,"X",0,0,0,0,"X",0,0,0,0,"X",0]
[null,{"$f":"'CM Dictionary'!L3","v":"Background Checks"},0,0,"X",0,0,0,"X",0,0,0,"X",0,0]
[null,{"$f":"'CM Dictionary'!M3","v":"Metal Detectors"},0,0,"X",0,0,0,0,"X",0,0,0,"X",0]
[null,{"$f":"'CM Dictionary'!N3","v":"Restricted Parking"},0,"X",0,0,0,0,0,"X",0,0,"X",0,0]
[null,{"$f":"'CM Dictionary'!O3","v":"Random Inspections"},0,0,"X",0,0,0,"X",0,"X",0,0,0,"X"]
[null,{"$f":"'CM Dictionary'!P3","v":"Visible Badges"},0,"X",0,0,0,0,"X",0,0,0,"X",0,0]
[null,{"$f":"'CM Dictionary'!Q3","v":"Limited Access Points"},0,0,"X",0,0,0,0,"X","X",0,0,0,"X"]
[null,{"$f":"'CM Dictionary'!R3","v":"Visitor Control & Escort"},0,0,0,"X",0,0,0,"X","X",0,"X",0,0]
[null,{"$f":"'CM Dictionary'!S3","v":"Locks"},0,"X",0,0,0,0,0,"X",0,0,"X",0,0]
[null,{"$f":"'CM Dictionary'!T3","v":"Explosive Detection"},0,0,"X",0,0,0,0,"X","X",0,0,"X",0]
[null,{"$f":"'CM Dictionary'!U3","v":"Establish Clear Zones"},0,0,"X",0,0,0,0,"X",0,0,"X",0,0]
[null,{"$f":"'CM Dictionary'!V3","v":"Visible Signs"},0,"X",0,0,0,0,0,"X",0,0,"X",0,0]
[null,{"$f":"'CM Dictionary'!W3","v":"Seismic Retrofitting"},0,0,0,0,0,"X",0,"X",0,"X",0,"X",0]
[null,{"$f":"'CM Dictionary'!X3","v":"Fire Detection & Supression"},0,0,"X",0,"X",0,0,"X",0,"X",0,"X",0]
[null,{"$f":"'CM Dictionary'!Y3","v":"Encasement, Wrapping, Jacketing"},0,0,0,0,"X",0,0,"X",0,"X",0,"X",0]
[null,{"$f":"'CM Dictionary'!Z3","v":"Patrols"},0,0,"X",0,0,0,"X",0,"X","X","X",0,"X"]
[null,{"$f":"'CM Dictionary'!AA3","v":"WX/Seismic Information"},"X",0,0,0,"X",0,"X",0,0,"X","X",0,0]
[null,{"$f":"'CM Dictionary'!AB3","v":"Intelligence Networking"},"X",0,0,0,0,0,"X",0,"X",0,"X",0,"X"]
[null,{"$f":"'CM Dictionary'!AC3","v":"HAZMAT Mitigation"},0,0,0,0,"X",0,"X",0,"X",0,"X",0,0]
[null,{"$f":"'CM Dictionary'!AD3","v":"Security Awareness Training"},0,0,0,0,"X",0,"X",0,0,0,"X",0,0]
[null,{"$f":"'CM Dictionary'!AE3","v":"Emergency Response Training"},0,0,0,0,"X",0,"X",0,0,0,"X",0,0]
[null,{"$f":"'CM Dictionary'!AF3","v":"Emergency Evacuation Planning"},0,0,0,0,"X",0,"X",0,0,0,"X",0,0]
[null,{"$f":"'CM Dictionary'!AG3","v":"Planned Redundancy (e.g., detours)"},0,0,0,0,"X",0,"X",0,0,0,"X",0,0]
[null,{"$f":"'CM Dictionary'!AH3","v":"Public Information and Dissemination"},0,0,0,0,"X",0,"X",0,0,"X","X",0,"X"]
[null,{"$f":"'CM Dictionary'!AI3","v":"Safe Room"},0,0,"X","X","X","X",0,"X",0,0,0,0,0,0]
[null,{"$f":"'CM Dictionary'!AJ3","v":"Bracing/Tie-Downs"},0,0,"X",0,0,"X",0,"X",0,0,0,0,0]
[null,{"$f":"'CM Dictionary'!AK3","v":"Pump Equipment "},0,0,"X",0,0,"X",0,"X",0,0,0,0,0]
[null,{"$f":"'CM Dictionary'!AL3","v":"Scour Measures"},0,"X","X",0,0,"X",0,"X",0,0,0,0,"X"]
[null,{"$f":"'CM Dictionary'!AM3","v":"Stormwater Mgt"},0,0,"X",0,0,"X","X","X",0,0,"X",0,0]
[null,{"$f":"'CM Dictionary'!AN3","v":"Other 3"},0,0,0,0,0,0,0,0,0,0,0,0,0]
[null,{"$f":"'CM Dictionary'!AO3","v":"Other 4"},0,0,0,0,0,0,0,0,0,0,0,0,0]
[null,{"$f":"'CM Dictionary'!AP3","v":"Other 5"},0,0,0,0,0,0,0,0,0,0,0,0,0]
[null,{"$f":"'CM Dictionary'!AQ3","v":"Other 6"},0,0,0,0,0,0,0,0,0,0,0,0,0]
[null,{"$f":"'CM Dictionary'!AR3","v":"Other 7"},0,0,0,0,0,0,0,0,0,0,0,0,0]
[null,null,null,null,null,null,null,null,null,null,null,null,null,null,"TOTAL COST (x1000)",null,0]

{"sheet":"Fleet CM Summ","index":29,"n_rows":51,"n_cols":22,"rows_kept":51,"cut":false,"hidden":false,"merged":[[9,0,14,0],[15,0,27,0],[28,0,30,0],[31,0,39,0]]}
[]
[]
[]
[]
[]
[]
[]
[]
[null,null,{"$f":"TRANSPOSE('CM Dictionary'!C4:C9)","v":"PREVENTION"},"PROTECTION","MITIGATE","RESPONSE PREP. ","RECOVERY PREP.","DESIGN ENGINEERING",{"$f":"TRANSPOSE('CM Dictionary'!C15:C21)","v":"Area-Wide"},"Asset Specific","Temporary/Redeployable","Multipurpose Potential","Basic","Enhanced","Threat Responsive",null,"Red Line car","Blue Line","Orange Line car","Heavy rail  passenger","Heavy Rail control car","TOTAL COST (x1000)"]
[null,{"$f":"'CM Dictionary'!D3","v":"Lighting"},{"$f":"TRANSPOSE('CM Dictionary'!D4:AR9)","v":0},"X","X",0,0,0,{"$f":"TRANSPOSE('CM Dictionary'!D15:AR21)","v":0},"X",0,"X","X",0,0]
[null,{"$f":"'CM Dictionary'!E3","v":"Barriers & Berms"},0,"X","X",0,0,0,0,"X",0,"X","X",0,0]
[null,{"$f":"'CM Dictionary'!F3","v":"Fences"},0,"X","X",0,0,0,0,"X",0,"X","X",0,0]
[null,{"$f":"'CM Dictionary'!G3","v":"CCTV"},0,"X","X",0,0,0,0,"X",0,"X","X",0,0]
[null,{"$f":"'CM Dictionary'!H3","v":"Intrusion Detection Devices"},0,"X","X",0,0,0,0,"X",0,"X","X",0,0]
[null,{"$f":"'CM Dictionary'!I3","v":"Physical Inspection of asset"},"X",0,0,0,0,0,0,"X","X","X","X",0,"X"]
[null,{"$f":"'CM Dictionary'!J3","v":"ID Cards"},0,"X",0,0,0,0,"X",0,0,0,"X",0,0]
[null,{"$f":"'CM Dictionary'!K3","v":"Biometrics"},0,"X",0,0,0,0,"X",0,0,0,0,"X",0]
[null,{"$f":"'CM Dictionary'!L3","v":"Background Checks"},0,0,"X",0,0,0,"X",0,0,0,"X",0,0]
[null,{"$f":"'CM Dictionary'!M3","v":"Metal Detectors"},0,0,"X",0,0,0,0,"X",0,0,0,"X",0]
[null,{"$f":"'CM Dictionary'!N3","v":"Restricted Parking"},0,"X",0,0,0,0,0,"X",0,0,"X",0,0]
[null,{"$f":"'CM Dictionary'!O3","v":"Random Inspections"},0,0,"X",0,0,0,"X",0,"X",0,0,0,"X"]
[null,{"$f":"'CM Dictionary'!P3","v":"Visible Badges"},0,"X",0,0,0,0,"X",0,0,0,"X",0,0]
[null,{"$f":"'CM Dictionary'!Q3","v":"Limited Access Points"},0,0,"X",0,0,0,0,"X","X",0,0,0,"X"]
[null,{"$f":"'CM Dictionary'!R3","v":"Visitor Control & Escort"},0,0,0,"X",0,0,0,"X","X",0,"X",0,0]
[null,{"$f":"'CM Dictionary'!S3","v":"Locks"},0,"X",0,0,0,0,0,"X",0,0,"X",0,0]
[null,{"$f":"'CM Dictionary'!T3","v":"Explosive Detection"},0,0,"X",0,0,0,0,"X","X",0,0,"X",0]
[null,{"$f":"'CM Dictionary'!U3","v":"Establish Clear Zones"},0,0,"X",0,0,0,0,"X",0,0,"X",0,0]
[null,{"$f":"'CM Dictionary'!V3","v":"Visible Signs"},0,"X",0,0,0,0,0,"X",0,0,"X",0,0]
[null,{"$f":"'CM Dictionary'!W3","v":"Seismic Retrofitting"},0,0,0,0,0,"X",0,"X",0,"X",0,"X",0]
[null,{"$f":"'CM Dictionary'!X3","v":"Fire Detection & Supression"},0,0,"X",0,"X",0,0,"X",0,"X",0,"X",0]
[null,{"$f":"'CM Dictionary'!Y3","v":"Encasement, Wrapping, Jacketing"},0,0,0,0,"X",0,0,"X",0,"X",0,"X",0]
[null,{"$f":"'CM Dictionary'!Z3","v":"Patrols"},0,0,"X",0,0,0,"X",0,"X","X","X",0,"X"]
[null,{"$f":"'CM Dictionary'!AA3","v":"WX/Seismic Information"},"X",0,0,0,"X",0,"X",0,0,"X","X",0,0]
[null,{"$f":"'CM Dictionary'!AB3","v":"Intelligence Networking"},"X",0,0,0,0,0,"X",0,"X",0,"X",0,"X"]
[null,{"$f":"'CM Dictionary'!AC3","v":"HAZMAT Mitigation"},0,0,0,0,"X",0,"X",0,"X",0,"X",0,0]
[null,{"$f":"'CM Dictionary'!AD3","v":"Security Awareness Training"},0,0,0,0,"X",0,"X",0,0,0,"X",0,0]
[null,{"$f":"'CM Dictionary'!AE3","v":"Emergency Response Training"},0,0,0,0,"X",0,"X",0,0,0,"X",0,0]
[null,{"$f":"'CM Dictionary'!AF3","v":"Emergency Evacuation Planning"},0,0,0,0,"X",0,"X",0,0,0,"X",0,0]
[null,{"$f":"'CM Dictionary'!AG3","v":"Planned Redundancy (e.g., detours)"},0,0,0,0,"X",0,"X",0,0,0,"X",0,0]
[null,{"$f":"'CM Dictionary'!AH3","v":"Public Information and Dissemination"},0,0,0,0,"X",0,"X",0,0,"X","X",0,"X"]
[null,{"$f":"'CM Dictionary'!AI3","v":"Safe Room"},0,0,"X","X","X","X",0,"X",0,0,0,0,0,0]
[null,{"$f":"'CM Dictionary'!AJ3","v":"Bracing/Tie-Downs"},0,0,"X",0,0,"X",0,"X",0,0,0,0,0]
[null,{"$f":"'CM Dictionary'!AK3","v":"Pump Equipment "},0,0,"X",0,0,"X",0,"X",0,0,0,0,0]
[null,{"$f":"'CM Dictionary'!AL3","v":"Scour Measures"},0,"X","X",0,0,"X",0,"X",0,0,0,0,"X"]
[null,{"$f":"'CM Dictionary'!AM3","v":"Stormwater Mgt"},0,0,"X",0,0,"X","X","X",0,0,"X",0,0]
[null,{"$f":"'CM Dictionary'!AN3","v":"Other 3"},0,0,0,0,0,0,0,0,0,0,0,0,0]
[null,{"$f":"'CM Dictionary'!AO3","v":"Other 4"},0,0,0,0,0,0,0,0,0,0,0,0,0]
[null,{"$f":"'CM Dictionary'!AP3","v":"Other 5"},0,0,0,0,0,0,0,0,0,0,0,0,0]
[null,{"$f":"'CM Dictionary'!AQ3","v":"Other 6"},0,0,0,0,0,0,0,0,0,0,0,0,0]
[null,{"$f":"'CM Dictionary'!AR3","v":"Other 7"},0,0,0,0,0,0,0,0,0,0,0,0,0]
[null,null,null,null,null,null,null,null,null,null,null,null,null,null,"TOTAL COST (x1000)",null,0,0,0,0,0,0]

{"sheet":"Other CM Summ","index":30,"n_rows":51,"n_cols":18,"rows_kept":51,"cut":false,"hidden":false,"merged":[[9,0,14,0],[15,0,27,0],[28,0,30,0],[31,0,39,0]]}
[]
[]
[]
[]
[]
[]
[]
[]
[null,null,{"$f":"TRANSPOSE('CM Dictionary'!C4:C9)","v":"PREVENTION"},"PROTECTION","MITIGATE","RESPONSE PREP. ","RECOVERY PREP.","DESIGN ENGINEERING",{"$f":"TRANSPOSE('CM Dictionary'!C15:C21)","v":"Area-Wide"},"Asset Specific","Temporary/Redeployable","Multipurpose Potential","Basic","Enhanced","Threat Responsive",null,"Cluverts","TOTAL COST (x1000)"]
[null,{"$f":"'CM Dictionary'!D3","v":"Lighting"},{"$f":"TRANSPOSE('CM Dictionary'!D4:AR9)","v":0},"X","X",0,0,0,{"$f":"TRANSPOSE('CM Dictionary'!D15:AR21)","v":0},"X",0,"X","X",0,0]
[null,{"$f":"'CM Dictionary'!E3","v":"Barriers & Berms"},0,"X","X",0,0,0,0,"X",0,"X","X",0,0]
[null,{"$f":"'CM Dictionary'!F3","v":"Fences"},0,"X","X",0,0,0,0,"X",0,"X","X",0,0]
[null,{"$f":"'CM Dictionary'!G3","v":"CCTV"},0,"X","X",0,0,0,0,"X",0,"X","X",0,0]
[null,{"$f":"'CM Dictionary'!H3","v":"Intrusion Detection Devices"},0,"X","X",0,0,0,0,"X",0,"X","X",0,0]
[null,{"$f":"'CM Dictionary'!I3","v":"Physical Inspection of asset"},"X",0,0,0,0,0,0,"X","X","X","X",0,"X"]
[null,{"$f":"'CM Dictionary'!J3","v":"ID Cards"},0,"X",0,0,0,0,"X",0,0,0,"X",0,0]
[null,{"$f":"'CM Dictionary'!K3","v":"Biometrics"},0,"X",0,0,0,0,"X",0,0,0,0,"X",0]
[null,{"$f":"'CM Dictionary'!L3","v":"Background Checks"},0,0,"X",0,0,0,"X",0,0,0,"X",0,0]
[null,{"$f":"'CM Dictionary'!M3","v":"Metal Detectors"},0,0,"X",0,0,0,0,"X",0,0,0,"X",0]
[null,{"$f":"'CM Dictionary'!N3","v":"Restricted Parking"},0,"X",0,0,0,0,0,"X",0,0,"X",0,0]
[null,{"$f":"'CM Dictionary'!O3","v":"Random Inspections"},0,0,"X",0,0,0,"X",0,"X",0,0,0,"X"]
[null,{"$f":"'CM Dictionary'!P3","v":"Visible Badges"},0,"X",0,0,0,0,"X",0,0,0,"X",0,0]
[null,{"$f":"'CM Dictionary'!Q3","v":"Limited Access Points"},0,0,"X",0,0,0,0,"X","X",0,0,0,"X"]
[null,{"$f":"'CM Dictionary'!R3","v":"Visitor Control & Escort"},0,0,0,"X",0,0,0,"X","X",0,"X",0,0]
[null,{"$f":"'CM Dictionary'!S3","v":"Locks"},0,"X",0,0,0,0,0,"X",0,0,"X",0,0]
[null,{"$f":"'CM Dictionary'!T3","v":"Explosive Detection"},0,0,"X",0,0,0,0,"X","X",0,0,"X",0]
[null,{"$f":"'CM Dictionary'!U3","v":"Establish Clear Zones"},0,0,"X",0,0,0,0,"X",0,0,"X",0,0]
[null,{"$f":"'CM Dictionary'!V3","v":"Visible Signs"},0,"X",0,0,0,0,0,"X",0,0,"X",0,0]
[null,{"$f":"'CM Dictionary'!W3","v":"Seismic Retrofitting"},0,0,0,0,0,"X",0,"X",0,"X",0,"X",0]
[null,{"$f":"'CM Dictionary'!X3","v":"Fire Detection & Supression"},0,0,"X",0,"X",0,0,"X",0,"X",0,"X",0]
[null,{"$f":"'CM Dictionary'!Y3","v":"Encasement, Wrapping, Jacketing"},0,0,0,0,"X",0,0,"X",0,"X",0,"X",0]
[null,{"$f":"'CM Dictionary'!Z3","v":"Patrols"},0,0,"X",0,0,0,"X",0,"X","X","X",0,"X"]
[null,{"$f":"'CM Dictionary'!AA3","v":"WX/Seismic Information"},"X",0,0,0,"X",0,"X",0,0,"X","X",0,0]
[null,{"$f":"'CM Dictionary'!AB3","v":"Intelligence Networking"},"X",0,0,0,0,0,"X",0,"X",0,"X",0,"X"]
[null,{"$f":"'CM Dictionary'!AC3","v":"HAZMAT Mitigation"},0,0,0,0,"X",0,"X",0,"X",0,"X",0,0]
[null,{"$f":"'CM Dictionary'!AD3","v":"Security Awareness Training"},0,0,0,0,"X",0,"X",0,0,0,"X",0,0]
[null,{"$f":"'CM Dictionary'!AE3","v":"Emergency Response Training"},0,0,0,0,"X",0,"X",0,0,0,"X",0,0]
[null,{"$f":"'CM Dictionary'!AF3","v":"Emergency Evacuation Planning"},0,0,0,0,"X",0,"X",0,0,0,"X",0,0]
[null,{"$f":"'CM Dictionary'!AG3","v":"Planned Redundancy (e.g., detours)"},0,0,0,0,"X",0,"X",0,0,0,"X",0,0]
[null,{"$f":"'CM Dictionary'!AH3","v":"Public Information and Dissemination"},0,0,0,0,"X",0,"X",0,0,"X","X",0,"X"]
[null,{"$f":"'CM Dictionary'!AI3","v":"Safe Room"},0,0,"X","X","X","X",0,"X",0,0,0,0,0,0]
[null,{"$f":"'CM Dictionary'!AJ3","v":"Bracing/Tie-Downs"},0,0,"X",0,0,"X",0,"X",0,0,0,0,0]
[null,{"$f":"'CM Dictionary'!AK3","v":"Pump Equipment "},0,0,"X",0,0,"X",0,"X",0,0,0,0,0]
[null,{"$f":"'CM Dictionary'!AL3","v":"Scour Measures"},0,"X","X",0,0,"X",0,"X",0,0,0,0,"X"]
[null,{"$f":"'CM Dictionary'!AM3","v":"Stormwater Mgt"},0,0,"X",0,0,"X","X","X",0,0,"X",0,0]
[null,{"$f":"'CM Dictionary'!AN3","v":"Other 3"},0,0,0,0,0,0,0,0,0,0,0,0,0]
[null,{"$f":"'CM Dictionary'!AO3","v":"Other 4"},0,0,0,0,0,0,0,0,0,0,0,0,0]
[null,{"$f":"'CM Dictionary'!AP3","v":"Other 5"},0,0,0,0,0,0,0,0,0,0,0,0,0]
[null,{"$f":"'CM Dictionary'!AQ3","v":"Other 6"},0,0,0,0,0,0,0,0,0,0,0,0,0]
[null,{"$f":"'CM Dictionary'!AR3","v":"Other 7"},0,0,0,0,0,0,0,0,0,0,0,0,0]
[null,null,null,null,null,null,null,null,null,null,null,null,null,null,"TOTAL COST (x1000)",null,0,0]

{"sheet":"Road Bridge Hard Code","index":31,"n_rows":26,"n_cols":3,"rows_kept":26,"cut":false,"hidden":false,"merged":[]}
[]
[]
[]
[]
[]
[]
[]
[]
[]
[]
[]
[]
[]
[]
[]
[]
[]
[]
[]
[]
[]
[]
[]
[]
[null,"Bridge Replacement Cost"]
[null,"$/sq. ft.",150]

{"sheet":"Road Tunnel Hard Code","index":32,"n_rows":20,"n_cols":3,"rows_kept":20,"cut":false,"hidden":false,"merged":[]}
[]
[]
[]
[]
[]
[]
[]
[]
[]
[]
[]
[]
[]
[]
[]
[]
[]
[]
[null,"Replacement Cost"]
[null,"$/sq. ft.",100000]

{"sheet":"Station Hard Code","index":33,"n_rows":0,"n_cols":0,"rows_kept":0,"cut":false,"hidden":false,"merged":[]}

{"sheet":"Rail Bridge Hard Code","index":34,"n_rows":21,"n_cols":3,"rows_kept":21,"cut":false,"hidden":false,"merged":[]}
[]
[]
[]
[]
[]
[]
[]
[]
[]
[]
[]
[]
[]
[]
[]
[]
[]
[]
[]
[null,"Replacement Cost"]
[null,"$/ sq. ft.",15600]

{"sheet":"Rail Tunnels Hard Code","index":35,"n_rows":21,"n_cols":3,"rows_kept":21,"cut":false,"hidden":false,"merged":[]}
[]
[]
[]
[]
[]
[]
[]
[]
[]
[]
[]
[]
[]
[]
[]
[]
[]
[]
[]
[null,"Replacement Cost"]
[null,"$/ sq. ft.",40000]

{"sheet":"Facilities Hard Code","index":36,"n_rows":21,"n_cols":3,"rows_kept":21,"cut":false,"hidden":false,"merged":[]}
[]
[]
[]
[]
[]
[]
[]
[]
[]
[]
[]
[]
[]
[]
[]
[]
[]
[]
[]
[null,"Replacement Cost"]
[null,"$/Sq. ft.",210]

{"sheet":"Ferries Hard Code","index":37,"n_rows":0,"n_cols":0,"rows_kept":0,"cut":false,"hidden":false,"merged":[]}

{"sheet":"Fleet Hard Code","index":38,"n_rows":0,"n_cols":0,"rows_kept":0,"cut":false,"hidden":false,"merged":[]}

{"sheet":"Sheet1","index":39,"n_rows":0,"n_cols":0,"rows_kept":0,"cut":false,"hidden":false,"merged":[]}