{"text_format":"1","workbook":"xlsx","n_sheets":40,"sheets":["Welcome","Relevant Risks","Threat-Haz Vulnerability","Thresholds","Road Bridge","Road Tunnel","Station","Rail Bridge","Rail Tunnel","Facilities","Ferry","Fleet","Other","Critical Assets","PPI Info","CM Costs","Additional CMs","CM Filter","CM Opportunities","CM Dictionary","Asset Analyst","Results Summary","Road Bridge CM Summ","Road Tunnel CM Summ","Station CM Summ","Rail Bridge CM Summ","Rail Tunnel CM Summ","Facilities CM Summ","Ferry CM Summ","Fleet CM Summ","Other CM Summ","Road Bridge Hard Code","Road Tunnel Hard Code","Station Hard Code","Rail Bridge Hard Code","Rail Tunnels Hard Code","Facilities Hard Code","Ferries Hard Code","Fleet Hard Code","Sheet1"],"not_rendered":{"charts":2,"images":147,"macros":1,"external_links":0,"defined_names":4,"comments":1,"pivot_tables":0},"unopened":[],"bounds":{"document_bytes":16777216,"sheet_cells":100000,"rows_first":2000,"rows_last":500,"rows_between":2000,"halvings":0,"cell_chars":16384,"cell_head_chars":4096},"cells_cut":0,"cells_raw":0,"read":"whole","date_system":"1900"}

{"sheet":"Welcome","index":0,"n_rows":16,"n_cols":9,"rows_kept":16,"cut":false,"hidden":false,"merged":[]}
[]
[]
[]
[]
[]
[]
[]
[]
{"$rows_left_out":9}
{"sheet":"Relevant Risks","index":1,"n_rows":29,"n_cols":15,"rows_kept":29,"cut":false,"hidden":false,"merged":[[17,3,17,10],[12,3,12,10],[21,3,21,10],[26,3,26,10]]}
[null,null,null,null,null,null,null,null,null,null,null,"Y","Express",null,"Express"]
[null,null,null,null,null,null,null,null,null,null,null,"N"]
[]
[]
[]
[]
[]
[]
{"$rows_left_out":22}
{"sheet":"Threat-Haz Vulnerability","index":2,"n_rows":29,"n_cols":82,"rows_kept":29,"cut":false,"hidden":false,"merged":[[14,1,14,4],[14,9,14,12],[14,13,14,16],[14,21,14,24],[14,5,14,8],[14,17,14,20],[14,25,14,28],[14,29,14,32],[14,38,14,41],[14,42,14,45],[14,62,14,65],[14,66,14,69],[14,46,14,49],[14,50,14,53],[14,54,14,57],[14,58,14,61]]}
[]
[]
[]
[]
[null,null,null,null,null,null,null,null,null,null,null,null,null,null,null,null,null,null,null,null,null,null,null,null,null,null,null,null,null,null,null,null,null,null,null,null,null,null,null,null,null,null,null,null,null,null,null,null,null,null,null,null,null,null,null,null,null,null,null,null,null,null,null,null,null,null,null,null,null,null,null,null,null,null,"X"]
[]
[]
[]
{"$rows_left_out":22}
{"sheet":"Thresholds","index":3,"n_rows":46,"n_cols":5,"rows_kept":46,"cut":false,"hidden":false,"merged":[[15,3,17,3],[15,4,17,4]]}
[]
[]
[]
[]
[]
[]
[]
[]
{"$rows_left_out":39}
{"sheet":"Road Bridge","index":4,"n_rows":1300,"n_cols":19,"rows_kept":1300,"cut":false,"hidden":false,"merged":[[18,0,18,8],[18,11,18,14],[0,11,0,15],[1,11,1,14],[2,11,2,14],[3,11,3,14],[4,10,4,13],[5,10,5,13]]}
[null,null,null,null,null,null,null,null,null,null,null,"Specified Thresholds",null,null,null,null,null,null,"Yes"]
[null,null,null,null,null,null,null,null,null,null,null,"Potentially Exposed Population",null,null,null,{"$f":"Thresholds!C12","v":302},null,null,"No"]
[null,null,null,null,null,null,null,null,null,null,null,"Property Loss",null,null,null,{"$f":"Thresholds!C13","v":1007196726}]
[null,null,null,null,null,null,null,null,null,null,null,"Mission Importance",null,null,"Mission",{"$f":"Thresholds!C14","v":"Level III"},null,null,"Steel"]
[null,null,null,null,null,null,null,null,null,null,null,null,null,null,null,null,null,null,"Concrete"]
[null,null,null,null,null,null,null,null,null,null,null,null,null,null,null,null,null,null,"Other"]
[]
[]
{"$rows_left_out":1293}
{"sheet":"Road Tunnel","index":5,"n_rows":1300,"n_cols":19,"rows_kept":1300,"cut":false,"hidden":false,"merged":[[18,0,18,8],[18,11,18,14],[0,11,0,15],[1,11,1,14],[2,11,2,14],[3,11,3,14],[4,10,4,13],[5,10,5,13]]}
[null,null,null,null,null,null,null,null,null,null,null,"Specified Thresholds",null,null,null,null,null,null,"Yes"]
[null,null,null,null,null,null,null,null,null,null,null,"Potentially Exposed Population",null,null,null,{"$f":"Thresholds!C20","v":302},null,null,"No"]
[null,null,null,null,null,null,null,null,null,null,null,"Property Loss",null,null,null,{"$f":"Thresholds!C21","v":1007196726}]
[null,null,null,null,null,null,null,null,null,null,null,"Mission Importance",null,null,"Mission",{"$f":"Thresholds!C22","v":"Yes"},null,null,"Steel"]
[null,null,null,null,null,null,null,null,null,null,null,null,null,null,null,null,null,null,"Concrete"]
[null,null,null,null,null,null,null,null,null,null,null,null,null,null,null,null,null,null,"Other"]
[]
[]
{"$rows_left_out":1293}
{"sheet":"Station","index":6,"n_rows":1300,"n_cols":19,"rows_kept":1300,"cut":false,"hidden":false,"merged":[[18,0,18,7],[18,11,18,14],[0,11,0,15],[1,11,1,14],[2,11,2,14],[3,11,3,14],[4,10,4,13],[5,10,5,13]]}
[null,null,null,null,null,null,null,null,null,null,null,"Specified Thresholds",null,null,null,null,null,null,"Yes"]
[null,null,null,null,null,null,null,null,null,null,null,"Potentially Exposed Population",null,null,null,{"$f":"Thresholds!C24","v":302},null,null,"No"]
[null,null,null,null,null,null,null,null,null,null,null,"Property Loss",null,null,null,{"$f":"Thresholds!C25","v":"Yes"}]
[null,null,null,null,null,null,null,null,null,null,null,"Mission Importance",null,null,"Mission",{"$f":"Thresholds!C26","v":"Yes"}]
[]
[]
[]
[]
{"$rows_left_out":1293}
{"sheet":"Rail Bridge","index":7,"n_rows":1300,"n_cols":19,"rows_kept":1300,"cut":false,"hidden":false,"merged":[[18,0,18,7],[18,11,18,14],[0,11,0,15],[1,11,1,14],[2,11,2,14],[3,11,3,14],[4,10,4,13],[5,10,5,13]]}
[null,null,null,null,null,null,null,null,null,null,null,"Specified Thresholds",null,null,null,null,null,null,"Yes"]
[null,null,null,null,null,null,null,null,null,null,null,"Potentially Exposed Population",null,null,null,{"$f":"Thresholds!C28","v":302},null,null,"No"]
[null,null,null,null,null,null,null,null,null,null,null,"Property Loss",null,null,null,{"$f":"Thresholds!C29","v":503600863}]
[null,null,null,null,null,null,null,null,null,null,null,"Mission Importance",null,null,null,{"$f":"Thresholds!C30","v":50},null,null,"Steel"]
[null,null,null,null,null,null,null,null,null,null,null,null,null,null,null,null,null,null,"Concrete"]
[]
[]
[]
{"$rows_left_out":1293}
{"sheet":"Rail Tunnel","index":8,"n_rows":1300,"n_cols":19,"rows_kept":1300,"cut":false,"hidden":false,"merged":[[18,0,18,7],[18,11,18,14],[0,11,0,15],[1,11,1,14],[2,11,2,14],[3,11,3,14],[4,10,4,13],[5,10,5,13]]}
[null,null,null,null,null,null,null,null,null,null,null,"Specified Thresholds",null,null,null,null,null,null,"Yes"]
[null,null,null,null,null,null,null,null,null,null,null,"Potentially Exposed Population",null,null,null,{"$f":"Thresholds!C32","v":302},null,null,"No"]
[null,null,null,null,null,null,null,null,null,null,null,"Property Loss",null,null,null,{"$f":"Thresholds!C33","v":503600863}]
[null,null,null,null,null,null,null,null,null,null,null,"Mission Importance",null,null,null,{"$f":"Thresholds!C34","v":50},null,null,"Steel"]
[null,null,null,null,null,null,null,null,null,null,null,null,null,null,null,null,null,null,"Concrete"]
[]
[]
[]
{"$rows_left_out":1293}
{"sheet":"Facilities","index":9,"n_rows":1398,"n_cols":19,"rows_kept":1398,"cut":false,"hidden":false,"merged":[[18,0,18,7],[18,11,18,14],[0,11,0,15],[1,11,1,14],[2,11,2,14],[3,11,3,14],[4,10,4,13],[5,10,5,13]]}
[null,null,null,null,null,null,null,null,null,null,null,"Specified Thresholds",null,null,null,null,null,null,"Yes"]
[null,null,null,null,null,null,null,null,null,null,null,"Potentially Exposed Population",null,null,null,{"$f":"Thresholds!C36","v":303},null,null,"No"]
[null,null,null,null,null,null,null,null,null,null,null,"Property Loss",null,null,null,{"$f":"Thresholds!C37","v":111111111}]
[null,null,null,null,null,null,null,null,null,null,null,"Mission Importance",null,null,null,{"$f":"Thresholds!C38","v":"No"}]
[]
[]
[]
[]
{"$rows_left_out":1391}
{"sheet":"Ferry","index":10,"n_rows":1300,"n_cols":19,"rows_kept":1300,"cut":false,"hidden":false,"merged":[[18,0,18,7],[18,11,18,14],[0,11,0,15],[1,11,1,14],[2,11,2,14],[3,11,3,14],[4,10,4,13],[5,10,5,13]]}
[null,null,null,null,null,null,null,null,null,null,null,"Specified Thresholds",null,null,null,null,null,null,"Yes"]
[null,null,null,null,null,null,null,null,null,null,null,"Potentially Exposed Population",null,null,null,{"$f":"Thresholds!C40","v":302},null,null,"No"]
[null,null,null,null,null,null,null,null,null,null,null,"Property Loss",null,null,null,{"$f":"Thresholds!C41","v":100724172}]
[null,null,null,null,null,null,null,null,null,null,null,"Mission Importance",null,null,null,{"$f":"Thresholds!C42","v":"No"}]
[]
[]
[]
[]
{"$rows_left_out":1293}
{"sheet":"Fleet","index":11,"n_rows":1300,"n_cols":19,"rows_kept":1300,"cut":false,"hidden":false,"merged":[[18,0,18,7],[18,11,18,14],[0,11,0,15],[1,11,1,14],[2,11,2,14],[3,11,3,14],[4,10,4,13],[5,10,5,13]]}
[null,null,null,null,null,null,null,null,null,null,null,"Specified Thresholds",null,null,null,null,null,null,"Yes"]
[null,null,null,null,null,null,null,null,null,null,null,"Potentially Exposed Population",null,null,null,{"$f":"Thresholds!C44","v":302},null,null,"No"]
[null,null,null,null,null,null,null,null,null,null,null,"Property Loss",null,null,null,{"$f":"Thresholds!C45","v":100724172}]
[null,null,null,null,null,null,null,null,null,null,null,"Mission Importance",null,null,null,{"$f":"Thresholds!C46","v":"No"}]
[]
[]
[]
[]
{"$rows_left_out":1293}
{"sheet":"Other","index":12,"n_rows":21,"n_cols":16,"rows_kept":21,"cut":false,"hidden":false,"merged":[[18,2,18,14],[18,0,18,1]]}
[]
[]
[]
[]
[]
[]
[]
[]
{"$rows_left_out":14}
{"sheet":"Critical Assets","index":13,"n_rows":34,"n_cols":85,"rows_kept":34,"cut":false,"hidden":false,"merged":[[15,1,18,1],[20,1,32,1]]}
[]
[null,null,null,"Asset Type",null,"# of critical assets",null,null,"# of assets considered"]
[null,null,null,"Road bridges",null,25,null,null,26]
[null,null,null,"Road tunnels",null,11,null,null,11]
[null,null,null,"Stations",null,13,null,null,13]
[null,null,null,"Rail bridges",null,6,null,null,6]
[null,null,null,"Rail tunnels",null,4,null,null,4]
[null,null,null,"Facilities",null,10,null,null,12]
{"$rows_left_out":27}
{"sheet":"PPI Info","index":14,"n_rows":0,"n_cols":0,"rows_kept":0,"cut":false,"hidden":false,"merged":[]}

{"sheet":"CM Costs","index":15,"n_rows":45,"n_cols":10,"rows_kept":45,"cut":false,"hidden":false,"merged":[[11,1,16,1],[17,1,29,1],[30,1,32,1],[33,1,41,1],[42,1,44,1]]}
[]
[]
[]
[]
[]
[]
[]
[null,null,null,null,"PPI (Default=2015)",null,null,null,null," "]
{"$rows_left_out":38}
{"sheet":"Additional CMs","index":16,"n_rows":128,"n_cols":24,"rows_kept":128,"cut":false,"hidden":false,"merged":[[11,1,18,1],[19,1,21,1],[22,1,25,1],[26,1,28,1],[117,1,127,1],[29,1,39,1],[62,1,72,1],[51,1,61,1],[84,1,94,1],[95,1,105,1],[106,1,116,1],[40,1,50,1],[73,1,83,1]]}
[null,null,null,null,null,null,null,null,null,null,null,null,null,"L"]
[null,null,null,null,null,null,null,null,null,null,null,null,null,"M"]
[null,null,null,null,null,null,null,null,null,null,null,null,null,"H"]
[]
[null,null,null,null,null,null,null,null,null,null,null,null,null,"X"]
[]
[null,null,null,null,null,null,null,null,null,null,null,null,null,"ON"]
[null,null,null,null,null,null,null,null,null,null,null,null,null,"OFF"]
{"$rows_left_out":121}
{"sheet":"CM Filter","index":17,"n_rows":20,"n_cols":22,"rows_kept":20,"cut":false,"hidden":false,"merged":[[8,0,13,0],[14,0,16,0],[17,0,18,0]]}
[]
[]
[null,null,null,null,null,null,null,null,null,null,null,"Basic","Area-Wide",null,"Y"]
[null,null,null,null,null,null,null,null,null,null,null,"Enhanced","Asset-Specific",null,"N"]
[null,null,null,null,null,null,null,null,null,null,null,"Both","Both"]
[]
[]
[null,null,null,"Road Bridges","Road Tunnels","Transit/Rail Station","Transit/Rail Bridges","Transit/Rail Tunnels","Admin & Support Facilities","Ferry","Fleet","Other",null,"Road Bridges","Road Tunnels","Transit/Rail Station","Transit/Rail Bridges","Transit/Rail Tunnels","Admin & Support Facilities","Ferry","Fleet","Other"]
{"$rows_left_out":13}
{"sheet":"CM Opportunities","index":18,"n_rows":75,"n_cols":78,"rows_kept":75,"cut":false,"hidden":false,"merged":[[78,1,86,1],[75,1,77,1],[9,9,10,11],[9,5,10,7],[65,1,74,1],[53,1,55,1],[56,1,64,1],[40,1,52,1],[15,1,18,1],[20,1,32,1],[34,1,39,1]]}
[]
[]
[]
[]
[]
[]
[]
[]
{"$rows_left_out":68}
{"sheet":"CM Dictionary","index":19,"n_rows":120,"n_cols":44,"rows_kept":120,"cut":false,"hidden":false,"merged":[[0,34,0,36],[0,37,0,43],[0,9,0,21],[32,1,42,1],[21,1,31,1],[18,1,20,1],[3,1,10,1],[0,25,0,33],[11,0,20,0],[11,1,13,1],[14,1,17,1],[43,1,53,1],[0,22,0,24],[3,0,8,0],[21,0,119,0],[65,1,75,1],[87,1,97,1],[109,1,119,1],[54,1,64,1],[76,1,86,1],[98,1,108,1],[0,3,0,8]]}
[null,null,null,"Physical Security Countermeasures",null,null,null,null,null,"Access Control Countermeasures",null,null,null,null,null,null,null,null,null,null,null,null,"Asset Design/Engineering",null,null,"Operational Countermeasures",null,null,null,null,null,null,null,null,"Asset Specific Countermeasures",null,null,"Additional Countermeasures"]
[null,null,null,1,2,3,4,5,6,7,8,9,10,11,12,13,14,15,16,17,18,19,20,21,22,23,24,25,26,27,28,29,30,31,32,33,34,35,36,37,38,39,40,41]
[null,null,"Countermeasure","Lighting","Barriers & Berms","Fences","CCTV","Intrusion Detection Devices","Physical Inspection of asset","ID Cards","Biometrics","Background Checks","Metal Detectors","Restricted Parking","Random Inspections","Visible Badges","Limited Access Points","Visitor Control & Escort","Locks","Explosive Detection","Establish Clear Zones","Visible Signs","Seismic Retrofitting","Fire Detection & Supression","Encasement, Wrapping, Jacketing","Patrols","WX/Seismic Information","Intelligence Networking","HAZMAT Mitigation","Security Awareness Training","Emergency Response Training","Emergency Evacuation Planning","Planned Redundancy (e.g., detours)","Public Information and Dissemination",{"$f":"'CM Costs'!D43","v":"Safe Room"},{"$f":"'CM Costs'!D44","v":"Bracing/Tie-Downs"},{"$f":"'CM Costs'!D45","v":"Pump Equipment "},{"$f":"'Additional CMs'!D11","v":"Scour Measures"},{"$f":"'Additional CMs'!E11","v":"Stormwater Mgt"},{"$f":"'Additional CMs'!F11","v":"Other 3"},{"$f":"'Additional CMs'!G11","v":"Other 4"},{"$f":"'Additional CMs'!H11","v":"Other 5"},{"$f":"'Additional CMs'!I11","v":"Other 6"},{"$f":"'Additional CMs'!J11","v":"Other 7"}]
["CM Attributes","Functions","PREVENTION",null,null,null,null,null,"X",null,null,null,null,null,null,null,null,null,null,null,null,null,null,null,null,null,"X","X"]
[null,null,"PROTECTION","X","X","X","X","X",null,"X","X",null,null,"X",null,"X",null,null,"X",null,null,"X",null,null,null,null,null,null,null,null,null,null,null,null,null,null,null,"X"]
[null,null,"MITIGATE","X","X","X","X","X",null,null,null,"X","X",null,"X",null,"X",null,null,"X","X",null,null,"X",null,"X",null,null,null,null,null,null,null,null,"X","X","X","X","X"]
[null,null,"RESPONSE PREP. ",null,null,null,null,null,null,null,null,null,null,null,null,null,null,"X",null,null,null,null,null,null,null,null,null,null,null,null,null,null,null,null,"X"]
[null,null,"RECOVERY PREP.",null,null,null,null,null,null,null,null,null,null,null,null,null,null,null,null,null,null,null,null,"X","X",null,"X",null,"X","X","X","X","X","X","X"]
{"$rows_left_out":113}
{"sheet":"Asset Analyst","index":20,"n_rows":32,"n_cols":43,"rows_kept":32,"cut":false,"hidden":false,"merged":[]}
[4]
[]
[]
[]
[]
[]
[]
[null,"Asset Analyzed:"]
{"$rows_left_out":25}
{"sheet":"Results Summary","index":21,"n_rows":43,"n_cols":12,"rows_kept":43,"cut":false,"hidden":false,"merged":[[4,1,16,1],[18,2,19,2],[20,2,21,2],[37,1,42,1],[25,2,26,2],[22,2,23,2],[18,1,23,1],[30,1,35,1],[25,1,28,1],[25,3,26,3],[25,11,26,11],[25,5,26,5],[25,6,26,6],[25,9,26,9],[25,10,26,10],[25,8,26,8],[25,4,26,4],[25,7,26,7]]}
[null,null,null,null,null,null,"Report Date and Time:"]
[null,null,null,null,null,null,{"$f":"NOW()","v":"2016-09-30T07:58:58.470"}]
[]
[null,null,null,"Road Bridges","Road Tunnels","Transit/Rail Station","Transit/Rail Bridges","Transit/Rail Tunnels","Admin & Support Facilities","Ferry","Fleet","Other"]
[null,"Relevant Risks",{"$f":"'CM Dictionary'!C22","v":"Small Explosives"},{"$f":"IF('Relevant Risks'!D14=\"Y\",\"X\",\"\")","v":"X"},{"$f":"IF('Relevant Risks'!E14=\"Y\",\"X\",\"\")","v":"X"},{"$f":"IF('Relevant Risks'!F14=\"Y\",\"X\",\"\")","v":"X"},{"$f":"IF('Relevant Risks'!G14=\"Y\",\"X\",\"\")","v":"X"},{"$f":"IF('Relevant Risks'!H14=\"Y\",\"X\",\"\")","v":"X"},{"$f":"IF('Relevant Risks'!I14=\"Y\",\"X\",\"\")","v":"X"},{"$f":"IF('Relevant Risks'!J14=\"Y\",\"X\",\"\")","v":"X"},{"$f":"IF('Relevant Risks'!K14=\"Y\",\"X\",\"\")","v":"X"},{"$f":"IF((COUNTA(Other!C$21:C$1300)>0),\"X\",\"\")","v":""}]
[null,null,{"$f":"'CM Dictionary'!C23","v":"Large Explosives"},{"$f":"IF('Relevant Risks'!D15=\"Y\",\"X\",\"\")","v":"X"},{"$f":"IF('Relevant Risks'!E15=\"Y\",\"X\",\"\")","v":"X"},{"$f":"IF('Relevant Risks'!F15=\"Y\",\"X\",\"\")","v":"X"},{"$f":"IF('Relevant Risks'!G15=\"Y\",\"X\",\"\")","v":"X"},{"$f":"IF('Relevant Risks'!H15=\"Y\",\"X\",\"\")","v":"X"},{"$f":"IF('Relevant Risks'!I15=\"Y\",\"X\",\"\")","v":"X"},{"$f":"IF('Relevant Risks'!J15=\"Y\",\"X\",\"\")","v":"X"},{"$f":"IF('Relevant Risks'!K15=\"Y\",\"X\",\"\")","v":"X"},{"$f":"IF((COUNTA(Other!D$21:D$1300)>0),\"X\",\"\")","v":""}]
[null,null,{"$f":"'CM Dictionary'!C24","v":"Chemical / Biological / Radiological "},{"$f":"IF('Relevant Risks'!D16=\"Y\",\"X\",\"\")","v":"X"},{"$f":"IF('Relevant Risks'!E16=\"Y\",\"X\",\"\")","v":"X"},{"$f":"IF('Relevant Risks'!F16=\"Y\",\"X\",\"\")","v":"X"},{"$f":"IF('Relevant Risks'!G16=\"Y\",\"X\",\"\")","v":"X"},{"$f":"IF('Relevant Risks'!H16=\"Y\",\"X\",\"\")","v":"X"},{"$f":"IF('Relevant Risks'!I16=\"Y\",\"X\",\"\")","v":"X"},{"$f":"IF('Relevant Risks'!J16=\"Y\",\"X\",\"\")","v":"X"},{"$f":"IF('Relevant Risks'!K16=\"Y\",\"X\",\"\")","v":"X"},{"$f":"IF((COUNTA(Other!E$21:E$1300)>0),\"X\",\"\")","v":""}]
[null,null,{"$f":"'CM Dictionary'!C25","v":"Criminal Acts"},{"$f":"IF('Relevant Risks'!D17=\"Y\",\"X\",\"\")","v":"X"},{"$f":"IF('Relevant Risks'!E17=\"Y\",\"X\",\"\")","v":"X"},{"$f":"IF('Relevant Risks'!F17=\"Y\",\"X\",\"\")","v":"X"},{"$f":"IF('Relevant Risks'!G17=\"Y\",\"X\",\"\")","v":"X"},{"$f":"IF('Relevant Risks'!H17=\"Y\",\"X\",\"\")","v":"X"},{"$f":"IF('Relevant Risks'!I17=\"Y\",\"X\",\"\")","v":"X"},{"$f":"IF('Relevant Risks'!J17=\"Y\",\"X\",\"\")","v":"X"},{"$f":"IF('Relevant Risks'!K17=\"Y\",\"X\",\"\")","v":"X"},{"$f":"IF((COUNTA(Other!F$21:F$1300)>0),\"X\",\"\")","v":""}]
{"$rows_left_out":36}
{"sheet":"Road Bridge CM Summ","index":22,"n_rows":51,"n_cols":42,"rows_kept":51,"cut":false,"hidden":false,"merged":[[9,0,14,0],[15,0,27,0],[28,0,30,0],[31,0,39,0]]}
[]
[]
[]
[]
[]
[]
[]
[]
{"$rows_left_out":44}
{"sheet":"Road Tunnel CM Summ","index":23,"n_rows":51,"n_cols":28,"rows_kept":51,"cut":false,"hidden":false,"merged":[[9,0,14,0],[15,0,27,0],[28,0,30,0],[31,0,39,0]]}
[]
[]
[]
[]
[]
[]
[]
[]
{"$rows_left_out":44}
{"sheet":"Station CM Summ","index":24,"n_rows":51,"n_cols":30,"rows_kept":51,"cut":false,"hidden":false,"merged":[[9,0,14,0],[15,0,27,0],[28,0,30,0],[31,0,39,0]]}
[]
[]
[]
[]
[]
[]
[]
[]
{"$rows_left_out":44}
{"sheet":"Rail Bridge CM Summ","index":25,"n_rows":51,"n_cols":23,"rows_kept":51,"cut":false,"hidden":false,"merged":[[9,0,14,0],[15,0,27,0],[28,0,30,0],[31,0,39,0]]}
[]
[]
[]
[]
[]
[]
[]
[]
{"$rows_left_out":44}
{"sheet":"Rail Tunnel CM Summ","index":26,"n_rows":51,"n_cols":21,"rows_kept":51,"cut":false,"hidden":false,"merged":[[9,0,14,0],[15,0,27,0],[28,0,30,0],[31,0,39,0]]}
[]
[]
[]
[]
[]
[]
[]
[]
{"$rows_left_out":44}
{"sheet":"Facilities CM Summ","index":27,"n_rows":51,"n_cols":27,"rows_kept":51,"cut":false,"hidden":false,"merged":[[9,0,14,0],[15,0,27,0],[28,0,30,0],[31,0,39,0]]}
[]
[]
[]
[]
[]
[]
[]
[]
{"$rows_left_out":44}
{"sheet":"Ferry CM Summ","index":28,"n_rows":51,"n_cols":17,"rows_kept":51,"cut":false,"hidden":false,"merged":[[9,0,14,0],[15,0,27,0],[28,0,30,0],[31,0,39,0]]}
[]
[]
[]
[]
[]
[]
[]
[]
{"$rows_left_out":44}
{"sheet":"Fleet CM Summ","index":29,"n_rows":51,"n_cols":22,"rows_kept":51,"cut":false,"hidden":false,"merged":[[9,0,14,0],[15,0,27,0],[28,0,30,0],[31,0,39,0]]}
[]
[]
[]
[]
[]
[]
[]
[]
{"$rows_left_out":44}
{"sheet":"Other CM Summ","index":30,"n_rows":51,"n_cols":18,"rows_kept":51,"cut":false,"hidden":false,"merged":[[9,0,14,0],[15,0,27,0],[28,0,30,0],[31,0,39,0]]}
[]
[]
[]
[]
[]
[]
[]
[]
{"$rows_left_out":44}
{"sheet":"Road Bridge Hard Code","index":31,"n_rows":26,"n_cols":3,"rows_kept":26,"cut":false,"hidden":false,"merged":[]}
[]
[]
[]
[]
[]
[]
[]
[]
{"$rows_left_out":19}
{"sheet":"Road Tunnel Hard Code","index":32,"n_rows":20,"n_cols":3,"rows_kept":20,"cut":false,"hidden":false,"merged":[]}
[]
[]
[]
[]
[]
[]
[]
[]
{"$rows_left_out":13}
{"sheet":"Station Hard Code","index":33,"n_rows":0,"n_cols":0,"rows_kept":0,"cut":false,"hidden":false,"merged":[]}

{"sheet":"Rail Bridge Hard Code","index":34,"n_rows":21,"n_cols":3,"rows_kept":21,"cut":false,"hidden":false,"merged":[]}
[]
[]
[]
[]
[]
[]
[]
[]
{"$rows_left_out":14}
{"sheet":"Rail Tunnels Hard Code","index":35,"n_rows":21,"n_cols":3,"rows_kept":21,"cut":false,"hidden":false,"merged":[]}
[]
[]
[]
[]
[]
[]
[]
[]
{"$rows_left_out":14}
{"sheet":"Facilities Hard Code","index":36,"n_rows":21,"n_cols":3,"rows_kept":21,"cut":false,"hidden":false,"merged":[]}
[]
[]
[]
[]
[]
[]
[]
[]
{"$rows_left_out":14}
{"sheet":"Ferries Hard Code","index":37,"n_rows":0,"n_cols":0,"rows_kept":0,"cut":false,"hidden":false,"merged":[]}

{"sheet":"Fleet Hard Code","index":38,"n_rows":0,"n_cols":0,"rows_kept":0,"cut":false,"hidden":false,"merged":[]}

{"sheet":"Sheet1","index":39,"n_rows":0,"n_cols":0,"rows_kept":0,"cut":false,"hidden":false,"merged":[]}