{"text_format":"1","workbook":"xlsx","n_sheets":8,"sheets":["Welcome","Introduction","Main","Input Ramp Terminals","Output Summary","Output Ramp Terminals","Calibration Factors","Temp"],"not_rendered":{"charts":0,"images":21,"macros":1,"external_links":0,"defined_names":0,"comments":2,"pivot_tables":0},"unopened":[],"bounds":{"document_bytes":16777216,"sheet_cells":100000,"rows_first":2000,"rows_last":500,"rows_between":2000,"halvings":0,"cell_chars":16384,"cell_head_chars":4096},"cells_cut":0,"cells_raw":0,"read":"whole","date_system":"1900"}

{"sheet":"Welcome","index":0,"n_rows":49,"n_cols":7,"rows_kept":49,"cut":false,"hidden":false,"merged":[[2,2,2,11],[11,1,13,12],[7,1,9,12],[32,1,34,12],[17,1,19,12],[22,1,23,12],[25,1,30,12]]}
[]
[]
[null,null,"HSM Methodology for Ramp Terminals for Chapter 19"]
[]
[]
[null,null,null,null,null,null,"Based on Build 06.10 from ISATe"]
[null,"FOREWORD"]
[null,"This software can be used to evaluate the relationship between various highway design configurations and the expected average crash frequency.  The profession's understanding of the influence of geometric design and traffic control features on safety is an evolving process.  As additional information becomes available, this software will be updated to include the latest findings."]
[]
[]
[]
[null,"The \"Introduction\" worksheet provides useful information about this software.  This information should be read prior to first use of the software.  The Introduction worksheet can be selected from the tabs at the bottom of the screen.   After reading the Introduction, the other worksheets can be used to evaluate a freeway facility."]
[]
[]
[]
{"$rows_left_out":35}
{"sheet":"Introduction","index":1,"n_rows":476,"n_cols":10,"rows_kept":476,"cut":false,"hidden":false,"merged":[[475,1,476,12],[377,1,379,12],[381,1,387,12],[422,1,427,12],[447,1,451,12],[472,1,473,12],[2,2,2,11],[6,1,9,12],[11,1,12,12],[14,1,18,12],[40,1,42,12],[72,1,73,12],[66,1,69,12],[75,1,76,12],[80,1,81,12],[83,1,85,12],[261,1,263,12],[112,1,114,12],[117,1,120,12],[106,1,109,12],[239,1,243,12],[221,1,222,12],[200,1,203,12],[174,1,179,12],[148,1,151,12],[143,1,145,12],[140,1,141,12]]}
[]
[]
[null,null,"INTRODUCTION"]
[]
[]
[null,"PREFACE"]
[null,"This software provides information about the relationship between geometric design features and safety.  It is based on research that quantified the relationship between various design elements (e.g., lane width) or design components (e.g., left-turn bay) and average crash frequency.  The information provided in this software is intended to help designers make informed judgments about the safety performance of design alternatives.  "]
[]
[]
[]
[]
[null,"This software does not define design controls and does not represent a design requirement.  It is not a substitute for engineering judgment.  Further, it does not represent a legal requirement for roadway design."]
[]
[]
[null,"As discussed in the Highway Safety Manual, analysts should be aware that variability in crash data is so large that crash counts averaged over only a few years may not reveal telling information about the true average crash frequency at a given site.  This large variability, combined with the subtle influence that most geometric features have on safety, can make it difficult to observe the safety effect of a change in geometry in the year or two following the change.  In many cases, the change must be implemented at many sites and monitored for several years before its true effect on safety can be detected using crash data."]
{"$rows_left_out":462}
{"sheet":"Main","index":2,"n_rows":30,"n_cols":38,"rows_kept":30,"cut":false,"hidden":false,"merged":[[24,1,25,11],[5,10,5,11],[2,1,2,11],[4,3,4,11],[5,3,5,4],[5,6,5,7]]}
[]
[]
[null,"HSM Methodology for Chapter 19",null,null,null,null,null,null,null,null,null,null,null,null,null,null,null,null,null,null,null,null,null,null,null,null,null,null,"Freeway",null,null,null,"Ramp",null,null,null,"Ramp"]
[null,"General Information",null,null,null,null,null,null,null,null,null,null,null,null,null,null,null,null,null,null,null,null,null,null,null,null,null,null,"Segments",null,null,null,"Segments",null,null,null,"Terminals"]
[null,"Project description:",null,"Sample Data",null,null,null,null,null,null,null,null,null,null,null,null,null,null,null,null,null,null,null,null,null,null,"First year:",null,{"$f":"MIN($D7, AC7)","v":2015},null,null,null,{"$f":"MIN($D7, AG7)","v":2015},null,null,null,{"$f":"MIN($D7, AK7)","v":2015}]
[null,"Analyst:",null,"JAB",null,"Date:",{"$f":"NOW()","v":"2021-04-15T15:15:07.830"},null,"Area type:",null,"Urban",null,null,null,null,null,null,null,null,null,null,null,null,null,null,null,"Last year:",null,{"$f":"MAX($D8,AC8)","v":2015},null,null,null,{"$f":"MAX($D8,AG8)","v":2015},null,null,null,{"$f":"MAX($D8,AK8)","v":2015}]
[null,"First year of analysis:",null,2015,null,null,null,null,null,null,null,null,null,null,null,null,null,null,null,null,null,null,null,null,null,null,"First crash data year:",null,{"$f":"AD7","v":2015},2015,null,null,{"$f":"AH7","v":2015},2015,null,null,{"$f":"AL7","v":2015},2015]
[null,"Last year of analysis:",null,2015,{"$f":"IF(D8<D7, \"Note: must equal or exceed first year of analysis.\", IF(D8-MIN(AC5,AG5,AK5)+1>24, \"Note: last year must be less than or equal to \"&TEXT(MIN(AC5,AG5,AK5)+24-1,\"0\"),\".\"))","v":"."},null,null,null,null,null,null,null,null,null,null,null,null,null,null,null,null,null,null,null,null,null,"Last crash data year:",null,{"$f":"MIN($D$8, AD8, AC7+4,YEAR(NOW()))","v":2015},2015,null,null,{"$f":"MIN($D$8, AH8, AG7+4,YEAR(NOW()))","v":2015},2015,null,null,{"$f":"MIN($D$8, AL8, AK7+4,YEAR(NOW()))","v":2015},2015]
[null,"Crash Data Description"]
[null,null,null,null,null,null,null,null,null,null,null,null,null,null,null,null,null,null,null,null,null,null,null,null,null,null,"Freeway Segments",null,null,null,"Ramp Segments",null,null,null,"Ramp Terminals"]
[null,null,null,null,null,null,null,null,null,null,null,null,null,null,null,null,null,null,null,null,null,null,null,null,null,null,"No crash data",null,"Data for each individual segment",null,"No crash data",null,"Data for each individual segment",null,"No crash data",null,"No crash data"]
[null,null,null,null,null,null,null,null,null,null,null,null,null,null,null,null,null,null,null,null,null,null,null,null,null,null,"Data for all segments combined",null,null,null,"Data for all segments combined",null,null,null,"Data for all terminals combined"]
[null,null,null,null,null,null,null,null,null,null,null,null,null,null,null,null,null,null,null,null,null,null,null,null,null,null,"Data for each individual segment",null,null,null,"Data for each individual segment",null,null,null,"Data for each individual terminal"]
[null,"Ramp terminals",null,null,null,null,{"$f":"IF(L15-I15>4, \"Upper limit of 5 years of crash data.\", \".\")","v":"."},null,null,null,null,null,null,null,null,null,null,null,null,null,null,null,null,null,null,null,null,"Data?",{"$f":"IF(AC11=AA11, FALSE, TRUE)","v":true},null,null,null,{"$f":"IF(AG11=AE11, FALSE, TRUE)","v":true},null,null,null,{"$f":"IF(AK11=AI11, FALSE, TRUE)","v":false}]
[null,null,null,null,null,null,"First year of crash data:",null,2015,"Last year of crash data:",null,2016,null,null,null,null,null,null,null,null,null,null,null,null,null,null,null,"Project?",{"$f":"IF(AC11=AA12,TRUE,FALSE)","v":false},null,null,null,{"$f":"IF(AG11=AE12,TRUE,FALSE)","v":false},null,null,null,{"$f":"IF(AK11=AI12,TRUE,FALSE)","v":false}]
{"$rows_left_out":16}
{"sheet":"Input Ramp Terminals","index":3,"n_rows":183,"n_cols":31,"rows_kept":183,"cut":false,"hidden":false,"merged":[[42,1,42,5],[4,26,5,26],[4,27,5,27],[4,28,5,28],[4,29,5,29],[4,30,5,30],[4,20,5,20],[4,21,5,21],[4,22,5,22],[4,23,5,23],[4,24,5,24],[4,25,5,25],[4,17,5,17],[4,10,5,10],[4,11,5,11],[4,12,5,12],[4,13,5,13],[4,19,5,19],[4,15,5,15],[4,16,5,16],[4,6,5,6],[4,7,5,7],[4,8,5,8],[4,9,5,9],[46,6,46,7],[47,6,47,7],[48,6,48,7],[49,6,49,7],[140,5,141,5],[4,14,5,14],[44,6,44,7],[45,6,45,7],[54,6,54,7],[55,6,55,7],[56,6,56,7],[57,6,57,7],[50,6,50,7],[51,6,51,7],[52,6,52,7],[53,6,53,7],[62,6,62,7],[63,6,63,7],[64,6,64,7],[65,6,65,7],[58,6,58,7],[59,6,59,7],[60,6,60,7],[61,6,61,7],[66,6,66,7],[67,6,67,7],[44,8,44,9],[45,8,45,9],[46,8,46,9],[47,8,47,9],[48,8,48,9],[49,8,49,9],[50,8,50,9],[51,8,51,9],[56,8,56,9],[57,8,57,9],[58,8,58,9],[59,8,59,9],[52,8,52,9],[53,8,53,9],[54,8,54,9],[55,8,55,9],[64,8,64,9],[65,8,65,9],[66,8,66,9],[67,8,67,9],[60,8,60,9],[61,8,61,9],[62,8,62,9],[63,8,63,9],[48,10,48,11],[49,10,49,11],[50,10,50,11],[51,10,51,11],[44,10,44,11],[45,10,45,11],[46,10,46,11],[47,10,47,11],[56,10,56,11],[57,10,57,11],[58,10,58,11],[59,10,59,11],[52,10,52,11],[53,10,53,11],[54,10,54,11],[55,10,55,11],[64,10,64,11],[65,10,65,11],[66,10,66,11],[67,10,67,11],[60,10,60,11],[61,10,61,11],[62,10,62,11],[63,10,63,11],[48,12,48,13],[49,12,49,13],[50,12,50,13],[51,12,51,13],[64,12,64,13],[65,12,65,13],[66,12,66,13],[67,12,67,13],[60,12,60,13],[61,12,61,13],[62,12,62,13],[63,12,63,13],[44,12,44,13],[45,12,45,13],[46,12,46,13],[47,12,47,13],[56,12,56,13],[57,12,57,13],[58,12,58,13],[59,12,59,13],[52,12,52,13],[53,12,53,13],[54,12,54,13],[55,12,55,13],[55,14,55,15],[64,14,64,15],[65,14,65,15],[48,14,48,15],[49,14,49,15],[50,14,50,15],[51,14,51,15],[44,14,44,15],[45,14,45,15],[46,14,46,15],[47,14,47,15],[56,14,56,15],[66,14,66,15],[67,14,67,15],[60,14,60,15],[61,14,61,15],[62,14,62,15],[63,14,63,15],[48,16,48,17],[49,16,49,17],[50,16,50,17],[51,16,51,17],[64,16,64,17],[65,16,65,17],[66,16,66,17],[67,16,67,17],[60,16,60,17],[61,16,61,17],[62,16,62,17],[63,16,63,17],[57,14,57,15],[58,14,58,15],[59,14,59,15],[52,14,52,15],[53,14,53,15],[54,14,54,15],[44,16,44,17],[45,16,45,17],[46,16,46,17],[47,16,47,17],[56,16,56,17],[57,16,57,17],[58,16,58,17],[59,16,59,17],[52,16,52,17],[53,16,53,17],[54,16,54,17],[55,16,55,17],[79,6,79,7],[88,6,88,7],[89,6,89,7],[72,6,72,7],[73,6,73,7],[74,6,74,7],[75,6,75,7],[68,6,68,7],[69,6,69,7],[70,6,70,7],[71,6,71,7],[80,6,80,7],[90,6,90,7],[91,6,91,7],[84,6,84,7],[85,6,85,7],[86,6,86,7],[87,6,87,7],[72,8,72,9],[73,8,73,9],[74,8,74,9],[75,8,75,9],[88,8,88,9],[89,8,89,9],[90,8,90,9],[91,8,91,9],[84,8,84,9],[85,8,85,9],[86,8,86,9],[87,8,87,9],[81,6,81,7],[82,6,82,7],[83,6,83,7],[76,6,76,7],[77,6,77,7],[78,6,78,7],[68,8,68,9],[69,8,69,9],[70,8,70,9],[71,8,71,9],[80,8,80,9],[81,8,81,9],[82,8,82,9],[83,8,83,9],[76,8,76,9],[77,8,77,9],[78,8,78,9],[79,8,79,9],[79,10,79,11],[88,10,88,11],[89,10,89,11],[72,10,72,11],[73,10,73,11],[74,10,74,11],[75,10,75,11],[68,10,68,11],[69,10,69,11],[70,10,70,11],[71,10,71,11],[80,10,80,11],[90,10,90,11],[91,10,91,11],[84,10,84,11],[85,10,85,11],[86,10,86,11],[87,10,87,11],[72,12,72,13],[73,12,73,13],[74,12,74,13],[75,12,75,13],[88,12,88,13],[89,12,89,13],[90,12,90,13],[91,12,91,13],[84,12,84,13],[85,12,85,13],[86,12,86,13],[87,12,87,13],[81,10,81,11],[82,10,82,11],[83,10,83,11],[76,10,76,11],[77,10,77,11],[78,10,78,11],[68,12,68,13],[69,12,69,13],[70,12,70,13],[71,12,71,13],[80,12,80,13],[81,12,81,13],[82,12,82,13],[83,12,83,13],[76,12,76,13],[77,12,77,13],[78,12,78,13],[79,12,79,13],[79,14,79,15],[88,14,88,15],[89,14,89,15],[72,14,72,15],[73,14,73,15],[74,14,74,15],[75,14,75,15],[68,14,68,15],[69,14,69,15],[70,14,70,15],[71,14,71,15],[80,14,80,15],[90,14,90,15],[91,14,91,15],[84,14,84,15],[85,14,85,15],[86,14,86,15],[87,14,87,15],[72,16,72,17],[73,16,73,17],[74,16,74,17],[75,16,75,17],[88,16,88,17],[89,16,89,17],[90,16,90,17],[91,16,91,17],[84,16,84,17],[85,16,85,17],[86,16,86,17],[87,16,87,17],[81,14,81,15],[82,14,82,15],[83,14,83,15],[76,14,76,15],[77,14,77,15],[78,14,78,15],[68,16,68,17],[69,16,69,17],[70,16,70,17],[71,16,71,17],[80,16,80,17],[81,16,81,17],[82,16,82,17],[83,16,83,17],[76,16,76,17],[77,16,77,17],[78,16,78,17],[79,16,79,17],[103,6,103,7],[112,6,112,7],[113,6,113,7],[96,6,96,7],[97,6,97,7],[98,6,98,7],[99,6,99,7],[92,6,92,7],[93,6,93,7],[94,6,94,7],[95,6,95,7],[104,6,104,7],[114,6,114,7],[115,6,115,7],[108,6,108,7],[109,6,109,7],[110,6,110,7],[111,6,111,7],[96,8,96,9],[97,8,97,9],[98,8,98,9],[99,8,99,9],[112,8,112,9],[113,8,113,9],[114,8,114,9],[115,8,115,9],[108,8,108,9],[109,8,109,9],[110,8,110,9],[111,8,111,9],[105,6,105,7],[106,6,106,7],[107,6,107,7],[100,6,100,7],[101,6,101,7],[102,6,102,7],[92,8,92,9],[93,8,93,9],[94,8,94,9],[95,8,95,9],[104,8,104,9],[105,8,105,9],[106,8,106,9],[107,8,107,9],[100,8,100,9],[101,8,101,9],[102,8,102,9],[103,8,103,9],[103,10,103,11],[112,10,112,11],[113,10,113,11],[96,10,96,11],[97,10,97,11],[98,10,98,11],[99,10,99,11],[92,10,92,11],[93,10,93,11],[94,10,94,11],[95,10,95,11],[104,10,104,11],[114,10,114,11],[115,10,115,11],[108,10,108,11],[109,10,109,11],[110,10,110,11],[111,10,111,11],[96,12,96,13],[97,12,97,13],[98,12,98,13],[99,12,99,13],[112,12,112,13],[113,12,113,13],[114,12,114,13],[115,12,115,13],[108,12,108,13],[109,12,109,13],[110,12,110,13],[111,12,111,13],[105,10,105,11],[106,10,106,11],[107,10,107,11],[100,10,100,11],[101,10,101,11],[102,10,102,11],[92,12,92,13],[93,12,93,13],[94,12,94,13],[95,12,95,13],[104,12,104,13],[105,12,105,13],[106,12,106,13],[107,12,107,13],[100,12,100,13],[101,12,101,13],[102,12,102,13],[103,12,103,13],[103,14,103,15],[112,14,112,15],[113,14,113,15],[96,14,96,15],[97,14,97,15],[98,14,98,15],[99,14,99,15],[92,14,92,15],[93,14,93,15],[94,14,94,15],[95,14,95,15],[104,14,104,15],[114,14,114,15],[115,14,115,15],[108,14,108,15],[109,14,109,15],[110,14,110,15],[111,14,111,15],[96,16,96,17],[97,16,97,17],[98,16,98,17],[99,16,99,17],[112,16,112,17],[113,16,113,17],[114,16,114,17],[115,16,115,17],[108,16,108,17],[109,16,109,17],[110,16,110,17],[111,16,111,17],[105,14,105,15],[106,14,106,15],[107,14,107,15],[100,14,100,15],[101,14,101,15],[102,14,102,15],[92,16,92,17],[93,16,93,17],[94,16,94,17],[95,16,95,17],[104,16,104,17],[105,16,105,17],[106,16,106,17],[107,16,107,17],[100,16,100,17],[101,16,101,17],[102,16,102,17],[103,16,103,17],[127,6,127,7],[136,6,136,7],[137,6,137,7],[120,6,120,7],[121,6,121,7],[122,6,122,7],[123,6,123,7],[116,6,116,7],[117,6,117,7],[118,6,118,7],[119,6,119,7],[128,6,128,7],[138,6,138,7],[139,6,139,7],[132,6,132,7],[133,6,133,7],[134,6,134,7],[135,6,135,7],[120,8,120,9],[121,8,121,9],[122,8,122,9],[123,8,123,9],[136,8,136,9],[137,8,137,9],[138,8,138,9],[139,8,139,9],[132,8,132,9],[133,8,133,9],[134,8,134,9],[135,8,135,9],[129,6,129,7],[130,6,130,7],[131,6,131,7],[124,6,124,7],[125,6,125,7],[126,6,126,7],[116,8,116,9],[117,8,117,9],[118,8,118,9],[119,8,119,9],[128,8,128,9],[129,8,129,9],[130,8,130,9],[131,8,131,9],[124,8,124,9],[125,8,125,9],[126,8,126,9],[127,8,127,9],[127,10,127,11],[136,10,136,11],[137,10,137,11],[120,10,120,11],[121,10,121,11],[122,10,122,11],[123,10,123,11],[116,10,116,11],[117,10,117,11],[118,10,118,11],[119,10,119,11],[128,10,128,11],[138,10,138,11],[139,10,139,11],[132,10,132,11],[133,10,133,11],[134,10,134,11],[135,10,135,11],[120,12,120,13],[121,12,121,13],[122,12,122,13],[123,12,123,13],[136,12,136,13],[137,12,137,13],[138,12,138,13],[139,12,139,13],[132,12,132,13],[133,12,133,13],[134,12,134,13],[135,12,135,13],[129,10,129,11],[130,10,130,11],[131,10,131,11],[124,10,124,11],[125,10,125,11],[126,10,126,11],[116,12,116,13],[117,12,117,13],[118,12,118,13],[119,12,119,13],[128,12,128,13],[129,12,129,13],[130,12,130,13],[131,12,131,13],[124,12,124,13],[125,12,125,13],[126,12,126,13],[127,12,127,13],[127,14,127,15],[136,14,136,15],[137,14,137,15],[120,14,120,15],[121,14,121,15],[122,14,122,15],[123,14,123,15],[116,14,116,15],[117,14,117,15],[118,14,118,15],[119,14,119,15],[128,14,128,15],[138,14,138,15],[139,14,139,15],[132,14,132,15],[133,14,133,15],[134,14,134,15],[135,14,135,15],[120,16,120,17],[121,16,121,17],[122,16,122,17],[123,16,123,17],[136,16,136,17],[137,16,137,17],[138,16,138,17],[139,16,139,17],[132,16,132,17],[133,16,133,17],[134,16,134,17],[135,16,135,17],[129,14,129,15],[130,14,130,15],[131,14,131,15],[124,14,124,15],[125,14,125,15],[126,14,126,15],[116,16,116,17],[117,16,117,17],[118,16,118,17],[119,16,119,17],[128,16,128,17],[129,16,129,17],[130,16,130,17],[131,16,131,17],[124,16,124,17],[125,16,125,17],[126,16,126,17],[127,16,127,17]]}
[]
[]
[null,null,null,null,"Input Worksheet for Crossroad Ramp Terminals"]
[null,null,null,null,null,null,{"$f":"\"Terminal \"& TEXT(INT((COLUMN()-5)/2),\"0\")","v":"Terminal 1"},null,{"$f":"\"Terminal \"& TEXT(INT((COLUMN()-5)/2),\"0\")","v":"Terminal 2"},null,{"$f":"\"Terminal \"& TEXT(INT((COLUMN()-5)/2),\"0\")","v":"Terminal 3"},null,{"$f":"\"Terminal \"& TEXT(INT((COLUMN()-5)/2),\"0\")","v":"Terminal 4"},null,{"$f":"\"Terminal \"& TEXT(INT((COLUMN()-5)/2),\"0\")","v":"Terminal 5"},null,{"$f":"\"Terminal \"& TEXT(INT((COLUMN()-5)/2),\"0\")","v":"Terminal 6"},null,null,{"$f":"G4","v":"Terminal 1"},null,{"$f":"I4","v":"Terminal 2"},null,{"$f":"K4","v":"Terminal 3"},null,{"$f":"M4","v":"Terminal 4"},null,{"$f":"O4","v":"Terminal 5"},null,{"$f":"Q4","v":"Terminal 6"}]
[null,null,null,null,null,null,{"$f":"IF(Main!$AK$14=TRUE, \"Crash Period\", \"Study Period\")","v":"Study Period"},{"$f":"IF(Main!$AK$14=TRUE, \"Study Period\", \"\")","v":""},{"$f":"G5","v":"Study Period"},"","Study Period","","Study Period","","Study Period","","Study Period","",null,{"$f":"G5","v":"Study Period"},{"$f":"H5","v":""},{"$f":"I5","v":"Study Period"},{"$f":"J5","v":""},{"$f":"K5","v":"Study Period"},{"$f":"L5","v":""},{"$f":"M5","v":"Study Period"},{"$f":"N5","v":""},{"$f":"O5","v":"Study Period"},{"$f":"P5","v":""},{"$f":"Q5","v":"Study Period"},{"$f":"R5","v":""}]
[null,null,"      (View results in Column T)","(View results in Advisory Messages)"]
[null,"Basic Intersection Data"]
[null,"Ramp terminal configuration:",null,null,null,null,"TDI",{"$f":"G8","v":"TDI"},null,{"$f":"I8","v":0},null,{"$f":"K8","v":0},null,{"$f":"M8","v":0},null,{"$f":"O8","v":0},null,{"$f":"Q8","v":0},null,"SPUI","SPUI"]
[null,"Ramp terminal description:",null,null,null,null,"NB exit ramp at Main",null,"SB exit ramp at Main",null,null,"Alt 1",null,null,null,null,null,null,null,"NB exit ramp at Main"]
[null,"Ramp terminal traffic control type:",null,null,null,null,"Signal",{"$f":"G10","v":"Signal"},"One stop",{"$f":"I10","v":"One stop"},"One stop",{"$f":"K10","v":"One stop"},"All stop",{"$f":"M10","v":"All stop"},"One stop",{"$f":"O10","v":"One stop"},"Signal",{"$f":"Q10","v":"Signal"},null,"Signal","Signal"]
[null,"Is a non-ramp public street leg present at the terminal (Ips)?:",null,null,null,null,"No",{"$f":"G11","v":"No"},null,{"$f":"I11","v":0},null,{"$f":"K11","v":0},null,{"$f":"M11","v":0},null,{"$f":"O11","v":0},"No",{"$f":"Q11","v":"No"}]
[null,"Alignment Data"]
[null,"Exit ramp skew angle (Isk), degrees:",null,null,null,null,2,{"$f":"G13","v":2},1,{"$f":"I13","v":1},15,{"$f":"K13","v":15},35,{"$f":"M13","v":35},52,{"$f":"O13","v":52},null,{"$f":"Q13","v":0},null,0,0]
[null,"Distance to the next public street intersection on the outside crossroad leg (Lstr), mi:",null,null,null,null,0.02,{"$f":"G14","v":0.02},0.13,{"$f":"I14","v":0.13},0.56999999999999995,{"$f":"K14","v":0.56999999999999995},0.55000000000000004,{"$f":"M14","v":0.55000000000000004},0.12,{"$f":"O14","v":0.12},7.4999999999999997E-2,{"$f":"Q14","v":7.4999999999999997E-2},null,1.9999999552965164E-2,1.9999999552965164E-2]
[null,"Distance to the adjacent ramp terminal (Lrmp), mi:",null,null,null,null,0.12,{"$f":"G15","v":0.12},0.15,{"$f":"I15","v":0.15},0.15,{"$f":"K15","v":0.15},8.5000000000000006E-2,{"$f":"M15","v":8.5000000000000006E-2},0.16,{"$f":"O15","v":0.16},0.17,{"$f":"Q15","v":0.17},null,0,0.11999999731779099]
{"$rows_left_out":169}
{"sheet":"Output Summary","index":4,"n_rows":64,"n_cols":23,"rows_kept":64,"cut":false,"hidden":false,"merged":[[2,13,2,23],[4,15,4,23],[5,15,5,16],[5,18,5,19],[5,22,5,23],[49,1,50,2],[49,3,50,5],[2,1,2,11],[4,3,4,11],[5,3,5,4],[5,6,5,7],[5,10,5,11],[49,6,49,11]]}
[]
[]
[null,"Output Summary",null,null,null,null,null,null,null,null,null,null,null,"Evaluation Site Summary"]
[null,"General Information",null,null,null,null,null,null,null,null,null,null,null,"General Information"]
[null,"Project description:",null,{"$f":"Main!D5","v":"Sample Data"},null,null,null,null,null,null,null,null,null,"Project description:",null,{"$f":"D5","v":"Sample Data"}]
[null,"Analyst:",null,{"$f":"Main!D6","v":"JAB"},null,"Date:",{"$f":"Main!G6","v":"2021-04-15T15:15:07.830"},null,"Area type:",null,{"$f":"Main!K6","v":"Urban"},null,null,"Analyst:",null,{"$f":"D6","v":"JAB"},null,"Date:",{"$f":"G6","v":"2021-04-15T15:15:07.830"},null,"Area type:",null,{"$f":"K6","v":"Urban"}]
[null,"First year of analysis:",null,{"$f":"Main!D7","v":2015},null,null,null,null,null,null,null,null,null,"First year of analysis:",null,{"$f":"D7","v":2015}]
[null,"Last year of analysis:",null,{"$f":"Main!D8","v":2015},null,null,null,null,null,null,null,null,null,"Last year of analysis:",null,{"$f":"D8","v":2015}]
[null,"Crash Data Description",null,null,null,null,null,null,null,null,null,null,null,"Site Description"]
[]
[]
[]
[]
[null,"Ramp terminals",null,"Site crash data available?",null,null,null,"No","First year of crash data:"]
[null,null,null,"Project-level crash data available?",null,null,null,"No","Last year of crash data:"]
{"$rows_left_out":50}
{"sheet":"Output Ramp Terminals","index":5,"n_rows":756,"n_cols":18,"rows_kept":756,"cut":false,"hidden":false,"merged":[[561,4,561,5],[557,4,557,5],[558,4,558,5],[559,4,559,5],[560,4,560,5],[4,17,5,17],[553,4,554,5],[555,4,555,5],[556,4,556,5],[4,13,5,13],[4,14,5,14],[4,15,5,15],[4,16,5,16],[4,9,5,9],[4,10,5,10],[4,11,5,11],[4,12,5,12],[4,4,5,5],[4,6,5,6],[4,7,5,7],[4,8,5,8]]}
[]
[]
[null,null,null,null,"Output Worksheet for Crossroad Ramp Terminals"]
[null,"   Signal = signalized intersection model",null,null,null,null,{"$f":"\"Terminal \"& TEXT(INT((COLUMN()-5)/2),\"0\")","v":"Terminal 1"},null,{"$f":"\"Terminal \"& TEXT(INT((COLUMN()-5)/2),\"0\")","v":"Terminal 2"},null,{"$f":"\"Terminal \"& TEXT(INT((COLUMN()-5)/2),\"0\")","v":"Terminal 3"},null,{"$f":"\"Terminal \"& TEXT(INT((COLUMN()-5)/2),\"0\")","v":"Terminal 4"},null,{"$f":"\"Terminal \"& TEXT(INT((COLUMN()-5)/2),\"0\")","v":"Terminal 5"},null,{"$f":"\"Terminal \"& TEXT(INT((COLUMN()-5)/2),\"0\")","v":"Terminal 6"}]
[null,"   Unsig = unsignalized intersection model",null,null,"Applicable Models",null,{"$f":"IF(Main!$AK$14=TRUE, \"Crash Period\", \"Study Period\")","v":"Study Period"},{"$f":"IF(Main!$AK$14=TRUE, \"Study Period\", \"\")","v":""},{"$f":"G5","v":"Study Period"},"","Study Period","","Study Period","","Study Period","","Study Period",""]
[]
[null,"Crash Modification Factors"]
[null,"Fatal-and-Injury Crash CMFs"]
[null,"Non-ramp public street leg (CMF19,w,SG,at,fi):",null,null,"Signal"]
[null,"Segment length (CMF14,w,x,at,fi):",null,null,"Signal","Unsig"]
[null,"Protected left-turn operation (CMF16,w,SG,at,fi):",null,null,"Signal"]
[null,null,null,null,"Year:",{"$f":"Main!$AK$5","v":2015}]
[null,null,null,null,null,{"$f":"F12+1","v":2016}]
[null,null,null,null,null,{"$f":"F13+1","v":2017}]
[null,null,null,null,null,2018]
{"$rows_left_out":742}
{"sheet":"Calibration Factors","index":6,"n_rows":283,"n_cols":18,"rows_kept":283,"cut":false,"hidden":false,"merged":[[2,1,2,13],[121,1,122,2],[121,3,122,3],[121,4,122,5],[121,6,122,7],[121,8,122,8],[4,12,5,12],[4,3,5,3],[4,13,5,13],[4,6,5,7],[4,4,5,5],[121,9,122,9],[121,10,122,10],[121,11,122,11],[121,12,122,12],[121,13,122,13],[4,1,5,2],[4,8,5,8],[4,9,5,9],[4,10,5,10],[4,11,5,11],[241,16,241,17],[240,8,240,17],[277,1,277,2],[241,14,241,15],[270,1,270,2],[240,1,242,2],[240,3,242,4],[240,5,242,7],[241,8,241,9],[241,10,241,11],[241,12,241,13]]}
[]
[]
[null,"Ramp Terminal Model Calibration Factors and Default Values"]
[null,"Ramp Terminal Fatal-and-Injury Crash Frequency Models",null,null,null,null,null,"Model: exp(a + b ln[c AADTin/2 + c AADTout/2] + d ln[c AADTex + c AADTen])"]
[null,"Area Type",null,"Terminal Config.","Control Type",null,"Through Lanes",null,"a","b","c","d","Inverse Disp. (K)","Calib. Factor (C)"]
[]
[null,"Rural",null,"D3ex","One-way stop",null,null,2,{"$f":"-3.223+0.324","v":-2.899},0.58199999999999996,1E-3,0.89900000000000002,2.16,1.1000000000000001]
[null,null,null,null,null,null,null,3,{"$f":"-3.223+0.324","v":-2.899},0.58199999999999996,1E-3,0.89900000000000002,2.16,{"$f":"N7","v":1.1000000000000001}]
[null,null,null,null,null,null,null,4,{"$f":"-3.223+0.324","v":-2.899},0.58199999999999996,1E-3,0.89900000000000002,2.16,{"$f":"N8","v":1.1000000000000001}]
[null,null,null,null,"Signalized",null,null,2,{"$f":"-1.672+0.16*H10","v":-1.3519999999999999},0.379,1E-3,0.39400000000000002,8.7200000000000006,1.1000000000000001]
[null,null,null,null,null,null,null,3,{"$f":"-1.672+0.16*H11","v":-1.1919999999999999},0.379,1E-3,0.39400000000000002,8.7200000000000006,{"$f":"N10","v":1.1000000000000001}]
[null,null,null,null,null,null,null,4,{"$f":"-1.672+0.16*H12","v":-1.032},0.379,1E-3,0.39400000000000002,8.7200000000000006,{"$f":"N11","v":1.1000000000000001}]
[null,null,null,"D3en","One-way stop",null,null,2,{"$f":"-3.141+0.324","v":-2.8170000000000002},0.70899999999999996,1E-3,0.73,0.91800000000000004,{"$f":"N7","v":1.1000000000000001}]
[null,null,null,null,null,null,null,3,{"$f":"-3.141+0.324","v":-2.8170000000000002},0.70899999999999996,1E-3,0.73,0.91800000000000004,{"$f":"N8","v":1.1000000000000001}]
[null,null,null,null,null,null,null,4,{"$f":"-3.141+0.324","v":-2.8170000000000002},0.70899999999999996,1E-3,0.73,0.91800000000000004,1.1000000000000001]
{"$rows_left_out":269}
{"sheet":"Temp","index":7,"n_rows":1,"n_cols":16,"rows_kept":1,"cut":false,"hidden":false,"merged":[]}
[0,0,0,0,0,0,0,0,0,0,0,0,0,0,0,0]