{"text_format":"1","workbook":"xlsx","n_sheets":6,"sheets":["Inputs","Results","Details","Graph Data","Graph_Condition","Graph_Cost"],"not_rendered":{"charts":4,"images":6,"macros":1,"external_links":0,"defined_names":52,"comments":0,"pivot_tables":0},"unopened":[{"sheet":"Graph_Condition","index":4,"reason":"not_a_worksheet"},{"sheet":"Graph_Cost","index":5,"reason":"not_a_worksheet"}],"bounds":{"document_bytes":16777216,"sheet_cells":100000,"rows_first":2000,"rows_last":500,"rows_between":2000,"halvings":0,"cell_chars":16384,"cell_head_chars":4096},"cells_cut":0,"cells_raw":0,"read":"whole","date_system":"1900"}

{"sheet":"Inputs","index":0,"n_rows":160,"n_cols":7,"rows_kept":160,"cut":false,"hidden":false,"merged":[[2,2,2,7],[3,2,3,7],[4,2,4,7],[13,3,13,6],[12,3,12,6],[22,4,22,6],[16,3,16,6],[17,3,17,6],[18,3,18,6],[14,3,14,6],[15,3,15,6]]}
[]
[]
[null,null,"TCRP E-09"]
[null,null,"TRANSIT STATE OF GOOD REPAIR"]
[null,null,"CONDITION-BASED MODEL - INPUTS"]
[]
[null,null,"INSTRUCTIONS"]
[]
[null,null,"Note: this model is used to predict the average annual cost and prioritization values for "]
[null,null,"  transit assets based on asset condition for guideway, facilities, systems and stations."]
[null,null,"  Default deterioration rates have been derived from the FTA TERM model."]
[null,null,"  To use this model please follow these instructions, and see the TCRP E-09 report for more information."]
[null,null,null,"1.  Open the spreadsheet with macros enabled and the Solver installed."]
[null,null,null,"2.  Select an asset type from the dropdown or select \"User-Specified\" if developing a new model."]
[null,null,null,"3.  Enter the asset replacement cost."]
[null,null,null,"4.  Enter the rehabilitation cost (set greater than or equal to replacement cost if rehabilitation is infeasible)."]
[null,null,null,"5.  If desired enter the discount rate (7% by default)."]
[null,null,null,"6.  If desired click the \"Click to Edit Details\" button to edit additional model details."]
[null,null,null,"7.  To view results click the \"Click for Results\" button."]
[]
[null,null,"SUMMARY INPUTS"]
[]
[null,null,"Asset:",null,"User-Specified"]
[]
[null,null,null,null,null,"Override"]
[null,null,null,null,"Default","Value","Notes"]
[]
[null,null,"Unit Agency Replacement Cost ($):",null,1,1700]
[null,null,"Unit Agency Rehabilitation Cost ($):",null,1,629,"Set to greater than or equal to replacement if infeasible"]
[null,null,"Discount Rate %:",null,7.0000000000000007E-2]
{"$rows_left_out":131}
{"sheet":"Results","index":1,"n_rows":214,"n_cols":22,"rows_kept":214,"cut":false,"hidden":false,"merged":[[2,2,2,8],[3,2,3,8],[4,2,4,8],[20,4,20,5],[8,3,8,5],[22,4,22,5],[23,4,23,5],[16,4,16,5],[17,4,17,5],[19,4,19,5],[21,4,21,5]]}
[]
[]
[null,null,"TCRP E-09"]
[null,null,"TRANSIT STATE OF GOOD REPAIR"]
[null,null,"CONDITION-BASED MODEL - RESULTS"]
[]
[null,null,"SUMMARY RESULTS"]
[]
[null,null,"Asset:",{"$f":"Inputs!E23","v":"User-Specified"}]
[null,null,"Average Annual Unit Agency Cost:",null,null,{"$f":"U69","v":93.193548387096726}]
[null,null,"Average Annual Unit User Cost:",null,null,{"$f":"F12-F10","v":16.387096774193537}]
[null,null,"Average Annual Unit Total Cost:",null,null,{"$f":"V69","v":109.58064516129026}]
[]
[]
[null,null,"RESULTS BY CONDITION STATE"]
[]
[null,null,null,null,"Recommended",null,"Unit Agency","Prioritization"]
[null,null,"Condition State",null,"Action",null,"Cost","Index"]
[]
[null,null,{"$f":"Details!C53","v":"5-Excellent"},null,{"$f":"D63","v":"0-Do Minimum"},null,{"$f":"F63","v":69},{"$f":"M63","v":0}]
[null,null,{"$f":"Details!C56","v":"4-Good"},null,{"$f":"D64","v":"0-Do Minimum"},null,{"$f":"F64","v":69},{"$f":"M64","v":0}]
[null,null,{"$f":"Details!C59","v":"3-Adequate"},null,{"$f":"D65","v":"0-Do Minimum"},null,{"$f":"F65","v":88},{"$f":"M65","v":0}]
[null,null,{"$f":"Details!C62","v":"2-Marginal"},null,{"$f":"D66","v":"1-Rehab"},null,{"$f":"F66","v":629},{"$f":"M66","v":3.4402979632757805E-2}]
[null,null,{"$f":"Details!C65","v":"1-Poor"},null,{"$f":"D67","v":"1-Rehab"},null,{"$f":"F67","v":629},{"$f":"M67","v":0.18573975134477952}]
[]
[]
[]
[null,null,"Objective Function"]
[null,null,{"$f":"SUM(Results!D33:E38)","v":23174.89548668791}]
[]
{"$rows_left_out":185}
{"sheet":"Details","index":2,"n_rows":200,"n_cols":12,"rows_kept":200,"cut":false,"hidden":false,"merged":[[2,2,2,12],[3,2,3,12],[4,2,4,12],[29,4,29,5],[50,4,50,5],[50,6,50,11],[29,6,29,11],[8,4,8,5],[8,6,8,11]]}
[]
[]
[null,null,"TCRP E-09"]
[null,null,"TRANSIT STATE OF GOOD REPAIR"]
[null,null,"CONDITION-BASED MODEL - DETAILED INPUTS"]
[]
[null,null,"Defaults Based on Summary Inputs",null,null,null,null,"Asset:",null,null,null,{"$f":"Inputs!$E$23","v":"User-Specified"}]
[]
[null,null,null,null,"Unit Cost",null,"Probability of Transition to State"]
[null,null,"State","Action","Agency","User",{"$f":"C11","v":"5-Excellent"},{"$f":"C14","v":"4-Good"},{"$f":"C17","v":"3-Adequate"},{"$f":"C20","v":"2-Marginal"},{"$f":"C23","v":"1-Poor"},{"$f":"C26","v":"0-Failed"}]
[null,null,"5-Excellent","0-Do Minimum",0,0,{"$f":"VLOOKUP(Inputs!$E$23,Details!$C$73:$G$200,2)","v":0.95},{"$f":"1-G11","v":5.0000000000000044E-2},0,0,0,{"$f":"1-SUM(G11:K11)","v":0}]
[null,null,null,"1-Rehab",{"$f":"IF(Inputs!F29<>\"\",Inputs!F29,Inputs!E29)","v":629},0,0,1,0,0,0,0]
[null,null,null,"2-Replace",{"$f":"IF(Inputs!F28<>\"\",Inputs!F28,Inputs!E28)","v":1700},0,1,0,0,0,0,0]
[null,null,"4-Good","0-Do Minimum",0,0,0,{"$f":"VLOOKUP(Inputs!$E$23,Details!$C$73:$G$200,3)","v":0.92},{"$f":"1-H14","v":7.999999999999996E-2},0,0,0]
[null,null,null,"1-Rehab",{"$f":"E12","v":629},0,0,1,0,0,0,0]
[null,null,null,"2-Replace",{"$f":"E13","v":1700},0,1,0,0,0,0,0]
[null,null,"3-Adequate","0-Do Minimum",0,0,0,0,{"$f":"VLOOKUP(Inputs!$E$23,Details!$C$73:$G$200,4)","v":0.9},{"$f":"1-I17","v":9.9999999999999978E-2},0,0]
[null,null,null,"1-Rehab",{"$f":"E12","v":629},0,0,1,0,0,0,0]
[null,null,null,"2-Replace",{"$f":"E13","v":1700},0,1,0,0,0,0,0]
[null,null,"2-Marginal","0-Do Minimum",{"$f":"E22*0.05","v":85},0,0,0,0,{"$f":"VLOOKUP(Inputs!$E$23,Details!$C$73:$G$200,5)","v":0.85},{"$f":"(1-J20)/2","v":7.5000000000000011E-2},7.4999999999999956E-2]
[null,null,null,"1-Rehab",{"$f":"E12","v":629},0,0,1,0,0,0,0]
[null,null,null,"2-Replace",{"$f":"E13","v":1700},0,1,0,0,0,0,0]
[null,null,"1-Poor","0-Do Minimum",{"$f":"E25*0.1","v":170},0,0,0,0,0,{"$f":"J20","v":0.85},0.15000000000000002]
[null,null,null,"1-Rehab",{"$f":"E12","v":629},0,0,1,0,0,0,0]
[null,null,null,"2-Replace",{"$f":"E13","v":1700},0,1,0,0,0,0,0]
[null,null,"0-Failed","0-Replace",{"$f":"E13*1.5","v":2550},{"$f":"E13*1.5","v":2550},1,0,0,0,0,0]
[]
[null,null,"Override Values",null,null,null,null,"Asset:",null,null,null,{"$f":"Inputs!$E$23","v":"User-Specified"}]
[]
[null,null,null,null,"Unit Cost",null,"Probability of Transition to State"]
{"$rows_left_out":171}
{"sheet":"Graph Data","index":3,"n_rows":139,"n_cols":16,"rows_kept":139,"cut":false,"hidden":false,"merged":[]}
["Transit Asset Rehabilitation/Replacement Condition-Based Model"]
["Graph Data"]
[]
["Model Parameters"]
[null,"Init.",null,"Cost",null,"Probability of Transition to State"]
["State","Quantity","Policy","Agency","User",{"$f":"A7","v":"5-Excellent"},{"$f":"A8","v":"4-Good"},{"$f":"A9","v":"3-Adequate"},{"$f":"A10","v":"2-Marginal"},{"$f":"A11","v":"1-Poor"},{"$f":"A12","v":"0-Failed"}]
[{"$f":"Details!C53","v":"5-Excellent"},1,"0-Do Minimum",{"$f":"IF(OR($C7=Details!$D53,AND($C7=\"Optimal\",Results!$E43=\"Y\")),Details!E53,IF(OR($C7=Details!$D54,AND($C7=\"Optimal\",Results!$E44=\"Y\")),Details!E54,Details!E55))","v":69},{"$f":"IF(OR($C7=Details!$D53,AND($C7=\"Optimal\",Results!$E43=\"Y\")),Details!F53,IF(OR($C7=Details!$D54,AND($C7=\"Optimal\",Results!$E44=\"Y\")),Details!F54,Details!F55))","v":0},{"$f":"IF(OR($C7=Details!$D53,AND($C7=\"Optimal\",Results!$E43=\"Y\")),Details!G53,IF(OR($C7=Details!$D54,AND($C7=\"Optimal\",Results!$E44=\"Y\")),Details!G54,Details!G55))","v":0.95},{"$f":"IF(OR($C7=Details!$D53,AND($C7=\"Optimal\",Results!$E43=\"Y\")),Details!H53,IF(OR($C7=Details!$D54,AND($C7=\"Optimal\",Results!$E44=\"Y\")),Details!H54,Details!H55))","v":0.05},{"$f":"IF(OR($C7=Details!$D53,AND($C7=\"Optimal\",Results!$E43=\"Y\")),Details!I53,IF(OR($C7=Details!$D54,AND($C7=\"Optimal\",Results!$E44=\"Y\")),Details!I54,Details!I55))","v":0},{"$f":"IF(OR($C7=Details!$D53,AND($C7=\"Optimal\",Results!$E43=\"Y\")),Details!J53,IF(OR($C7=Details!$D54,AND($C7=\"Optimal\",Results!$E44=\"Y\")),Details!J54,Details!J55))","v":0},{"$f":"IF(OR($C7=Details!$D53,AND($C7=\"Optimal\",Results!$E43=\"Y\")),Details!K53,IF(OR($C7=Details!$D54,AND($C7=\"Optimal\",Results!$E44=\"Y\")),Details!K54,Details!K55))","v":0},{"$f":"IF(OR($C7=Details!$D53,AND($C7=\"Optimal\",Results!$E43=\"Y\")),Details!L53,IF(OR($C7=Details!$D54,AND($C7=\"Optimal\",Results!$E44=\"Y\")),Details!L54,Details!L55))","v":0}]
[{"$f":"Details!C56","v":"4-Good"},1,"0-Do Minimum",{"$f":"IF(OR($C8=Details!$D56,AND($C8=\"Optimal\",Results!$E46=\"Y\")),Details!E56,IF(OR($C8=Details!$D57,AND($C8=\"Optimal\",Results!$E47=\"Y\")),Details!E57,Details!E58))","v":69},{"$f":"IF(OR($C8=Details!$D56,AND($C8=\"Optimal\",Results!$E46=\"Y\")),Details!F56,IF(OR($C8=Details!$D57,AND($C8=\"Optimal\",Results!$E47=\"Y\")),Details!F57,Details!F58))","v":7},{"$f":"IF(OR($C8=Details!$D56,AND($C8=\"Optimal\",Results!$E46=\"Y\")),Details!G56,IF(OR($C8=Details!$D57,AND($C8=\"Optimal\",Results!$E47=\"Y\")),Details!G57,Details!G58))","v":0},{"$f":"IF(OR($C8=Details!$D56,AND($C8=\"Optimal\",Results!$E46=\"Y\")),Details!H56,IF(OR($C8=Details!$D57,AND($C8=\"Optimal\",Results!$E47=\"Y\")),Details!H57,Details!H58))","v":0.95},{"$f":"IF(OR($C8=Details!$D56,AND($C8=\"Optimal\",Results!$E46=\"Y\")),Details!I56,IF(OR($C8=Details!$D57,AND($C8=\"Optimal\",Results!$E47=\"Y\")),Details!I57,Details!I58))","v":0.05},{"$f":"IF(OR($C8=Details!$D56,AND($C8=\"Optimal\",Results!$E46=\"Y\")),Details!J56,IF(OR($C8=Details!$D57,AND($C8=\"Optimal\",Results!$E47=\"Y\")),Details!J57,Details!J58))","v":0},{"$f":"IF(OR($C8=Details!$D56,AND($C8=\"Optimal\",Results!$E46=\"Y\")),Details!K56,IF(OR($C8=Details!$D57,AND($C8=\"Optimal\",Results!$E47=\"Y\")),Details!K57,Details!K58))","v":0},{"$f":"IF(OR($C8=Details!$D56,AND($C8=\"Optimal\",Results!$E46=\"Y\")),Details!L56,IF(OR($C8=Details!$D57,AND($C8=\"Optimal\",Results!$E47=\"Y\")),Details!L57,Details!L58))","v":0}]
[{"$f":"Details!C59","v":"3-Adequate"},0,"0-Do Minimum",{"$f":"IF(OR($C9=Details!$D59,AND($C9=\"Optimal\",Results!$E49=\"Y\")),Details!E59,IF(OR($C9=Details!$D60,AND($C9=\"Optimal\",Results!$E50=\"Y\")),Details!E60,Details!E61))","v":88},{"$f":"IF(OR($C9=Details!$D59,AND($C9=\"Optimal\",Results!$E49=\"Y\")),Details!F59,IF(OR($C9=Details!$D60,AND($C9=\"Optimal\",Results!$E50=\"Y\")),Details!F60,Details!F61))","v":14},{"$f":"IF(OR($C9=Details!$D59,AND($C9=\"Optimal\",Results!$E49=\"Y\")),Details!G59,IF(OR($C9=Details!$D60,AND($C9=\"Optimal\",Results!$E50=\"Y\")),Details!G60,Details!G61))","v":0},{"$f":"IF(OR($C9=Details!$D59,AND($C9=\"Optimal\",Results!$E49=\"Y\")),Details!H59,IF(OR($C9=Details!$D60,AND($C9=\"Optimal\",Results!$E50=\"Y\")),Details!H60,Details!H61))","v":0},{"$f":"IF(OR($C9=Details!$D59,AND($C9=\"Optimal\",Results!$E49=\"Y\")),Details!I59,IF(OR($C9=Details!$D60,AND($C9=\"Optimal\",Results!$E50=\"Y\")),Details!I60,Details!I61))","v":0.9},{"$f":"IF(OR($C9=Details!$D59,AND($C9=\"Optimal\",Results!$E49=\"Y\")),Details!J59,IF(OR($C9=Details!$D60,AND($C9=\"Optimal\",Results!$E50=\"Y\")),Details!J60,Details!J61))","v":0.1},{"$f":"IF(OR($C9=Details!$D59,AND($C9=\"Optimal\",Results!$E49=\"Y\")),Details!K59,IF(OR($C9=Details!$D60,AND($C9=\"Optimal\",Results!$E50=\"Y\")),Details!K60,Details!K61))","v":0},{"$f":"IF(OR($C9=Details!$D59,AND($C9=\"Optimal\",Results!$E49=\"Y\")),Details!L59,IF(OR($C9=Details!$D60,AND($C9=\"Optimal\",Results!$E50=\"Y\")),Details!L60,Details!L61))","v":0}]
[{"$f":"Details!C62","v":"2-Marginal"},0,"0-Do Minimum",{"$f":"IF(OR($C10=Details!$D62,AND($C10=\"Optimal\",Results!$E52=\"Y\")),Details!E62,IF(OR($C10=Details!$D63,AND($C10=\"Optimal\",Results!$E53=\"Y\")),Details!E63,Details!E64))","v":88},{"$f":"IF(OR($C10=Details!$D62,AND($C10=\"Optimal\",Results!$E52=\"Y\")),Details!F62,IF(OR($C10=Details!$D63,AND($C10=\"Optimal\",Results!$E53=\"Y\")),Details!F63,Details!F64))","v":28},{"$f":"IF(OR($C10=Details!$D62,AND($C10=\"Optimal\",Results!$E52=\"Y\")),Details!G62,IF(OR($C10=Details!$D63,AND($C10=\"Optimal\",Results!$E53=\"Y\")),Details!G63,Details!G64))","v":0},{"$f":"IF(OR($C10=Details!$D62,AND($C10=\"Optimal\",Results!$E52=\"Y\")),Details!H62,IF(OR($C10=Details!$D63,AND($C10=\"Optimal\",Results!$E53=\"Y\")),Details!H63,Details!H64))","v":0},{"$f":"IF(OR($C10=Details!$D62,AND($C10=\"Optimal\",Results!$E52=\"Y\")),Details!I62,IF(OR($C10=Details!$D63,AND($C10=\"Optimal\",Results!$E53=\"Y\")),Details!I63,Details!I64))","v":0},{"$f":"IF(OR($C10=Details!$D62,AND($C10=\"Optimal\",Results!$E52=\"Y\")),Details!J62,IF(OR($C10=Details!$D63,AND($C10=\"Optimal\",Results!$E53=\"Y\")),Details!J63,Details!J64))","v":0.9},{"$f":"IF(OR($C10=Details!$D62,AND($C10=\"Optimal\",Results!$E52=\"Y\")),Details!K62,IF(OR($C10=Details!$D63,AND($C10=\"Optimal\",Results!$E53=\"Y\")),Details!K63,Details!K64))","v":0.05},{"$f":"IF(OR($C10=Details!$D62,AND($C10=\"Optimal\",Results!$E52=\"Y\")),Details!L62,IF(OR($C10=Details!$D63,AND($C10=\"Optimal\",Results!$E53=\"Y\")),Details!L63,Details!L64))","v":4.9999999999999933E-2}]
[{"$f":"Details!C65","v":"1-Poor"},0,"0-Do Minimum",{"$f":"IF(OR($C11=Details!$D65,AND($C11=\"Optimal\",Results!$E55=\"Y\")),Details!E65,IF(OR($C11=Details!$D66,AND($C11=\"Optimal\",Results!$E56=\"Y\")),Details!E66,Details!E67))","v":88},{"$f":"IF(OR($C11=Details!$D65,AND($C11=\"Optimal\",Results!$E55=\"Y\")),Details!F65,IF(OR($C11=Details!$D66,AND($C11=\"Optimal\",Results!$E56=\"Y\")),Details!F66,Details!F67))","v":84},{"$f":"IF(OR($C11=Details!$D65,AND($C11=\"Optimal\",Results!$E55=\"Y\")),Details!G65,IF(OR($C11=Details!$D66,AND($C11=\"Optimal\",Results!$E56=\"Y\")),Details!G66,Details!G67))","v":0},{"$f":"IF(OR($C11=Details!$D65,AND($C11=\"Optimal\",Results!$E55=\"Y\")),Details!H65,IF(OR($C11=Details!$D66,AND($C11=\"Optimal\",Results!$E56=\"Y\")),Details!H66,Details!H67))","v":0},{"$f":"IF(OR($C11=Details!$D65,AND($C11=\"Optimal\",Results!$E55=\"Y\")),Details!I65,IF(OR($C11=Details!$D66,AND($C11=\"Optimal\",Results!$E56=\"Y\")),Details!I66,Details!I67))","v":0},{"$f":"IF(OR($C11=Details!$D65,AND($C11=\"Optimal\",Results!$E55=\"Y\")),Details!J65,IF(OR($C11=Details!$D66,AND($C11=\"Optimal\",Results!$E56=\"Y\")),Details!J66,Details!J67))","v":0},{"$f":"IF(OR($C11=Details!$D65,AND($C11=\"Optimal\",Results!$E55=\"Y\")),Details!K65,IF(OR($C11=Details!$D66,AND($C11=\"Optimal\",Results!$E56=\"Y\")),Details!K66,Details!K67))","v":0.9},{"$f":"IF(OR($C11=Details!$D65,AND($C11=\"Optimal\",Results!$E55=\"Y\")),Details!L65,IF(OR($C11=Details!$D66,AND($C11=\"Optimal\",Results!$E56=\"Y\")),Details!L66,Details!L67))","v":9.9999999999999978E-2}]
[{"$f":"Details!C68","v":"0-Failed"},0,{"$f":"Details!D68","v":"0-Replace"},{"$f":"Details!E68","v":1700},{"$f":"Details!F68","v":484},{"$f":"Details!G68","v":1},{"$f":"Details!H68","v":0},{"$f":"Details!I68","v":0},{"$f":"Details!J68","v":0},{"$f":"Details!K68","v":0},{"$f":"Details!L68","v":0}]
[]
["Predicted Conditions and Costs"]
[null,"Percent of Quantity by State",null,null,null,null,null,"Cost",null,null,"Disc. Cost",null,null,"Cum. Disc Cost"]
["Period",{"$f":"F6","v":"5-Excellent"},"4-Good","3-Adequate","2-Marginal","1-Poor","0-Failed","Agency","User","Total","Agency","User","Total","Agency","User","Total"]
[0,{"$f":"B7/(SUM($B$7:$B$12))","v":0.5},{"$f":"B8/SUM($B$7:$B$12)","v":0.5},{"$f":"B9/SUM($B$7:$B$12)","v":0},{"$f":"B10/SUM($B$7:$B$12)","v":0},{"$f":"B11/SUM($B$7:$B$12)","v":0},{"$f":"B12/SUM($B$7:$B$12)","v":0},{"$f":"($B17*D$7+$C17*D$8+$D17*D$9+$E17*D$10+$F17*D$11+$G17*D$12)*SUM($B$7:$B$12)","v":138},{"$f":"($B17*E$7+$C17*E$8+$D17*E$9+$E17*E$10+$F17*E$11+$G17*E$12)*SUM($B$7:$B$12)","v":7},{"$f":"H17+I17","v":145},{"$f":"H17*Results!$D$74^$A17","v":138},{"$f":"I17*Results!$D$74^$A17","v":7},{"$f":"K17+L17","v":145},{"$f":"K17","v":138},{"$f":"L17","v":7},{"$f":"N17+O17","v":145}]
[{"$f":"A17+1","v":1},{"$f":"$B17*F$7+$C17*F$8+$D17*F$9+$E17*F$10+$F17*F$11+$G17*F$12","v":0.47499999999999998},{"$f":"$B17*G$7+$C17*G$8+$D17*G$9+$E17*G$10+$F17*G$11+$G17*G$12","v":0.5},{"$f":"$B17*H$7+$C17*H$8+$D17*H$9+$E17*H$10+$F17*H$11+$G17*H$12","v":2.5000000000000001E-2},{"$f":"$B17*I$7+$C17*I$8+$D17*I$9+$E17*I$10+$F17*I$11+$G17*I$12","v":0},{"$f":"$B17*J$7+$C17*J$8+$D17*J$9+$E17*J$10+$F17*J$11+$G17*J$12","v":0},{"$f":"$B17*K$7+$C17*K$8+$D17*K$9+$E17*K$10+$F17*K$11+$G17*K$12","v":0},{"$f":"($B18*D$7+$C18*D$8+$D18*D$9+$E18*D$10+$F18*D$11+$G18*D$12)*SUM($B$7:$B$12)","v":138.95000000000002},{"$f":"($B18*E$7+$C18*E$8+$D18*E$9+$E18*E$10+$F18*E$11+$G18*E$12)*SUM($B$7:$B$12)","v":7.7},{"$f":"H18+I18","v":146.65},{"$f":"H18*Results!$D$74^$A18","v":129.85981308411218},{"$f":"I18*Results!$D$74^$A18","v":7.1962616822429908},{"$f":"K18+L18","v":137.05607476635515},{"$f":"N17+K18","v":267.85981308411215},{"$f":"O17+L18","v":14.196261682242991},{"$f":"N18+O18","v":282.05607476635515}]
[{"$f":"A18+1","v":2},0.45124999999999998,0.49874999999999997,4.7500000000000001E-2,2.5000000000000005E-3,0,0,139.89999999999998,8.4525000000000006,{"$f":"H19+I19","v":148.35249999999996},{"$f":"H19*Results!$D$74^$A19","v":122.19407808542229},{"$f":"I19*Results!$D$74^$A19","v":7.3827408507293217},{"$f":"K19+L19","v":129.57681893615162},{"$f":"N18+K19","v":390.05389116953444},{"$f":"O18+L19","v":21.579002532972311},{"$f":"N19+O19","v":411.63289370250675}]
[3,0.42868749999999994,0.49637499999999996,6.7687500000000012E-2,7.000000000000001E-3,1.2500000000000003E-4,1.2499999999999987E-4,141.25062499999999,9.3785000000000007,150.62912499999999,{"$f":"H20*Results!$D$74^$A20","v":115.30258529700589},{"$f":"I20*Results!$D$74^$A20","v":7.6556496384208561},122.95823493542674,505.35647646654036,29.234652171393165,534.59112863793348]
[4,0.40737812499999992,0.49299062499999996,8.5737500000000022E-2,1.3068750000000002E-2,4.6250000000000007E-4,3.6249999999999954E-4,142.95468749999998,10.46296875,153.41765624999996,{"$f":"H21*Results!$D$74^$A21","v":109.0594466335002},{"$f":"I21*Results!$D$74^$A21","v":7.9821487631778805},117.04159539667808,614.41592310004057,37.216800934571047,651.63272403461167]
[5,0.38737171874999987,0.48870999999999992,0.10181328125000001,2.0335625000000003E-2,1.0696875000000003E-3,6.9968749999999925E-4,144.96468718749998,11.688511875,156.65319906249997,{"$f":"H22*Results!$D$74^$A22","v":103.35781847786072},{"$f":"I22*Results!$D$74^$A22","v":8.3337474256057398},111.69156590346645,717.77374157790132,45.550548360176791,763.3242899380781]
[6,0.36870282031249985,0.48364308593749994,0.11606745312500001,2.8483390625000007E-2,1.9795000000000004E-3,1.1237499999999989E-3,147.23382556249999,13.036307765624997,160.27013332812498,{"$f":"H23*Results!$D$74^$A23","v":98.108114746328752},{"$f":"I23*Results!$D$74^$A23","v":8.6866423069030336},106.79475705323179,815.88185632423006,54.237190667079823,870.11904699130992]
[7,0.35139142929687484,0.47789607265624989,0.12864286210937501,3.7241796875000011E-2,3.2057195312500007E-3,1.6221195312499984E-3,149.71678829453123,14.486858368749996,164.20364666328123,{"$f":"H24*Results!$D$74^$A24","v":93.2360912662093},{"$f":"I24*Results!$D$74^$A24","v":9.0216873098576897},102.25777857606698,909.11794759043937,63.258877976937512,972.37682556737684]
[8,0.33544397736328108,0.47157084048828113,0.13967337953125,4.6381903398437507E-2,4.7472374218750016E-3,2.1826617968749981E-3,152.3703385547656,16.020585490273433,168.39092404503901,{"$f":"H25*Results!$D$74^$A25","v":88.680924304530905},{"$f":"I25*Results!$D$74^$A25","v":9.3241266158016902},98.005050920332593,997.79887189497026,72.583004592739201,1070.3818764877094]
[9,0.320854440291992,0.46476449733203112,0.14928458360253907,5.5711051011718755E-2,6.5916088496093773E-3,2.7938189121093724E-3,155.15375254292772,17.618297153832025,172.77204969675975,{"$f":"H26*Results!$D$74^$A26","v":84.393361296649488},{"$f":"I26*Results!$D$74^$A26","v":9.5831863088435014},93.976547605492982,1082.1922331916198,82.166190901582695,1164.3584240932025]
[10,0.30760553718950179,0.45756899448002913,0.15759435010888673,6.5068404270800795E-2,8.7180005152343778E-3,3.4447134355468719E-3,158.02912391276089,19.261545057102829,177.29066896986373,{"$f":"H27*Results!$D$74^$A27","v":80.333993277721646},{"$f":"I27*Results!$D$74^$A27","v":9.7915927951992003},90.125586072920839,1162.5262264693415,91.957783696781888,1254.4840101661234]
[11,0.29566997376557352,0.45007082161550271,0.16471336482199953,7.4320998854609382E-2,1.109962067725098E-2,4.1252202650634727E-3,160.96155991008365,20.932891143850757,181.8944510539344,{"$f":"H28*Results!$D$74^$A28","v":76.471677608589744},{"$f":"I28*Results!$D$74^$A28","v":9.9450657900090089},86.416743398598754,1238.9979040779313,101.9028494867909,1340.9007535647222]
[12,0.28501169534235832,0.4423507792230062,0.17074556942057473,8.3360235451348394E-2,1.3705708552256352E-2,4.8260120104555619E-3,163.91928868822478,22.616098701073742,186.53538738929853,{"$f":"H29*Results!$D$74^$A29","v":72.782124527806417},{"$f":"I29*Results!$D$74^$A29","v":10.041818294645605},82.823942822452025,1311.7800286057377,111.94466778143651,1423.7246963871742]
[13,0.27558712258569595,0.43448382502897381,0.17578855143966757,9.2098768848271034E-2,1.6503149469598136E-2,5.5385826277930487E-3,166.87369438264724,24.296261140815663,191.1699555234629,{"$f":"H30*Results!$D$74^$A30","v":69.246650456615811},{"$f":"I30*Results!$D$74^$A30","v":10.082084590054308},79.328735046670118,1381.0266790623534,122.02675237149082,1503.0534314338443]
{"$rows_left_out":109}