{"text_format":"1","workbook":"xlsx","n_sheets":4,"sheets":["Input","Results","Detailed Input","Calculations"],"not_rendered":{"charts":1,"images":2,"macros":1,"external_links":0,"defined_names":8,"comments":0,"pivot_tables":0},"unopened":[],"bounds":{"document_bytes":16777216,"sheet_cells":100000,"rows_first":2000,"rows_last":500,"rows_between":2000,"halvings":0,"cell_chars":16384,"cell_head_chars":4096},"cells_cut":0,"cells_raw":0,"read":"whole","date_system":"1900"}

{"sheet":"Input","index":0,"n_rows":112,"n_cols":14,"rows_kept":112,"cut":false,"hidden":false,"merged":[[2,2,2,13],[3,2,3,13],[4,2,4,13],[10,3,10,12],[12,3,12,11],[13,3,13,11],[14,3,14,11],[15,3,15,11],[11,3,11,12],[46,2,46,3],[47,2,47,3],[44,2,44,3],[45,2,45,3],[16,3,16,11],[17,3,17,11],[43,2,43,3],[18,3,18,12],[19,3,19,11],[40,8,40,10],[59,2,59,3],[48,2,48,3],[49,2,49,3],[50,2,50,3],[51,2,51,3],[52,2,52,3],[53,2,53,3],[54,2,54,3],[55,2,55,3],[56,2,56,3],[57,2,57,3],[58,2,58,3],[60,2,60,3],[61,2,61,3],[62,2,62,3],[63,2,63,3],[72,2,72,3],[64,2,64,3],[65,2,65,3],[66,2,66,3],[67,2,67,3],[92,2,92,3],[78,2,78,3],[79,2,79,3],[80,2,80,3],[81,2,81,3],[75,2,75,3],[76,2,76,3],[77,2,77,3],[68,2,68,3],[69,2,69,3],[70,2,70,3],[71,2,71,3],[74,2,74,3],[73,2,73,3]]}
[]
[]
[null,null,"TCRP E-09"]
[null,null,"TRANSIT STATE OF GOOD REPAIR"]
[null,null,"PRIORITIZATION MODEL - INPUTS"]
[]
[null,null,"INSTRUCTIONS"]
[]
[null,null,"Note: this model is used to prioritize transit asset replacement and rehabilitation projects."]
[null,null,"  To use this model please follow these instructions, and see the TCRP E-09 report for more information."]
{"$rows_left_out":103}
{"sheet":"Results","index":1,"n_rows":100,"n_cols":12,"rows_kept":100,"cut":false,"hidden":false,"merged":[[2,2,2,12],[3,2,3,12],[4,2,4,12],[26,5,26,6],[26,8,26,11]]}
[]
[]
[null,null,"TCRP E-09"]
[null,null,"TRANSIT STATE OF GOOD REPAIR"]
[null,null,"PRIORITIZATION MODEL - RESULTS"]
[]
[null,null,"SUMMARY RESULTS BY YEAR"]
[]
[null,null,"Year","Budget","Cost","Backlog"]
[]
{"$rows_left_out":91}
{"sheet":"Detailed Input","index":2,"n_rows":132,"n_cols":48,"rows_kept":132,"cut":false,"hidden":false,"merged":[[77,3,79,12],[20,1,23,1],[20,5,22,7],[77,0,80,0],[77,2,80,2],[20,2,22,3],[77,1,80,1],[20,8,22,47],[20,4,23,4],[20,0,23,0]]}
["Transit Asset Rehabilitation/Replacement Prioritization Model"]
["Detailed Input"]
[]
["Budget"]
["Year","Annual Budget"]
[{"$f":"IF(Input!G28<>\"\",Input!G28,Input!F28)","v":2013},{"$f":"IF(Input!J28<>\"\",Input!J28,0)","v":0}]
[{"$f":"1+A6","v":2014},{"$f":"IF(Input!J29<>\"\",Input!J29,0)","v":0}]
[{"$f":"1+A7","v":2015},{"$f":"IF(Input!J30<>\"\",Input!J30,0)","v":0}]
[{"$f":"1+A8","v":2016},{"$f":"IF(Input!J31<>\"\",Input!J31,0)","v":0}]
[2017,{"$f":"IF(Input!J32<>\"\",Input!J32,0)","v":0}]
{"$rows_left_out":123}
{"sheet":"Calculations","index":3,"n_rows":327,"n_cols":139,"rows_kept":327,"cut":false,"hidden":false,"merged":[[5,61,6,61],[5,74,6,74],[5,66,6,66],[5,67,6,67],[5,92,6,92],[5,75,6,75],[5,76,6,76],[5,77,6,77],[5,78,6,78],[5,79,6,79],[5,81,6,81],[5,82,6,82],[5,83,6,83],[5,80,6,80],[5,85,6,85],[5,86,6,86],[5,87,6,87],[5,88,6,88],[5,90,6,90],[5,91,6,91],[5,84,6,84],[315,0,316,0],[5,3,6,3],[5,10,6,10],[5,9,6,9],[4,0,6,0],[4,1,6,1],[5,57,6,57],[5,58,6,58],[5,59,6,59],[5,27,6,27],[5,28,6,28],[5,29,6,29],[5,53,6,53],[5,34,6,34],[310,1,310,3],[306,1,306,3],[307,1,307,3],[308,1,308,3],[309,1,309,3],[315,1,315,4],[5,36,6,36],[5,37,6,37],[5,38,6,38],[5,20,6,20],[5,16,6,16],[5,12,6,12],[5,4,6,4],[5,5,6,5],[5,6,6,6],[300,1,300,3],[5,23,6,23],[5,24,6,24],[5,18,6,18],[5,19,6,19],[296,1,296,3],[292,1,292,3],[5,33,6,33],[5,30,6,30],[5,31,6,31],[5,32,6,32],[5,46,6,46],[5,52,6,52],[4,84,4,92],[5,56,6,56],[4,66,4,74],[5,8,6,8],[5,47,6,47],[5,17,6,17],[5,26,6,26],[5,35,6,35],[5,44,6,44],[5,43,6,43],[5,39,6,39],[5,40,6,40],[5,41,6,41],[5,42,6,42],[5,60,6,60],[5,62,6,62],[5,68,6,68],[5,69,6,69],[5,71,6,71],[5,70,6,70],[5,72,6,72],[5,73,6,73],[295,1,295,3],[288,1,288,3],[289,1,289,3],[290,1,290,3],[291,1,291,3],[312,1,312,3],[297,1,297,3],[298,1,298,3],[299,1,299,3],[311,1,311,3],[301,1,301,3],[302,1,302,3],[303,1,303,3],[304,1,304,3],[305,1,305,3],[285,1,285,3],[286,1,286,3],[287,1,287,3],[280,1,280,3],[281,1,281,3],[282,1,282,3],[283,1,283,3],[293,1,293,3],[294,1,294,3],[276,1,276,3],[277,1,277,3],[278,1,278,3],[279,1,279,3],[272,1,272,3],[273,1,273,3],[274,1,274,3],[275,1,275,3],[284,1,284,3],[262,1,262,3],[263,1,263,3],[5,115,5,124],[5,137,5,138],[259,4,259,13],[268,1,268,3],[269,1,269,3],[270,1,270,3],[271,1,271,3],[264,1,264,3],[265,1,265,3],[266,1,266,3],[267,1,267,3],[5,13,6,13],[5,7,6,7],[5,11,6,11],[5,25,6,25],[5,21,6,21],[5,22,6,22],[5,105,5,114],[5,51,6,51],[5,63,6,63],[5,64,6,64],[5,65,6,65],[259,0,260,0],[259,1,260,3],[5,125,5,134],[4,2,6,2],[5,94,6,94],[5,95,5,104],[5,14,6,14],[5,15,6,15],[261,1,261,3],[4,21,4,29],[4,12,4,20],[4,3,4,11],[4,57,4,65],[4,48,4,56],[4,39,4,47],[5,54,6,54],[5,55,6,55],[4,30,4,38],[5,89,6,89],[4,75,4,83],[5,48,6,48],[5,49,6,49],[5,50,6,50],[5,45,6,45]]}
["Transit Asset Rehabilitation/Replacement Prioritization Model"]
["Calculations"]
[]
["Project Calculations",null,null,null,null,null,null,null,null,null,null,null,null,null,null,null,null,null,null,null,null,null,null,null,null,null,null,null,null,null,null,null,null,null,null,null,null,null,null,null,null,null,null,null,null,null,null,null,null,null,null,null,null,null,null,null,null,null,null,null,null,null,null,null,null,null,null,null,null,null,null,null,null,null,null,null,null,null,null,null,null,null,null,null,null,null,null,null,null,null,null,null,null,null,"Summary Results by Project"]
["Asset ID Code","Number of Assets in Age Group","Row Number for RC and PI Inputs",{"$f":"CONCATENATE(\"Year \",A318)","v":"Year 2013"},null,null,null,null,null,null,null,null,{"$f":"CONCATENATE(\"Year \",A319)","v":"Year 2014"},null,null,null,null,null,null,null,null,{"$f":"CONCATENATE(\"Year \",A320)","v":"Year 2015"},null,null,null,null,null,null,null,null,{"$f":"CONCATENATE(\"Year \",A321)","v":"Year 2016"},null,null,null,null,null,null,null,null,{"$f":"CONCATENATE(\"Year \",A322)","v":"Year 2017"},null,null,null,null,null,null,null,null,{"$f":"CONCATENATE(\"Year \",A323)","v":"Year 2018"},null,null,null,null,null,null,null,null,{"$f":"CONCATENATE(\"Year \",A324)","v":"Year 2019"},null,null,null,null,null,null,null,null,{"$f":"CONCATENATE(\"Year \",A325)","v":"Year 2020"},null,null,null,null,null,null,null,null,{"$f":"CONCATENATE(\"Year \",A326)","v":"Year 2021"},null,null,null,null,null,null,null,null,{"$f":"CONCATENATE(\"Year \",A327)","v":"Year 2022"}]
[null,null,null,"Age","Priority Index","Cost to Replace","Initial Rank","Pipeline (1=Yes)","Prev Repl (1=Yes)","Adjusted Rank","Cum. Cost","Replace (1=Yes)","Age","Priority Index","Cost to Replace","Initial Rank","Pipeline (1=Yes)","Prev Repl (1=Yes)","Adjusted Rank","Cum. Cost","Replace (1=Yes)","Age","Priority Index","Cost to Replace","Initial Rank","Pipeline (1=Yes)","Prev Repl (1=Yes)","Adjusted Rank","Cum. Cost","Replace (1=Yes)","Age","Priority Index","Cost to Replace","Initial Rank","Pipeline (1=Yes)","Prev Repl (1=Yes)","Adjusted Rank","Cum. Cost","Replace (1=Yes)","Age","Priority Index","Cost to Replace","Initial Rank","Pipeline (1=Yes)","Prev Repl (1=Yes)","Adjusted Rank","Cum. Cost","Replace (1=Yes)","Age","Priority Index","Cost to Replace","Initial Rank","Pipeline (1=Yes)","Prev Repl (1=Yes)","Adjusted Rank","Cum. Cost","Replace (1=Yes)","Age","Priority Index","Cost to Replace","Initial Rank","Pipeline (1=Yes)","Prev Repl (1=Yes)","Adjusted Rank","Cum. Cost","Replace (1=Yes)","Age","Priority Index","Cost to Replace","Initial Rank","Pipeline (1=Yes)","Prev Repl (1=Yes)","Adjusted Rank","Cum. Cost","Replace (1=Yes)","Age","Priority Index","Cost to Replace","Initial Rank","Pipeline (1=Yes)","Prev Repl (1=Yes)","Adjusted Rank","Cum. Cost","Replace (1=Yes)","Age","Priority Index","Cost to Replace","Initial Rank","Pipeline (1=Yes)","Prev Repl (1=Yes)","Adjusted Rank","Cum. Cost","Replace (1=Yes)",null,"Asset ID Code","Asset Replacement Costs by Budget Year",null,null,null,null,null,null,null,null,null,"PI by Budget Year",null,null,null,null,null,null,null,null,null,"Rank by Budget Year",null,null,null,null,null,null,null,null,null,"Program Year Calculation",null,null,null,null,null,null,null,null,null,"PI in","Rank in","Total"]
[null,null,null,null,null,null,null,null,null,null,null,null,null,null,null,null,null,null,null,null,null,null,null,null,null,null,null,null,null,null,null,null,null,null,null,null,null,null,null,null,null,null,null,null,null,null,null,null,null,null,null,null,null,null,null,null,null,null,null,null,null,null,null,null,null,null,null,null,null,null,null,null,null,null,null,null,null,null,null,null,null,null,null,null,null,null,null,null,null,null,null,null,null,null,null,{"$f":"+'Detailed Input'!A6","v":2013},{"$f":"1+CR7","v":2014},{"$f":"1+CS7","v":2015},2016,2017,2018,2019,2020,2021,2022,{"$f":"CR7","v":2013},{"$f":"1+DB7","v":2014},{"$f":"1+DC7","v":2015},2016,2017,2018,2019,2020,2021,2022,{"$f":"CR7","v":2013},{"$f":"1+DL7","v":2014},{"$f":"1+DM7","v":2015},2016,2017,2018,2019,2020,2021,2022,{"$f":"DB7","v":2013},{"$f":"1+DV7","v":2014},{"$f":"1+DW7","v":2015},2016,2017,2018,2019,2020,2021,2022,"Prog Yr","Prog Yr","Cost","Benefit"]
[{"$f":"IF('Detailed Input'!A82=\"\",'Detailed Input'!$A$25,'Detailed Input'!A82)","v":"blank"},{"$f":"+'Detailed Input'!C82","v":1},{"$f":"MATCH(A8,'Detailed Input'!$A$25:$A$75,0)","v":1},{"$f":"'Detailed Input'!B82+1","v":1},{"$f":"IF(I8,-999,IF(INDEX(ARRMethod,$C8)=\"Equation\",INDEX(ARRC2,$C8)*D8*D8+INDEX(ARRC1,$C8)*D8+INDEX(ARRC0,$C8),HLOOKUP(D8,ARRPI,1+$C8)))","v":-999},{"$f":"$B8*(INDEX(ARRR0,$C8)+D8*INDEX(ARRR1,$C8))","v":0},{"$f":"RANK(E8,E$8:E$257)","v":1},{"$f":"+'Detailed Input'!D82","v":0},0,{"$f":"IF(H8,0,IF(I8,999,G8))","v":1},{"$f":"SUMIF(J$8:J$257,\"<=\"&J8,F$8:F$257)","v":0},{"$f":"IF(AND(I8=0,OR(H8,AND(K8<=$C$318,F8>0))),1,0)","v":0},{"$f":"IF(L8=1,1,D8+1)","v":2},{"$f":"IF(R8,-999,IF(INDEX(ARRMethod,$C8)=\"Equation\",INDEX(ARRC2,$C8)*M8*M8+INDEX(ARRC1,$C8)*M8+INDEX(ARRC0,$C8),HLOOKUP(M8,ARRPI,1+$C8)))","v":-999},{"$f":"$B8*(INDEX(ARRR0,$C8)+M8*INDEX(ARRR1,$C8))","v":0},{"$f":"RANK(N8,N$8:N$257)","v":1},{"$f":"+'Detailed Input'!E82","v":0},{"$f":"IF(OR(I8,L8),1,0)","v":0},{"$f":"IF(Q8,0,IF(R8,999,P8))","v":1},{"$f":"SUMIF(S$8:S$257,\"<=\"&S8,O$8:O$257)","v":0},{"$f":"IF(AND(R8=0,OR(Q8,AND(T8<=$C$319,O8>0))),1,0)","v":0},{"$f":"IF(U8=1,1,M8+1)","v":3},{"$f":"IF(AA8,-999,IF(INDEX(ARRMethod,$C8)=\"Equation\",INDEX(ARRC2,$C8)*V8*V8+INDEX(ARRC1,$C8)*V8+INDEX(ARRC0,$C8),HLOOKUP(V8,ARRPI,1+$C8)))","v":-999},{"$f":"$B8*(INDEX(ARRR0,$C8)+V8*INDEX(ARRR1,$C8))","v":0},{"$f":"RANK(W8,W$8:W$257)","v":1},{"$f":"+'Detailed Input'!F82","v":0},{"$f":"IF(OR(R8,U8),1,0)","v":0},{"$f":"IF(Z8,0,IF(AA8,999,Y8))","v":1},{"$f":"SUMIF(AB$8:AB$257,\"<=\"&AB8,X$8:X$257)","v":0},{"$f":"IF(AND(AA8=0,OR(Z8,AND(AC8<=$C$320,X8>0))),1,0)","v":0},{"$f":"IF(AD8=1,1,V8+1)","v":4},{"$f":"IF(AJ8,-999,IF(INDEX(ARRMethod,$C8)=\"Equation\",INDEX(ARRC2,$C8)*AE8*AE8+INDEX(ARRC1,$C8)*AE8+INDEX(ARRC0,$C8),HLOOKUP(AE8,ARRPI,1+$C8)))","v":-999},{"$f":"$B8*(INDEX(ARRR0,$C8)+AE8*INDEX(ARRR1,$C8))","v":0},{"$f":"RANK(AF8,AF$8:AF$257)","v":1},{"$f":"+'Detailed Input'!G82","v":0},{"$f":"IF(OR(AA8,AD8),1,0)","v":0},{"$f":"IF(AI8,0,IF(AJ8,999,AH8))","v":1},{"$f":"SUMIF(AK$8:AK$257,\"<=\"&AK8,AG$8:AG$257)","v":0},{"$f":"IF(AND(AJ8=0,OR(AI8,AND(AL8<=$C$321,AG8>0))),1,0)","v":0},{"$f":"IF(AM8=1,1,AE8+1)","v":5},{"$f":"IF(AS8,-999,IF(INDEX(ARRMethod,$C8)=\"Equation\",INDEX(ARRC2,$C8)*AN8*AN8+INDEX(ARRC1,$C8)*AN8+INDEX(ARRC0,$C8),HLOOKUP(AN8,ARRPI,1+$C8)))","v":-999},{"$f":"$B8*(INDEX(ARRR0,$C8)+AN8*INDEX(ARRR1,$C8))","v":0},{"$f":"RANK(AO8,AO$8:AO$257)","v":1},{"$f":"+'Detailed Input'!H82","v":0},{"$f":"IF(OR(AJ8,AM8),1,0)","v":0},{"$f":"IF(AR8,0,IF(AS8,999,AQ8))","v":1},{"$f":"SUMIF(AT$8:AT$257,\"<=\"&AT8,AP$8:AP$257)","v":0},{"$f":"IF(AND(AS8=0,OR(AR8,AND(AU8<=$C$322,AP8>0))),1,0)","v":0},{"$f":"IF(AV8=1,1,AN8+1)","v":6},{"$f":"IF(BB8,-999,IF(INDEX(ARRMethod,$C8)=\"Equation\",INDEX(ARRC2,$C8)*AW8*AW8+INDEX(ARRC1,$C8)*AW8+INDEX(ARRC0,$C8),HLOOKUP(AW8,ARRPI,1+$C8)))","v":-999},{"$f":"$B8*(INDEX(ARRR0,$C8)+AW8*INDEX(ARRR1,$C8))","v":0},{"$f":"RANK(AX8,AX$8:AX$257)","v":1},{"$f":"+'Detailed Input'!I82","v":0},{"$f":"IF(OR(AS8,AV8),1,0)","v":0},{"$f":"IF(BA8,0,IF(BB8,999,AZ8))","v":1},{"$f":"SUMIF(BC$8:BC$257,\"<=\"&BC8,AY$8:AY$257)","v":0},{"$f":"IF(AND(BB8=0,OR(BA8,AND(BD8<=$C$323,AY8>0))),1,0)","v":0},{"$f":"IF(BE8=1,1,AW8+1)","v":7},{"$f":"IF(BK8,-999,IF(INDEX(ARRMethod,$C8)=\"Equation\",INDEX(ARRC2,$C8)*BF8*BF8+INDEX(ARRC1,$C8)*BF8+INDEX(ARRC0,$C8),HLOOKUP(BF8,ARRPI,1+$C8)))","v":-999},{"$f":"$B8*(INDEX(ARRR0,$C8)+BF8*INDEX(ARRR1,$C8))","v":0},{"$f":"RANK(BG8,BG$8:BG$257)","v":1},{"$f":"+'Detailed Input'!J82","v":0},{"$f":"IF(OR(BB8,BE8),1,0)","v":0},{"$f":"IF(BJ8,0,IF(BK8,999,BI8))","v":1},{"$f":"SUMIF(BL$8:BL$257,\"<=\"&BL8,BH$8:BH$257)","v":0},{"$f":"IF(AND(BK8=0,OR(BJ8,AND(BM8<=$C$324,BH8>0))),1,0)","v":0},{"$f":"IF(BN8=1,1,BF8+1)","v":8},{"$f":"IF(BT8,-999,IF(INDEX(ARRMethod,$C8)=\"Equation\",INDEX(ARRC2,$C8)*BO8*BO8+INDEX(ARRC1,$C8)*BO8+INDEX(ARRC0,$C8),HLOOKUP(BO8,ARRPI,1+$C8)))","v":-999},{"$f":"$B8*(INDEX(ARRR0,$C8)+BO8*INDEX(ARRR1,$C8))","v":0},{"$f":"RANK(BP8,BP$8:BP$257)","v":1},{"$f":"+'Detailed Input'!K82","v":0},{"$f":"IF(OR(BK8,BN8),1,0)","v":0},{"$f":"IF(BS8,0,IF(BT8,999,BR8))","v":1},{"$f":"SUMIF(BU$8:BU$257,\"<=\"&BU8,BQ$8:BQ$257)","v":0},{"$f":"IF(AND(BT8=0,OR(BS8,AND(BV8<=$C$325,BQ8>0))),1,0)","v":0},{"$f":"IF(BW8=1,1,BO8+1)","v":9},{"$f":"IF(CC8,-999,IF(INDEX(ARRMethod,$C8)=\"Equation\",INDEX(ARRC2,$C8)*BX8*BX8+INDEX(ARRC1,$C8)*BX8+INDEX(ARRC0,$C8),HLOOKUP(BX8,ARRPI,1+$C8)))","v":-999},{"$f":"$B8*(INDEX(ARRR0,$C8)+BX8*INDEX(ARRR1,$C8))","v":0},{"$f":"RANK(BY8,BY$8:BY$257)","v":1},{"$f":"+'Detailed Input'!L82","v":0},{"$f":"IF(OR(BT8,BW8),1,0)","v":0},{"$f":"IF(CB8,0,IF(CC8,999,CA8))","v":1},{"$f":"SUMIF(CD$8:CD$257,\"<=\"&CD8,BZ$8:BZ$257)","v":0},{"$f":"IF(AND(CC8=0,OR(CB8,AND(CE8<=$C$326,BZ8>0))),1,0)","v":0},{"$f":"IF(CF8=1,1,BX8+1)","v":10},{"$f":"IF(CL8,-999,IF(INDEX(ARRMethod,$C8)=\"Equation\",INDEX(ARRC2,$C8)*CG8*CG8+INDEX(ARRC1,$C8)*CG8+INDEX(ARRC0,$C8),HLOOKUP(CG8,ARRPI,1+$C8)))","v":-999},{"$f":"$B8*(INDEX(ARRR0,$C8)+CG8*INDEX(ARRR1,$C8))","v":0},{"$f":"RANK(CH8,CH$8:CH$257)","v":1},{"$f":"+'Detailed Input'!M82","v":0},{"$f":"IF(OR(CC8,CF8),1,0)","v":0},{"$f":"IF(CK8,0,IF(CL8,999,CJ8))","v":1},{"$f":"SUMIF(CM$8:CM$257,\"<=\"&CM8,CI$8:CI$257)","v":0},{"$f":"IF(AND(CL8=0,OR(CK8,AND(CN8<=$C$327,CI8>0))),1,0)","v":0},null,{"$f":"+A8","v":"blank"},{"$f":"F8*L8","v":0},{"$f":"O8*U8","v":0},{"$f":"X8*AD8","v":0},{"$f":"AG8*AM8","v":0},{"$f":"AP8*AV8","v":0},{"$f":"AY8*BE8","v":0},{"$f":"BH8*BN8","v":0},{"$f":"BQ8*BW8","v":0},{"$f":"BZ8*CF8","v":0},{"$f":"CI8*CO8","v":0},{"$f":"E8","v":-999},{"$f":"N8","v":-999},{"$f":"W8","v":-999},{"$f":"AF8","v":-999},{"$f":"AO8","v":-999},{"$f":"AX8","v":-999},{"$f":"BG8","v":-999},{"$f":"BP8","v":-999},{"$f":"BY8","v":-999},{"$f":"CH8","v":-999},{"$f":"G8","v":1},{"$f":"P8","v":1},{"$f":"Y8","v":1},{"$f":"AH8","v":1},{"$f":"AQ8","v":1},{"$f":"AZ8","v":1},{"$f":"BI8","v":1},{"$f":"BR8","v":1},{"$f":"CA8","v":1},{"$f":"CJ8","v":1},{"$f":"IF(CR8>0,DV$7,0)","v":0},{"$f":"MAX(DV8,IF(CS8>0,DW$7,0))","v":0},{"$f":"MAX(DW8,IF(CT8>0,DX$7,0))","v":0},{"$f":"MAX(DX8,IF(CU8>0,DY$7,0))","v":0},{"$f":"MAX(DY8,IF(CV8>0,DZ$7,0))","v":0},{"$f":"MAX(DZ8,IF(CW8>0,EA$7,0))","v":0},{"$f":"MAX(EA8,IF(CX8>0,EB$7,0))","v":0},{"$f":"MAX(EB8,IF(CY8>0,EC$7,0))","v":0},{"$f":"MAX(EC8,IF(CZ8>0,ED$7,0))","v":0},{"$f":"MAX(ED8,IF(DA8>0,EE$7,0))","v":0},{"$f":"IF(EE8>='Detailed Input'!$A$6,INDEX(DB8:DK8,EE8-'Detailed Input'!$A$6+1),\"\")","v":""},{"$f":"IF(EE8>='Detailed Input'!$A$6,INDEX(DL8:DU8,EE8-'Detailed Input'!$A$6+1),\"\")","v":""},{"$f":"SUM(CR8:DA8)","v":0},{"$f":"SUMPRODUCT(CR8:DA8,DB8:DK8)","v":0}]
[{"$f":"IF('Detailed Input'!A83=\"\",'Detailed Input'!$A$25,'Detailed Input'!A83)","v":"blank"},{"$f":"+'Detailed Input'!C83","v":1},{"$f":"MATCH(A9,'Detailed Input'!$A$25:$A$75,0)","v":1},{"$f":"'Detailed Input'!B83+1","v":1},-999,0,{"$f":"RANK(E9,E$8:E$257)","v":1},{"$f":"+'Detailed Input'!D83","v":0},0,{"$f":"IF(H9,0,IF(I9,999,G9))","v":1},0,0,2,-999,0,{"$f":"RANK(N9,N$8:N$257)","v":1},{"$f":"+'Detailed Input'!E83","v":0},{"$f":"IF(OR(I9,L9),1,0)","v":0},{"$f":"IF(Q9,0,IF(R9,999,P9))","v":1},0,0,3,-999,0,{"$f":"RANK(W9,W$8:W$257)","v":1},{"$f":"+'Detailed Input'!F83","v":0},{"$f":"IF(OR(R9,U9),1,0)","v":0},{"$f":"IF(Z9,0,IF(AA9,999,Y9))","v":1},0,0,4,-999,0,{"$f":"RANK(AF9,AF$8:AF$257)","v":1},{"$f":"+'Detailed Input'!G83","v":0},{"$f":"IF(OR(AA9,AD9),1,0)","v":0},{"$f":"IF(AI9,0,IF(AJ9,999,AH9))","v":1},0,0,5,-999,0,{"$f":"RANK(AO9,AO$8:AO$257)","v":1},{"$f":"+'Detailed Input'!H83","v":0},{"$f":"IF(OR(AJ9,AM9),1,0)","v":0},{"$f":"IF(AR9,0,IF(AS9,999,AQ9))","v":1},0,0,6,-999,0,{"$f":"RANK(AX9,AX$8:AX$257)","v":1},{"$f":"+'Detailed Input'!I83","v":0},{"$f":"IF(OR(AS9,AV9),1,0)","v":0},{"$f":"IF(BA9,0,IF(BB9,999,AZ9))","v":1},0,0,7,-999,0,{"$f":"RANK(BG9,BG$8:BG$257)","v":1},{"$f":"+'Detailed Input'!J83","v":0},{"$f":"IF(OR(BB9,BE9),1,0)","v":0},{"$f":"IF(BJ9,0,IF(BK9,999,BI9))","v":1},0,0,8,-999,0,{"$f":"RANK(BP9,BP$8:BP$257)","v":1},{"$f":"+'Detailed Input'!K83","v":0},{"$f":"IF(OR(BK9,BN9),1,0)","v":0},{"$f":"IF(BS9,0,IF(BT9,999,BR9))","v":1},0,0,9,-999,0,{"$f":"RANK(BY9,BY$8:BY$257)","v":1},{"$f":"+'Detailed Input'!L83","v":0},{"$f":"IF(OR(BT9,BW9),1,0)","v":0},{"$f":"IF(CB9,0,IF(CC9,999,CA9))","v":1},0,0,10,-999,0,{"$f":"RANK(CH9,CH$8:CH$257)","v":1},{"$f":"+'Detailed Input'!M83","v":0},{"$f":"IF(OR(CC9,CF9),1,0)","v":0},{"$f":"IF(CK9,0,IF(CL9,999,CJ9))","v":1},0,0,null,{"$f":"+A9","v":"blank"},0,0,0,0,0,0,0,0,0,0,{"$f":"E9","v":-999},{"$f":"N9","v":-999},{"$f":"W9","v":-999},{"$f":"AF9","v":-999},{"$f":"AO9","v":-999},{"$f":"AX9","v":-999},{"$f":"BG9","v":-999},{"$f":"BP9","v":-999},{"$f":"BY9","v":-999},{"$f":"CH9","v":-999},{"$f":"G9","v":1},{"$f":"P9","v":1},{"$f":"Y9","v":1},{"$f":"AH9","v":1},{"$f":"AQ9","v":1},{"$f":"AZ9","v":1},{"$f":"BI9","v":1},{"$f":"BR9","v":1},{"$f":"CA9","v":1},{"$f":"CJ9","v":1},{"$f":"IF(CR9>0,DV$7,0)","v":0},{"$f":"MAX(DV9,IF(CS9>0,DW$7,0))","v":0},0,0,0,0,0,0,0,0,{"$f":"IF(EE9>='Detailed Input'!$A$6,INDEX(DB9:DK9,EE9-'Detailed Input'!$A$6+1),\"\")","v":""},{"$f":"IF(EE9>='Detailed Input'!$A$6,INDEX(DL9:DU9,EE9-'Detailed Input'!$A$6+1),\"\")","v":""},{"$f":"SUM(CR9:DA9)","v":0},{"$f":"SUMPRODUCT(CR9:DA9,DB9:DK9)","v":0}]
[{"$f":"IF('Detailed Input'!A84=\"\",'Detailed Input'!$A$25,'Detailed Input'!A84)","v":"blank"},{"$f":"+'Detailed Input'!C84","v":1},{"$f":"MATCH(A10,'Detailed Input'!$A$25:$A$75,0)","v":1},{"$f":"'Detailed Input'!B84+1","v":1},-999,0,{"$f":"RANK(E10,E$8:E$257)","v":1},{"$f":"+'Detailed Input'!D84","v":0},0,1,0,0,2,-999,0,{"$f":"RANK(N10,N$8:N$257)","v":1},{"$f":"+'Detailed Input'!E84","v":0},0,1,0,0,3,-999,0,{"$f":"RANK(W10,W$8:W$257)","v":1},{"$f":"+'Detailed Input'!F84","v":0},0,1,0,0,4,-999,0,{"$f":"RANK(AF10,AF$8:AF$257)","v":1},{"$f":"+'Detailed Input'!G84","v":0},0,1,0,0,5,-999,0,{"$f":"RANK(AO10,AO$8:AO$257)","v":1},{"$f":"+'Detailed Input'!H84","v":0},0,1,0,0,6,-999,0,{"$f":"RANK(AX10,AX$8:AX$257)","v":1},{"$f":"+'Detailed Input'!I84","v":0},0,1,0,0,7,-999,0,{"$f":"RANK(BG10,BG$8:BG$257)","v":1},{"$f":"+'Detailed Input'!J84","v":0},0,1,0,0,8,-999,0,{"$f":"RANK(BP10,BP$8:BP$257)","v":1},{"$f":"+'Detailed Input'!K84","v":0},0,1,0,0,9,-999,0,{"$f":"RANK(BY10,BY$8:BY$257)","v":1},{"$f":"+'Detailed Input'!L84","v":0},0,1,0,0,10,-999,0,{"$f":"RANK(CH10,CH$8:CH$257)","v":1},{"$f":"+'Detailed Input'!M84","v":0},0,1,0,0,null,"blank",0,0,0,0,0,0,0,0,0,0,-999,-999,-999,-999,{"$f":"AO10","v":-999},-999,-999,-999,-999,-999,1,1,1,1,1,1,1,1,1,1,0,0,0,0,0,0,0,0,0,0,{"$f":"IF(EE10>='Detailed Input'!$A$6,INDEX(DB10:DK10,EE10-'Detailed Input'!$A$6+1),\"\")","v":""},{"$f":"IF(EE10>='Detailed Input'!$A$6,INDEX(DL10:DU10,EE10-'Detailed Input'!$A$6+1),\"\")","v":""},0,0]
{"$rows_left_out":317}